{"text_format":"1","workbook":"xlsx","n_sheets":15,"sheets":["0. Intro","1. Start","2. System Charts","3. Hardware Options","4. Custom Fabric","_ReferenceData","_Chart Formatting_WIP","_SpringData_L0","_SpringData_L1","_SpringData_L2","_FabricList","_Dictionary","_Parameters","_LiveData","_Notes"],"not_rendered":{"charts":2,"images":8,"macros":1,"external_links":0,"defined_names":401,"comments":8,"pivot_tables":0},"unopened":[],"bounds":{"document_bytes":16777216,"sheet_cells":100000,"rows_first":2000,"rows_last":500,"rows_between":2000,"halvings":0,"cell_chars":16384,"cell_head_chars":4096},"cells_cut":0,"cells_raw":0,"read":"whole","date_system":"1900"}

{"sheet":"0. Intro","index":0,"n_rows":26,"n_cols":20,"rows_kept":26,"cut":false,"hidden":false,"merged":[[22,19,24,32],[3,1,5,16]]}
[]
[null,"If the eBOM opens to this page first, it means Excel Macro's have not been enabled. "]
[]
[null,"Excel Macros provide improved functionality for this file, and it will not work properly unless they are enabled. "]
[]
[]
{"$rows_left_out":21}
{"sheet":"1. Start","index":1,"n_rows":51,"n_cols":22,"rows_kept":51,"cut":false,"hidden":false,"merged":[[27,2,27,11],[46,2,46,11],[3,6,3,8],[39,10,40,11],[6,2,6,8],[6,10,6,11],[12,10,13,10],[45,2,45,11],[31,10,32,10],[34,10,35,10],[4,6,4,8],[24,2,25,4]]}
[null,null,null,null,null,null,null,null,null,null,null,"Release"]
[]
[null,null,null,null,{"$f":"z_Title","v":"Roller Shade Calculator"},null,null,null,null,null,null,null,null,null,null,null,"UnitStorage:","Metric"]
[null,null,null,null,{"$f":"z_LastUpdate&\": \"&\"18-Apr-24\"","v":"Release: 18-Apr-24"},null,"NOTE: Macros MUST be enabled via the bar above when file opens."]
[null,null,null,null,null,null,{"$f":"IFERROR(IF(CurrentVersionReturn=TRUE(),\"Current Version.\",\"Please download the latest version from the Rollease Acmeda Document Library \"),\"\")","v":"Current Version."}]
[]
{"$rows_left_out":46}
{"sheet":"2. System Charts","index":2,"n_rows":32,"n_cols":60,"rows_kept":32,"cut":false,"hidden":false,"merged":[[2,2,2,5],[11,36,26,36],[11,9,26,9],[9,3,10,3],[9,5,10,5],[9,4,10,4],[9,10,9,32],[2,14,3,18],[9,37,9,59],[2,11,3,13],[4,11,4,13],[5,11,5,13],[6,11,6,13],[7,11,7,13],[8,38,8,58],[8,11,8,31]]}
[]
[]
[null,null,{"$f":"z_TableSetup","v":"TABLE SETUP"},null,null,null,null,null,null,null,null,{"$f":"z_Fabric","v":"Fabric"},null,null,{"$f":"IF(i_Fabric=\"\",z_SelectFabric,i_Fabric)","v":"Select Fabric"},null,null,null,null,{"$f":"IFERROR(z_Density&\": \"&ROUND(INDEX(INDIRECT(\"T_Fabric[Density_\"&i_Units&\"]\"),MATCH(i_Fabric,T_Fabric[Description],0)),IF(i_Units=\"Metric\",0,2))&\" \"&INDEX(INDIRECT(\"T_Units[\"&i_Units&\"]\"),MATCH(\"g/m²\",T_Units[Metric],0)),\"\")","v":""}]
[null,null,null,{"$f":"z_WidthStart","v":"Width Start"},0.6,"m",null,null,null,null,null,null,null,null,null,null,null,null,null,{"$f":"IFERROR(z_Thickness&\": \"&ROUND(INDEX(INDIRECT(\"T_Fabric[Thickness_\"&i_Units&\"]\"),MATCH(i_Fabric,T_Fabric[Description],0)),IF(i_Units=\"Metric\",2,3))&\" \"&INDEX(INDIRECT(\"T_Units[\"&i_Units&\"]\"),MATCH(\"mm\",T_Units[Metric],0)),\"\")","v":""}]
[null,null,null,{"$f":"z_WidthIncrement","v":"Width Increment"},0.2,"m",null,null,null,null,null,{"$f":"z_Tube","v":"Tube"},null,null,{"$f":"IF(i_Tube=\"\",z_SelectTube,i_Tube)","v":"Select Tube"}]
[null,null,null,{"$f":"z_DropStart","v":"Drop Start"},0.6,"m",null,null,null,null,null,{"$f":"z_WeightBar","v":"Weight Bar"},null,null,{"$f":"IF(i_wb=\"\",z_Selectwb,i_wb)","v":"D30 Medium Bottom Rail"}]
{"$rows_left_out":27}
{"sheet":"3. Hardware Options","index":3,"n_rows":46,"n_cols":20,"rows_kept":46,"cut":false,"hidden":false,"merged":[]}
[null,null,null,null,"HIDE",null,null,null,null,"HIDE",null,null,null,null,"HIDE",null,null,null,null,"HIDE"]
[null,{"$f":"z_ProductOptionsText1","v":"Put an 'X' in the hide column to remove from dropdown options."}]
[]
[null,{"$f":"z_Tube","v":"Tube"},{"$f":"z_Show","v":"Show"},{"$f":"z_Hide","v":"Hide"},null,null,{"$f":"z_WeightBar","v":"Weight Bar"},{"$f":"z_Show","v":"Show"},{"$f":"z_Hide","v":"Hide"},null,null,{"$f":"z_Control","v":"Control"},{"$f":"z_Show","v":"Show"},{"$f":"z_Hide","v":"Hide"},null,null,{"$f":"z_TopHardware","v":"Top Hardware"},{"$f":"z_Show","v":"Show"},{"$f":"z_Hide","v":"Hide"}]
[null,{"$f":"T_Tubes[Description]","v":"1\""},{"$f":"IF(D5<>\"\",\"\",\"X\")","v":"X"},null,{"$f":"IF(D5<>\"\",\"Hide\",\"Show\")","v":"Show"},null,{"$f":"T_WeightBars[Description]","v":"_Custom Weight Bar Data"},{"$f":"IF(I5<>\"\",\"\",\"X\")","v":"X"},null,{"$f":"IF(I5<>\"\",\"Hide\",\"Show\")","v":"Show"},null,{"$f":"T_Controls[Description]","v":"G200"},{"$f":"IF(N5<>\"\",\"\",\"X\")","v":"X"},null,{"$f":"IF(N5<>\"\",\"Hide\",\"Show\")","v":"Show"},null,{"$f":"T_Brackets[Description]","v":"SLxx650xx Skyline Bracket | 32mm | 1-1/4\""},{"$f":"IF(S5<>\"\",\"\",\"X\")","v":"X"},null,{"$f":"IF(S5<>\"\",\"Hide\",\"Show\")","v":"Show"}]
[null,"1-1/8\"",{"$f":"IF(D6<>\"\",\"\",\"X\")","v":"X"},null,{"$f":"IF(D6<>\"\",\"Hide\",\"Show\")","v":"Show"},null,"Internal Hem Bar",{"$f":"IF(I6<>\"\",\"\",\"X\")","v":"X"},null,{"$f":"IF(I6<>\"\",\"Hide\",\"Show\")","v":"Show"},null,"G400",{"$f":"IF(N6<>\"\",\"\",\"X\")","v":"X"},null,{"$f":"IF(N6<>\"\",\"Hide\",\"Show\")","v":"Show"},null,"SLxx660xx Skyline Bracket | 38mm | 1-1/2\"","X",null,{"$f":"IF(S6<>\"\",\"Hide\",\"Show\")","v":"Show"}]
{"$rows_left_out":41}
{"sheet":"4. Custom Fabric","index":4,"n_rows":18,"n_cols":7,"rows_kept":18,"cut":false,"hidden":false,"merged":[[1,3,1,4],[1,5,1,6],[1,2,2,2]]}
[]
[null,null,"Fabric Description","METRIC",null,"IMPERIAL"]
[null,null,null,"Thickness (mm)","Density (gsm)","Thickness (in)","Density (oz/yd²)"]
[null,1]
[null,2]
[null,3]
{"$rows_left_out":13}
{"sheet":"_ReferenceData","index":5,"n_rows":283,"n_cols":48,"rows_kept":283,"cut":false,"hidden":true,"merged":[[11,41,11,45],[41,2,41,5],[151,2,151,5],[138,2,138,5],[73,2,73,5],[93,2,93,5],[127,2,127,5],[264,2,264,4],[254,2,254,4],[8,16,8,17],[2,2,2,5],[3,2,3,5],[4,2,4,5],[6,2,6,5],[5,2,5,5],[251,3,251,4],[250,3,250,4],[229,2,229,3],[202,2,202,5]]}
[]
[]
[null,null,"Material Data",null,null,null,"kg/m³","GPa",null,null,null,null,null,null,null,null,null,null,null,null,null,null,null,null,null,null,null,null,null,null,null,null,null,null,null,null,"Include Control Check if selected",null,{"$f":"i_ControlType","v":0}]
[null,null,"Material",null,null,null,"Density","Young's Modulus"]
[null,null,"Aluminium",null,null,null,2710,{"$f":"68*10^9","v":68000000000},null,null,null,null,null,null,null,null,null,null,null,null,null,null,{"$f":"INDEX(Tube_Description,MATCH(TRUE,$S$15:$S$37<Deflection_limit*$S$7,0))","v":{"$error":"#N/A"}},null,null,null,null,null,null,null,null,null,null,null,null,null,null,null,{"$f":"IF(i_ControlType<>\"\",MATCH(i_ControlType,$E$96:$E$125,0),\"\")","v":""}]
[null,null,"Steel",null,null,null,7860,{"$f":"200*10^9","v":200000000000},null,null,null,null,null,null,null,null,null,null,"rec start factor"]
{"$rows_left_out":278}
{"sheet":"_Chart Formatting_WIP","index":6,"n_rows":27,"n_cols":80,"rows_kept":27,"cut":false,"hidden":true,"merged":[]}
[]
[]
[]
[]
[]
[]
{"$rows_left_out":22}
{"sheet":"_SpringData_L0","index":7,"n_rows":110,"n_cols":27,"rows_kept":110,"cut":false,"hidden":true,"merged":[]}
[null,null,null,"Ideal Rate",{"$f":"ESA_IdealSpringRate","v":{"$error":"#DIV/0!"}},null,null,"RAW SPRING DATA"]
[null,null,null,null,null,null,"Check Ideal Rate is above LL",null,null,null,null,null,null,null,{"$f":"MAX(O4:O110)","v":1.5719062500000005}]
[null,null,null,"LL Spring Rate","UL Spring Rate","Local Switch","Booster Rate Check","Options","Booster","Wire ø (mm)","mean coil ID","Position","Number of coils","Max Turns","T_Max","Nom. Spring Rate","Bending stress (Mpa)","Min blind width w idler(TBC) mm","Min. Width (m)",38.6,"Rate Var %","Spring Flag","mod of Elast",207000,null,"internal coil ID",19]
[null,null,null,{"$f":"IF(input_BlindWidth=0.4,B8,B7)","v":1.1510032737375672E-3},2.6386167577458841E-3,{"$f":"IF(G4<>\"\",IF(islandFilter_option=\"yes\",IF(AND(MATCH(I4,list_boosterDescription,0)>=MATCH(islandfilter_colMax,list_boosterIndex,0),MATCH(I4,list_boosterDescription,0)>=MATCH(islandfilter_rowMax,list_boosterIndex,0)),\"y\",\"\"),\"y\"),\"\")","v":{"$error":"#DIV/0!"}},{"$f":"IF(P4<>\"\",IF(OR(input_idealSpringRate>_SpringData_L0!E4,input_idealSpringRate<_SpringData_L0!$D$4),\"n\",IF(AND(input_idealSpringRate<_SpringData_L0!E4,input_idealSpringRate>_SpringData_L0!D4*$B$12),\"y\",\"n\")),\"\")","v":{"$error":"#DIV/0!"}},205,"Micro",0.8,{"$f":"J4+$AA$3","v":19.8},5,167.5,35,{"$f":"IFERROR(($X$3*$J4^4*$N4)/(10.8*$M4*$K4*1000),\"\")","v":8.2850394492185564E-2},{"$f":"IFERROR(O4/N4,\"\")","v":2.3671541283481591E-3},{"$f":"32000*$O4/(PI()*$J4^3)","v":1648.2562275681087},{"$f":"_xlfn.XLOOKUP(I4,T_minESABlindWidth[Description],INDIRECT(_xlfn.CONCAT(\"T_minESABlindWidth[\",i_idler,\"]\")))","v":400},{"$f":"R4*0.001","v":0.4},null,{"$f":"IFERROR(ABS((P4-$E$1)/$E$1),\"\")","v":""},"y"]
[null,null,null,{"$f":"IF(LEN(E4)>0,E4*$B$11,\"\")","v":9.2351586521105934E-4},{"$f":"IF(P5<>\"\",IF(AND(P5<>\"\",P5=\"\"),P6*2,AVERAGE(P5:P6)),\"\")","v":3.4028716718915875E-3},{"$error":"#DIV/0!"},{"$f":"IF(P5<>\"\",IF(OR(input_idealSpringRate>_SpringData_L0!E5,input_idealSpringRate<_SpringData_L0!$D$4),\"n\",IF(AND(input_idealSpringRate<_SpringData_L0!E5,input_idealSpringRate>_SpringData_L0!D5*$B$12),\"y\",\"n\")),\"\")","v":{"$error":"#DIV/0!"}},204,"Micro",0.8,19.8,4,136.25,35,{"$f":"IFERROR(($X$3*$J5^4*$N5)/(10.8*$M5*$K5*1000),\"\")","v":0.10185277855002631},{"$f":"IFERROR(O5/N5,\"\")","v":2.9100793871436087E-3},2026.2966467351064,{"$f":"_xlfn.XLOOKUP(I5,T_minESABlindWidth[Description],INDIRECT(_xlfn.CONCAT(\"T_minESABlindWidth[\",i_idler,\"]\")))","v":400},0.4,null,"","y"]
["LOWER LIMITS",null,null,1.1910050851620555E-3,4.0494401654542862E-3,{"$error":"#DIV/0!"},{"$f":"IF(P6<>\"\",IF(OR(input_idealSpringRate>_SpringData_L0!E6,input_idealSpringRate<_SpringData_L0!$D$4),\"n\",IF(AND(input_idealSpringRate<_SpringData_L0!E6,input_idealSpringRate>_SpringData_L0!D6*$B$12),\"y\",\"n\")),\"\")","v":{"$error":"#DIV/0!"}},107,"Small",1,20,13,246,54,0.21036585365853658,3.8956639566395663E-3,2142.7689899201519,{"$f":"_xlfn.XLOOKUP(I6,T_minESABlindWidth[Description],INDIRECT(_xlfn.CONCAT(\"T_minESABlindWidth[\",i_idler,\"]\")))","v":600},0.6,null,"","y"]
{"$rows_left_out":105}
{"sheet":"_SpringData_L1","index":8,"n_rows":108,"n_cols":30,"rows_kept":108,"cut":false,"hidden":true,"merged":[[3,3,3,5]]}
[null,null,null,"FIRST LEVEL FILTER"]
[]
["LOGIC 1"]
["Fudged Turns",5,null,"Logic 1: midBlindTorque (with Fudged Turns)",null,null,"↓"]
["Selection",null,null,"Turns @ Mid Blind (With Fudged Turns)","Max Turns Required (Logic 1)","Pre-Turns Required (Logic 1)","Turns check",{"$f":"locHeader_modSpringData_L0","v":"LL Spring Rate"},"UL Spring Rate","Local Switch","Booster Rate Check","Options","Booster","Wire ø (mm)","mean coil ID","Position","Number of coils","Max Turns","T_Max","Nom. Spring Rate","Bending stress (Mpa)","Min blind width w idler(TBC) mm","Min. Width (m)",38.6,"Rate Var %","Spring Flag","mod of Elast",207000,0,"internal coil ID"]
["Input Blind Width",{"$f":"input_BlindWidth","v":1},null,{"$f":"IF(AND(OFFSET(H6,0,$B$27-1)>0,OFFSET(H6,0,$B$27-1)<>\"\"),logic1_FudgedTurns+$B$60/OFFSET(H6,0,$B$27-1),\"\")","v":""},{"$f":"IF(D6<>\"\",D6+0.5*$B$61,\"\")","v":""},{"$f":"IF(D6<>\"\",D6-0.5*input_totalBlindTurns,\"\")","v":""},{"$f":"IF(E6<>\"\",IF(AND(E6<OFFSET(H6,0,$B$28-1),F6>0),\"y\",\"n\"),\"\")","v":""},{"$f":"_xlfn._xlws.FILTER(locTable_modSpringData_L0,(INDEX(locTable_modSpringData_L0,,B25)<loc_BlindWidth)*(INDEX(locTable_modSpringData_L0,,B26)=\"y\")*(INDEX(locTable_modSpringData_L0,,B29)=\"y\")*(INDEX(locTable_modSpringData_L0,,B30)=\"y\")*(INDEX(locTable_modSpringData_L0,,B31)<=B20),\"\")","v":{"$error":"#DIV/0!"}}]
{"$rows_left_out":103}
{"sheet":"_SpringData_L2","index":9,"n_rows":66,"n_cols":32,"rows_kept":66,"cut":false,"hidden":true,"merged":[]}
[null,null,null,"SPRING SELECTION"]
["Current Mode","Calculator",null,null,null,"Header","Location"]
[null,null,null,"Spring rate",{"$f":"INDEX(locTable_modSpringData_L2,,G3)","v":0},"Nom. Spring Rate",{"$f":"MATCH(F3,locHeader_modSpringData_L1,0)","v":17}]
[null,null,null,"Spring #",{"$f":"INDEX(locTable_modSpringData_L2,,G4)","v":0},"Options",{"$f":"MATCH(F4,locHeader_modSpringData_L1,0)","v":9}]
[null,null,null,"Booster Type",{"$f":"IF(INDEX(locTable_modSpringData_L2,,G5)=0,\"No suitable options.\",INDEX(locTable_modSpringData_L2,,G5))","v":"No suitable options."},"Booster",{"$f":"MATCH(F5,locHeader_modSpringData_L1,0)","v":10}]
[null,null,null,"Position ",{"$f":"INDEX(locTable_modSpringData_L2,,G6)","v":0},"Position",{"$f":"MATCH(F6,locHeader_modSpringData_L1,0)","v":13}]
{"$rows_left_out":61}
{"sheet":"_FabricList","index":10,"n_rows":100,"n_cols":16,"rows_kept":100,"cut":false,"hidden":true,"merged":[]}
[null,null,null,null,null,null,null,null,null,null,null,null,null,"HIDE"]
[null,"Description","Thickness (mm)","Density (gsm)","Thickness (in)","Density (oz/yd²)","Roll Width (in)","Roll Width (mm)",null,"Railroad","Region",null,null,{"$f":"COUNTA(_xlfn.ANCHORARRAY(P4))","v":82}]
[null,"Description","Thickness_Metric","Density_Metric","Thickness_Imperial","Density_Imperial","RollWidth_Imperial","RollWidth_Metric","RRYesNo","RR","Region","SearchReturn","RegionReturn",null,null,"L_FabricSearchList"]
[null,{"$f":"z_AvgFabric","v":"_Average Fabric"},0.65,400,{"$f":"T_Fabric[[#This Row],[Thickness_Metric]]/25.4","v":2.5590551181102365E-2},{"$f":"T_Fabric[[#This Row],[Density_Metric]]/33.90574744","v":11.797409884794448},"-","-","-","-","Global",{"$f":"IF(AND(i_Fabric<>\"\",i_Fabric=T_Fabric[[#This Row],[Description]]),1,0)","v":0},{"$f":"IF(i_Region=\"Global\",1,IF(OR(i_Region=T_Fabric[[#This Row],[Region]],T_Fabric[[#This Row],[Region]]=\"Global\"),1,0))","v":1},null,{"$f":"_xlfn._xlws.SORT(_xlfn._xlws.FILTER(T_Fabric[Description],T_Fabric[RegionReturn],\"Not Found\"))","v":""},{"$f":"IF(o_FabricMatch=\"Yes\",_xlfn._xlws.SORT(_xlfn._xlws.FILTER($O$4:$O$100,LEN($O$4:$O$100)>1)),_xlfn._xlws.SORT(_xlfn._xlws.FILTER($O$4:$O$100,ISNUMBER(SEARCH(i_Fabric,$O$4:$O$100)),\"Not Found\")))","v":"_Average Fabric"}]
[null,{"$f":"z_CustomFData","v":"_Custom Fabric Data"},{"$f":"IF(i_Units=\"Imperial\",i_FThickness_Custom*25.4,i_FThickness_Custom)","v":0},{"$f":"IF(i_Units=\"imperial\",i_Fdensity_Custom*33.90574744,i_Fdensity_Custom)","v":0},{"$f":"IF(i_Units=\"Metric\",i_FThickness_Custom/25.4,i_FThickness_Custom)","v":0},{"$f":"IF(i_Units=\"Metric\",T_Fabric[[#This Row],[Density_Metric]]/33.90574744,i_Fdensity_Custom)","v":0},"-","-","-","-","Global",{"$f":"IF(AND(i_Fabric<>\"\",i_Fabric=T_Fabric[[#This Row],[Description]]),1,0)","v":0},{"$f":"IF(i_Region=\"Global\",1,IF(OR(i_Region=T_Fabric[[#This Row],[Region]],T_Fabric[[#This Row],[Region]]=\"Global\"),1,0))","v":1},null,"","_Custom Fabric Data"]
[null,"Kleenscreen 1%",0.6,483,{"$f":"T_Fabric[[#This Row],[Thickness_Metric]]/25.4","v":2.3622047244094488E-2},{"$f":"T_Fabric[[#This Row],[Density_Metric]]/33.90574744","v":14.245372435889294},118,{"$f":"ROUND((T_Fabric[[#This Row],[RollWidth_Imperial]]*25.4)/1000,2)*1000","v":3000},"No",{"$f":"z_Fabric_RR_No","v":"Fabric cannot be railroaded."},"US",{"$f":"IF(AND(i_Fabric<>\"\",i_Fabric=T_Fabric[[#This Row],[Description]]),1,0)","v":0},{"$f":"IF(i_Region=\"Global\",1,IF(OR(i_Region=T_Fabric[[#This Row],[Region]],T_Fabric[[#This Row],[Region]]=\"Global\"),1,0))","v":1},null,"","3000 HT 3%"]
{"$rows_left_out":95}
{"sheet":"_Dictionary","index":11,"n_rows":107,"n_cols":11,"rows_kept":107,"cut":false,"hidden":true,"merged":[]}
[null,null,null,null,"AU ENGLISH","US ENGLISH (Setup tbc) - base it off region selection"]
[null,"NamedRange","Output",null,"English","Column2","Español","Français"]
[null,"z_Title",{"$f":"INDEX(T_Dictionary[#This Row],,MATCH(i_Language,T_Dictionary[#Headers],0))","v":"Roller Shade Calculator"},null,"Roller Shade Calculator"]
[null,"z_FabricSearch",{"$f":"INDEX(T_Dictionary[#This Row],,MATCH(i_Language,T_Dictionary[#Headers],0))","v":"Fabric Search"},null,"Fabric Search",null,"Búsqueda de telas"]
[null,"z_SelectFabric",{"$f":"INDEX(T_Dictionary[#This Row],,MATCH(i_Language,T_Dictionary[#Headers],0))","v":"Select Fabric"},null,"Select Fabric",null,"Seleccionar tela"]
[null,"z_FabricDensity",{"$f":"INDEX(T_Dictionary[#This Row],,MATCH(i_Language,T_Dictionary[#Headers],0))","v":"Fabric Density"},null,"Fabric Density",null,"Densidad de la tela"]
{"$rows_left_out":102}
{"sheet":"_Parameters","index":12,"n_rows":89,"n_cols":44,"rows_kept":89,"cut":false,"hidden":true,"merged":[[56,17,56,19],[57,17,57,19],[96,18,96,19],[77,17,77,19],[76,17,76,19],[71,17,71,19],[70,17,70,19],[64,17,64,19],[65,17,65,19],[85,17,85,19],[86,17,86,19],[25,17,25,19],[26,17,26,19],[43,17,43,19],[44,17,44,19],[35,17,35,18],[36,17,36,19],[16,17,16,19],[2,1,2,3],[4,17,4,19],[5,17,5,19],[6,17,6,19],[15,17,15,19],[11,1,11,3],[11,8,11,9],[11,11,11,12],[11,5,11,6]]}
[]
[null,null,null,null,null,null,null,null,null,null,null,null,null,null,null,null,null,null,null,null,null,null,null,null,null,null,null,null,null,null,null,null,"L_Units","L_Language","YesNo","Region","L_SheetStatus","ShowHide",null,null,null,null,"DocumentName","CurrentVersion"]
[null,"GENERAL LIMITS",null,null,null,null,null,null,null,null,null,null,null,null,null,null,null,"&\" (\"&ROUND((C29-(Booster_k*(@Tube_Rotations/2)))/Booster_k,2)&\")\"",null,null,null,"Index","Metric","Imperial","Factor",null,"Conversion factors:",null,null,null,null,null,{"$f":"z_Metric","v":"Metric"},"English","Yes","Global","Development",{"$f":"z_Show","v":"Show"},null,null,null,null,"RollerShadeCalculator","1.19"]
[null,"User Effort",{"$f":"5*IF(i_Units=\"Metric\",1,INDEX(T_Units[Factor],MATCH(\"kg\",T_Units[Metric],0)))","v":5},{"$f":"INDEX(INDIRECT(\"T_Units[\"&i_Units&\"]\"),MATCH(\"kg\",T_Units[Metric],0))","v":"kg"},null,null,null,null,null,null,null,null,null,null,null,null,null,null,null,null,null,1,"mm","in",{"$f":"1/25.4","v":3.937007874015748E-2},null,"1 lb =",0.45359237000000002,"kg",null,null,null,{"$f":"z_Imperial","v":"Imperial"},"Español","No","AU","Release",{"$f":"z_Hide","v":"Hide"}]
[null,"User Effort2",null,null,null,null,null,null,null,null,null,null,null,null,null,null,null,"REFERENCE DATA",null,null,null,2,"kg","lb",2.2046226199999999,null,"1 kg=",2.2046226199999999,"lb",null,null,null,null,"Français",null,"US","Release - FFA"]
[null,"Tube Deflection Limit",{"$f":"i_TubeDeflectionLimit*10","v":1.05},"mm/m",null,null,null,{"$f":"i_Fdensity_Custom","v":0},null,null,null,null,null,null,null,null,null,"Tube 1",null,null,null,3,"Nm","lb·ft",0.74,null,"1 m=",1.0936132999999999,"yd"]
{"$rows_left_out":84}
{"sheet":"_LiveData","index":13,"n_rows":100,"n_cols":31,"rows_kept":100,"cut":false,"hidden":true,"merged":[[6,7,6,8],[8,2,8,3],[8,14,8,17],[8,20,8,24],[8,5,8,7],[8,10,8,12]]}
[null,null,null,null,null,null,null,null,null,null,null,null,null,null,null,null,null,null,null,null,null,null,null,null,null,null,null,"ESA"]
[null,null,"increment steps",null,null,"y = blind torque (Nm), x = Top Tube # Rotation (Rev)",null,null,null,null,null,"assume 1x or 2x",null,null,"friction 1 = on, 0 = off",0,null,null,null,null,null,null,{"$f":"((MAX(W11:W69)-MIN(W11:W69))/_xlfn.SINGLE(Tube_Rotations))","v":{"$error":"#N/A"}},null,null,null,null,"Min Blind Torque",{"$f":"MIN(O11:O100)","v":0},null,0.12007922848505737]
[null,null,0.5,null,null,"y = ax²+bx+c","a","b","c",null,null,2,null,null,null,null,null,null,null,null,"0.5 m/s cord movement. ",null,null,null,null,null,null,"Max Blind Torque",{"$f":"MAX(O11:O100)","v":0},null,0.36566644254000003]
[null,null,null,null,null,null,{"$f":"LINEST(OFFSET(O11,0,0,$B$11),OFFSET(C11,0,0,$B$11)^{1,2})","v":{"$error":"#VALUE!"}},null,null,null,null,"2 = control and pin end",null,null,null,"**Clutch friction added here",null,null,null,null,null,null,null,null,null,null,null,"Max Tube Turns",{"$f":"INDEX(C11:C100,B11)","v":0}]
[null,null,null,null,null,null,null,null,null,null,null,null,null,null,null,null,null,"top preturns",null,null,"T = w * friction coeff (nm.s/rad)",null,null,null,null,null,null,"Ideal Rate",{"$f":"(AC3-AC2)/AC4","v":{"$error":"#DIV/0!"}}]
[null,null,null,null,null,null,null,null,null,null,null,null,null,null,"Control_D",{"$f":"Control_D","v":{"$error":"#N/A"}},"mm",{"$f":"Booster_Preturns","v":0},null,null,null,null,null,null,null,null,null,"Input ESA Booster Rate",{"$f":"_SpringData_L2!E3","v":0}]
{"$rows_left_out":95}
{"sheet":"_Notes","index":14,"n_rows":66,"n_cols":24,"rows_kept":66,"cut":false,"hidden":true,"merged":[[64,4,64,6]]}
[]
[null,null,null,null,"changelog"]
[null,null,1.05,"2022-04-03","updated fabric list with AU & US regional data"]
[null,null,null,null,"updated weight bar list with region specific selections"]
[null,null,null,null,"added 'fabric dropdown search' functionality back"]
[]
{"$rows_left_out":60}