{"text_format":"1","workbook":"xlsx","n_sheets":14,"sheets":["0. Intro","Inputs","BOM","Ctrl_Lists","Ctrl_Selections","Ctrl_Deductions","Ctrl_Recommendations","Calc_Torque","Ctrl_Limitations","PriceList_AU_hide","ToDo","ChangeLog","Ctrl_SpringData_excl","Calc_Reference_excl"],"not_rendered":{"charts":0,"images":4,"macros":1,"external_links":2,"defined_names":207,"comments":7,"pivot_tables":0},"unopened":[],"bounds":{"document_bytes":16777216,"sheet_cells":100000,"rows_first":2000,"rows_last":500,"rows_between":2000,"halvings":0,"cell_chars":16384,"cell_head_chars":4096},"cells_cut":0,"cells_raw":0,"read":"whole","date_system":"1900"}

{"sheet":"0. Intro","index":0,"n_rows":27,"n_cols":5,"rows_kept":27,"cut":false,"hidden":false,"merged":[[3,1,5,16]]}
[]
[null,"If you are seeing this page, it means Excel Macro's have not been enabled. "]
[]
[null,"Excel Macros provide improved functionality for this file, and it will not work properly unless they are enabled. "]
[]
[]
{"$rows_left_out":22}
{"sheet":"Inputs","index":1,"n_rows":58,"n_cols":23,"rows_kept":58,"cut":false,"hidden":false,"merged":[[43,17,43,21],[47,18,47,19],[54,17,54,22],[52,17,52,22],[53,17,53,22],[44,18,44,19],[46,18,46,19],[51,18,51,21],[50,18,50,21]]}
[1,1,"1",1,1,1,1,1,1,1,1,"1",1,1,1,1]
["macro disabled",false]
["Row # of First Flag",null,{"$f":"ROW(INDEX(A7:OFFSET(A7,options_count-1,0),MATCH(FALSE,ISBLANK(A7:OFFSET(A7,options_count-1,0)),0)))","v":9}]
["Number of Options",null,{"$f":"COUNTA(R7:R40)","v":33},null,null,null,null,null,"is open but not extreme",null,null,null,null,null,null,null,null,null,null,null,null,"Release"]
[{"$f":"SUM(A7:OFFSET(A7,options_count-1,0))","v":17},{"$f":"COUNTIF(B7:OFFSET(B7,options_count-1,0),1)","v":0},{"$f":"SUM(C7:OFFSET(C7,options_count-1,0))","v":6},null,null,null,null,null,null,null,null,null,null,null,{"$f":"\"Col: \" &COLUMN(O6)","v":"Col: 15"},null,null,null,null,null,null,null,"Last Updated: 16-Jan-2025"]
["Must Fill Flag","Check error Flag","Check Fill Flag","Condition_1",null,"Condition_2",null,"Optional?","Enter Precedent 1 ",null,"Check For_1","Enter Precedent 2","Check For_2","Row Outcome*","WarningCol",null,null,"OPTIONS","INPUT",null,"INSTRUCTIONS",null,"COMMENTS "]
{"$rows_left_out":53}
{"sheet":"BOM","index":2,"n_rows":262,"n_cols":86,"rows_kept":262,"cut":false,"hidden":true,"merged":[[8,77,9,77],[8,68,9,68],[8,75,9,75],[8,74,9,74],[8,76,9,76],[91,73,92,73],[91,71,92,71],[8,72,9,72],[91,72,92,72],[8,73,9,73],[8,71,9,71],[2,2,6,2],[2,25,6,25],[2,33,6,33],[8,26,8,31],[9,13,9,14],[9,15,9,16],[8,3,8,23],[9,3,9,4],[9,5,9,6],[9,7,9,8],[9,9,9,10],[9,11,9,12],[9,17,9,18],[9,19,9,20],[9,21,9,22],[13,34,13,42],[8,34,8,48],[8,58,9,58],[8,57,9,57],[8,56,9,56],[8,54,9,54],[9,45,10,45],[91,56,92,56],[91,54,92,54],[8,64,9,64],[8,70,9,70],[8,63,9,63],[8,65,9,65],[8,59,9,59],[8,60,9,60],[8,61,9,61],[8,66,9,66],[8,62,9,62],[8,67,9,67],[8,69,9,69]]}
["HIDE","HIDE","HIDE","HIDE","HIDE","HIDE","HIDE","HIDE","HIDE","HIDE","HIDE","HIDE","HIDE","HIDE","HIDE","HIDE","HIDE","HIDE","HIDE","HIDE","HIDE","HIDE","HIDE","HIDE","HIDE","HIDE","HIDE","HIDE","HIDE","HIDE","HIDE","HIDE","HIDE","HIDE","HIDE","HIDE","HIDE","HIDE","HIDE","HIDE","HIDE","HIDE","HIDE","HIDE","HIDE","HIDE","HIDE","HIDE","HIDE","HIDE","HIDE","HIDE","HIDE","HIDE","HIDE",null,null,null,"HIDE","HIDE","HIDE","HIDE","HIDE","HIDE",{"$f":"IF(i_Units=\"Metric\",\"SHOW\",\"HIDE\")","v":"HIDE"},{"$f":"IF(i_Units=\"Imperial\",\"SHOW\",\"HIDE\")","v":"HIDE"},null,"HIDE","HIDE","HIDE","HIDE","HIDE","HIDE",null,"HIDE","HIDE","HIDE",{"$f":"IF(AND(i_Pricing=\"Yes\",i_Location=\"AU\"),\"SHOW\",\"HIDE\")","v":"HIDE"},null,"HIDE","HIDE","HIDE","HIDE","HIDE","HIDE","HIDE"]
[null,null,null,null,null,null,null,null,null,null,null,null,null,null,null,null,null,null,null,null,null,null,null,null,null,null,null,null,null,null,null,null,null,null,null,null,null,null,null,null,null,null,null,null,null,null,null,null,null,null,"SHOW"]
[null,null,"CONDITIONS",null,null,null,null,null,null,null,null,null,null,null,null,null,null,null,null,null,null,null,null,null,null,"QTY",null,null,null,null,null,null,null,"COLOURS",null,null,null,null,null,null,null,null,null,null,null,null,null,null,null,null,"SHOW",null,null,null,null,null,null,"Customers Name:",null,null,null,null,null,null,{"$f":"IF(i_CustName=0,\"\",i_CustName)","v":""},{"$f":"IF(i_CustName=0,\"\",i_CustName)","v":""}]
[null,null,null,null,null,null,null,null,null,null,null,null,null,null,null,null,null,null,null,null,null,null,null,null,null,null,null,null,null,null,null,null,null,null,null,null,null,null,null,null,null,null,null,null,null,null,null,null,null,null,"SHOW",null,null,null,null,null,null,"Job Number:",null,null,null,null,null,null,{"$f":"IF(i_JobNumber=0,\"\",i_JobNumber)","v":""},{"$f":"IF(i_JobNumber=0,\"\",i_JobNumber)","v":""}]
[null,null,null,null,null,null,null,null,null,null,null,null,null,null,null,null,null,null,null,null,null,null,null,null,null,null,null,null,null,null,null,null,null,null,null,null,null,null,null,null,null,null,null,null,null,null,null,null,null,null,"SHOW",null,null,null,null,null,null,"Blind Width:",null,null,null,null,null,null,{"$f":"o_Widthmm","v":0},{"$f":"TEXT(o_Widthin,\"0\"&IF(ABS(o_Widthin-ROUND(o_Widthin,0))>1/32,\"-0/\"&CHOOSE(ROUND(MOD(o_Widthin,1)*16,0),16,8,16,4,16,8,16,2,16,8,16,4,16,8,16),\"\"))","v":"0"},{"$f":"INDEX(T_UnitSelection[Units],MATCH(i_Units,T_UnitSelection[UnitSelection],0))","v":{"$error":"#N/A"}}]
[null,null,null,null,null,null,null,null,null,null,null,null,null,null,null,null,null,null,null,null,null,null,null,null,null,null,null,null,null,null,null,null,null,null,null,null,null,null,null,null,null,null,null,null,null,null,null,null,null,null,"SHOW",null,null,null,null,null,null,"Blind Drop:",null,null,null,null,null,null,{"$f":"o_Dropmm","v":0},{"$f":"TEXT(o_Dropin,\"0\"&IF(ABS(o_Dropin-ROUND(o_Dropin,0))>1/32,\"-0/\"&CHOOSE(ROUND(MOD(o_Dropin,1)*16,0),16,8,16,4,16,8,16,2,16,8,16,4,16,8,16),\"\"))","v":"0"},{"$f":"INDEX(T_UnitSelection[Units],MATCH(i_Units,T_UnitSelection[UnitSelection],0))","v":{"$error":"#N/A"}}]
{"$rows_left_out":257}
{"sheet":"Ctrl_Lists","index":3,"n_rows":57,"n_cols":37,"rows_kept":57,"cut":false,"hidden":true,"merged":[[20,25,20,26],[1,0,1,1],[19,13,19,15],[19,8,19,11],[20,8,20,11],[5,20,5,22],[6,20,6,22],[5,17,5,18]]}
[null,null,null,null,null,null,"TO BE FINISHED LATER>"]
["List Summary",null,null,null,null,null,null,null,null,null,null,null,null,null,null,null,null,null,null,null,"L_SelectUnitsSingle"]
[null,null,null,"i_Currency",null,null,null,null,null,null,null,null,null,null,"o_nScreens",null,null,null,null,null,{"$f":"IF(i_Units=\"Metric\",\"Imperial\",\"Metric\")","v":"Metric"}]
[null,null,null,{"$f":"INDEX(T_Currency[Currency],MATCH(i_Location,T_Location[Location],0))","v":{"$error":"#N/A"}},null,null,null,null,null,null,null,null,null,null,{"$f":"IF(OR(i_LinkedScreens=\"No\",i_LinkedScreens=\"\"),1,i_nScreens)","v":{"$error":"#NAME?"}},null,null,null,null,null,{"$f":"IF(i_Units=\"\",\"Imperial\",0)","v":"Imperial"}]
[null,"Activate List ->"]
[null,"Table/List Name (MUST MATCH) ->",{"$f":"\"T_\"&SUBSTITUTE((OFFSET(C6,2,0)),\" \",\"\")","v":"T_Installation"},"T_Currency","T_Location","T_BlindType","T_SystemType","T_InstallationType","T_ControlType","T_SideGuideFixing",null,{"$f":"\"T_\"&SUBSTITUTE((OFFSET(L6,2,0)),\" \",\"\")","v":"T_ControlSide"},"T_YesNo","T_BoxShape","T_nScreens","T_CassetteBrush","T_wbBallast","T_PivotArmLength",null,"T_Linked",{"$f":"\"T_\"&SUBSTITUTE((OFFSET(U6,2,0)),\" \",\"\")","v":"T_UnitSelection"},null,null,"T_SheetStatus",null,"T_Motor",null,{"$f":"\"T_\"&SUBSTITUTE((OFFSET(AB6,2,0)),\" \",\"\")","v":"T_RemoteList"},"T_ZipscreenSideGuides","T_WGTopTerminal","T_Booster","T_GearArm","T_GearRatio","T_BracketOptions","T_IdlerType","T_OpenBktOrientation","T_Sensors"]
{"$rows_left_out":52}
{"sheet":"Ctrl_Selections","index":4,"n_rows":717,"n_cols":14,"rows_kept":717,"cut":false,"hidden":true,"merged":[[509,4,509,13],[425,3,426,3],[14,3,18,3],[14,2,18,2],[84,3,87,3],[88,2,90,2],[88,3,90,3],[481,3,485,3],[527,3,527,13],[514,3,515,3],[514,2,515,2],[244,2,247,2],[248,2,250,2],[262,3,262,13],[387,3,389,3],[468,3,468,13],[360,3,360,13],[248,3,250,3],[37,4,37,13],[177,3,177,13],[382,3,386,3],[202,2,206,2],[202,3,206,3],[207,2,210,2],[207,3,210,3],[166,2,168,2],[166,3,168,3],[62,3,62,13],[70,3,70,13],[82,4,82,13],[84,2,87,2],[499,3,499,13],[272,3,272,13],[219,3,219,13],[326,4,326,13],[328,2,331,2],[328,3,331,3],[332,2,337,2],[332,3,337,3],[486,3,490,3],[486,2,490,2],[449,3,450,3],[289,3,292,3],[244,3,247,3],[418,4,418,13],[420,2,424,2],[420,3,424,3],[434,3,434,13],[425,2,426,2],[4,4,4,13],[27,3,27,13],[242,4,242,13],[449,2,450,2],[479,4,479,13],[481,2,485,2],[6,2,10,2],[6,3,10,3],[11,3,13,3],[111,3,111,13],[39,2,44,2],[39,3,44,3],[227,3,227,13],[200,4,200,13],[123,4,123,13],[125,2,129,2],[125,3,129,3],[145,3,145,13],[130,3,135,3],[130,2,135,2],[185,3,185,13],[11,2,13,2],[162,3,165,3],[162,2,165,2],[616,3,618,3],[616,2,618,2],[619,3,622,3],[623,3,625,3],[623,2,625,2],[647,4,647,13],[2,0,2,1],[709,3,709,13],[680,4,680,13],[693,3,693,13],[701,3,701,13],[287,4,287,13],[289,2,292,2],[307,3,307,13],[293,2,295,2],[447,4,447,13],[460,3,460,13],[400,3,400,13],[387,2,389,2],[160,4,160,13],[564,3,564,13],[99,3,99,13],[380,4,380,13],[382,2,386,2],[293,3,295,3],[543,3,545,3],[655,2,657,2],[655,3,657,3],[667,3,667,13],[350,3,350,13],[338,2,340,2],[338,3,340,3],[603,3,603,13],[577,2,579,2],[649,2,651,2],[649,3,651,3],[652,2,654,2],[539,4,539,13],[546,3,548,3],[575,2,576,2],[573,4,573,13],[575,3,576,3],[577,3,578,3],[595,3,595,13],[652,3,654,3],[614,4,614,13],[619,2,622,2],[635,3,635,13],[556,3,556,13],[580,2,582,2],[583,2,587,2],[543,2,545,2],[546,2,548,2],[541,2,542,2],[541,3,542,3],[511,2,513,2],[511,3,513,3]]}
[null,null,"=IF(INDIRECT(\"i_\"&SUBSTITUTE(D55,\" \",\"\")),0,\"No\") if a default value is required"]
[]
["Configuration Matrix"]
[]
[null,null,"Enter DEPENDENCIES","SELECTION OPTIONS","CONFIGURATIONS"]
[null,null,"Ref Position →",{"$f":"COUNTA(D7:D20)","v":1},{"$f":"SUM(COUNTIF(E7:E20,$C7:$C20))","v":0},{"$f":"SUM(COUNTIF(F7:F20,$C7:$C20))","v":0},{"$f":"SUM(COUNTIF(G7:G20,$C7:$C20))","v":0},{"$f":"SUM(COUNTIF(H7:H20,$C7:$C20))","v":0},{"$f":"SUM(COUNTIF(I7:I20,$C7:$C20))","v":0},{"$f":"SUM(COUNTIF(J7:J20,$C7:$C20))","v":0},{"$f":"SUM(COUNTIF(K7:K20,$C7:$C20))","v":0},{"$f":"SUM(COUNTIF(L7:L20,$C7:$C20))","v":0},{"$f":"SUM(COUNTIF(M7:M20,$C7:$C20))","v":0},{"$f":"SUM(COUNTIF(N7:N20,$C7:$C20))","v":0}]
{"$rows_left_out":712}
{"sheet":"Ctrl_Deductions","index":5,"n_rows":63,"n_cols":47,"rows_kept":63,"cut":false,"hidden":true,"merged":[[14,23,18,23],[14,24,18,24],[1,25,1,26],[2,25,2,46],[9,23,13,23],[4,23,8,23],[9,24,13,24],[4,24,8,24]]}
[null,null,null,null,null,null,null,null,"LXSKYLINE",4.8899999999999997,4.8899999999999997,{"$f":"K1+K3","v":12.19},null,null,null,null,null,null,null,null,null,null,null,null,null,null,null,null,null,null,null,null,null,null,null,null,null,{"$f":"i_BktFixType","v":0}]
[null,null,null,"Does",null,"Apply to ",null,null,"SLB660",4.57,4.57,{"$f":"K2+K3","v":11.870000000000001},null,null,null,null,null,null,null,null,null,null,null,null,null,null,null,null,null,null,null,null,null,null,null,"assumes top/face is BASELINE",null,{"$f":"i_ZipscreenSideGuideFix","v":{"$error":"#NAME?"}}]
[null,null,null,null,null,null,null,null,"MINI",339.9,7.3,null,null,null,null,null,null,null,null,null,null,null,null,"Enter DEPENDENCIES","SELECTION OPTIONS","CONFIGURATIONS"]
[null,null,null,null,null,null,null,null,"LIGHT",541.9,7.3,null,null,null,null,null,null,null,null,null,null,null,null,null,{"$f":"MAX(Z4:AU4)","v":0},{"$f":"SUM(COUNTIF(Z5:Z19,$X$5:$X$19))","v":0},{"$f":"SUM(COUNTIF(AA5:AA19,$X$5:$X$19))","v":0},{"$f":"SUM(COUNTIF(AB5:AB19,$X$5:$X$19))","v":0},{"$f":"SUM(COUNTIF(AC5:AC19,$X$5:$X$19))","v":0},{"$f":"SUM(COUNTIF(AD5:AD19,$X$5:$X$19))","v":0},{"$f":"SUM(COUNTIF(AE5:AE19,$X$5:$X$19))","v":0},{"$f":"SUM(COUNTIF(AF5:AF19,$X$5:$X$19))","v":0},{"$f":"SUM(COUNTIF(AG5:AG19,$X$5:$X$19))","v":0},{"$f":"SUM(COUNTIF(AH5:AH19,$X$5:$X$19))","v":0},{"$f":"SUM(COUNTIF(AI5:AI19,$X$5:$X$19))","v":0},{"$f":"SUM(COUNTIF(AJ5:AJ14,$X$5:$X$14))","v":0},{"$f":"SUM(COUNTIF(AK5:AK14,$X$5:$X$14))","v":0},{"$f":"SUM(COUNTIF(AL5:AL14,$X$5:$X$14))","v":0},{"$f":"SUM(COUNTIF(AM5:AM14,$X$5:$X$14))","v":0},{"$f":"SUM(COUNTIF(AN5:AN14,$X$5:$X$14))","v":0},{"$f":"SUM(COUNTIF(AO5:AO14,$X$5:$X$14))","v":0},{"$f":"SUM(COUNTIF(AP5:AP14,$X$5:$X$14))","v":0},{"$f":"SUM(COUNTIF(AQ5:AQ14,$X$5:$X$14))","v":0},{"$f":"SUM(COUNTIF(AR5:AR14,$X$5:$X$14))","v":0},{"$f":"SUM(COUNTIF(AS5:AS14,$X$5:$X$14))","v":0},{"$f":"SUM(COUNTIF(AT5:AT14,$X$5:$X$14))","v":0},{"$f":"SUM(COUNTIF(AU5:AU14,$X$5:$X$14))","v":0}]
[null,null,null,null,null,null,null,null,"MED",851.9,7.3]
[null,null,null,null,null,null,null,null,"HEAVY",951.9,7.3]
{"$rows_left_out":58}
{"sheet":"Ctrl_Recommendations","index":6,"n_rows":111,"n_cols":23,"rows_kept":111,"cut":false,"hidden":true,"merged":[[1,6,2,6],[1,7,2,7],[1,2,1,3],[1,4,1,5],[20,1,21,1],[13,2,13,3],[73,1,73,2],[54,1,54,2],[61,1,61,3],[17,1,18,1],[30,2,30,3],[31,2,31,3],[23,1,24,1],[21,10,21,21],[39,10,39,12],[39,13,39,15],[39,16,39,18],[39,19,39,21]]}
[]
[null,null,"Absolute Min",null,"Absolute Max",null,{"$f":"\"Current Value (\"&i_Units&\")\"","v":"Current Value ()"},"Outside Specs\n(0 = No, 1 = Yes)",null,null,null,null,null,null,null,null,null,null,null,null,null,"sorted by priority"]
[null,null,"mm",{"$f":"\"Min (\"&i_Units&\")\"","v":"Min ()"},"mm",{"$f":"\"Max (\"&i_Units&\")\"","v":"Max ()"},null,null,null,null,null,null,"FORMULA drive min-max",null,null,null,null,null,null,null,null,"Warning cells are NAMED."]
[null,"Width",{"$f":"o_MinWidthReqd","v":{"$error":"#N/A"}},{"$f":"IF(i_Units=\"Metric\",C4,CONVERT(C4,\"mm\",\"in\"))","v":{"$error":"#N/A"}},3000,{"$f":"IF(i_Units=\"Metric\",E4,CONVERT(E4,\"mm\",\"in\"))","v":118.11023622047243},{"$f":"i_Width","v":0},{"$f":"IF(AND(AND(i_Width<>\"\",i_Width>=0),OR(i_Width<MinWidth,i_Width>MaxWidth)),1,0)","v":{"$error":"#N/A"}}]
[null,"Drop",500,{"$f":"IF(i_Units=\"Metric\",C5,CONVERT(C5,\"mm\",\"in\"))","v":19.685039370078741},3000,{"$f":"IF(i_Units=\"Metric\",E5,CONVERT(E5,\"mm\",\"in\"))","v":118.11023622047243},{"$f":"i_Drop","v":0},{"$f":"IF(AND(AND(i_Drop<>\"\",i_Drop>=0),OR(i_Drop<MinDrop,i_Drop>MaxDrop)),1,0)","v":0},null,null,"#","Dim","Min","Max",null,"i_installationType",null,null,null,null,null,"on / off","Warning"]
[null,null,null,null,null,null,null,null,null,null,"w_BlindDrop","o_dropmm",null,3000,null,null,null,null,null,{"$f":"IFERROR(PRODUCT(IF(o_Dropmm>N6,\"1\",\"0\"),Q6),\"-\")","v":0},null,{"$f":"IFERROR(IF(T6>0,\"on\",\"off\"),\"-\")","v":"off"},{"$f":"\"Warning! Blind Drop is too large, recommended limit is \"&IF(i_Units=\"Metric\",ROUND(E5/1000,2) &\" m\", ROUND(CONVERT(E5,\"mm\",\"in\"),0)&\" in\")&\". Refer Specifications Manual.\"","v":"Warning! Blind Drop is too large, recommended limit is 118 in. Refer Specifications Manual."}]
{"$rows_left_out":106}
{"sheet":"Calc_Torque","index":7,"n_rows":26,"n_cols":16,"rows_kept":26,"cut":false,"hidden":true,"merged":[]}
[]
[]
[]
[null,"Fabric Density",0.39,"kg/m²",null,"Total Fabric Length",{"$f":"IF(C17=\"Yes\",C7+PI()*C8/1000,C7)","v":4.1358738822677585},"m",null,null,null,"mm","Nm",null,"Nm"]
[null,"Fabric Thickness",0.6,"mm",null,"Fabric mass per metre of drop",{"$f":"C6*C4","v":1.56},"kg/m",null,null,null,"Diameter","Holding Capacity","Gear Ratio","Friction"]
[null,"Width",4,"m",null,"Blind mass per metre of width",{"$f":"C10+C11","v":0.28999999999999998},"kg/m",null,null,"RB09",46,1,1,0.2]
{"$rows_left_out":21}
{"sheet":"Ctrl_Limitations","index":8,"n_rows":76,"n_cols":42,"rows_kept":76,"cut":false,"hidden":true,"merged":[[2,26,2,41],[4,24,8,24],[4,25,8,25],[9,24,13,24],[9,25,13,25]]}
[]
[null,null,null,"Does",null,"Apply to "]
[null,null,null,null,null,null,null,null,null,null,null,null,null,null,null,null,null,null,null,null,null,null,null,null,"Enter DEPENDENCIES","SELECTION OPTIONS","CONFIGURATIONS"]
[null,null,null,null,null,null,null,null,null,null,null,null,null,null,null,null,null,null,null,null,null,null,null,null,null,{"$f":"MAX(AA4:AP4)","v":1},1,{"$f":"SUM(COUNTIF(AB5:AB19,$Y$5:$Y$19))","v":0},{"$f":"SUM(COUNTIF(AC5:AC19,$Y$5:$Y$19))","v":0},{"$f":"SUM(COUNTIF(AD5:AD19,$Y$5:$Y$19))","v":0},{"$f":"SUM(COUNTIF(AE5:AE19,$Y$5:$Y$19))","v":0},{"$f":"SUM(COUNTIF(AF5:AF19,$Y$5:$Y$19))","v":0},{"$f":"SUM(COUNTIF(AG5:AG19,$Y$5:$Y$19))","v":0},{"$f":"SUM(COUNTIF(AH5:AH19,$Y$5:$Y$19))","v":0},{"$f":"SUM(COUNTIF(AI5:AI19,$Y$5:$Y$19))","v":0},{"$f":"SUM(COUNTIF(AJ5:AJ19,$Y$5:$Y$19))","v":0},{"$f":"SUM(COUNTIF(AK5:AK19,$Y$5:$Y$19))","v":0},{"$f":"SUM(COUNTIF(AL5:AL19,$Y$5:$Y$19))","v":0},{"$f":"SUM(COUNTIF(AM5:AM19,$Y$5:$Y$19))","v":0},{"$f":"SUM(COUNTIF(AN5:AN19,$Y$5:$Y$19))","v":0},{"$f":"SUM(COUNTIF(AO5:AO19,$Y$5:$Y$19))","v":0},{"$f":"SUM(COUNTIF(AP5:AP19,$Y$5:$Y$19))","v":0}]
[null,null,null,null,null,null,null,null,null,null,null,null,null,null,null,null,null,null,null,null,null,null,null,null,{"$f":"INDIRECT(\"i_\"&SUBSTITUTE($Z5,\" \",\"\"))","v":0},"System Type"]
[]
{"$rows_left_out":71}
{"sheet":"PriceList_AU_hide","index":9,"n_rows":130,"n_cols":11,"rows_kept":130,"cut":false,"hidden":true,"merged":[]}
[null,"HIDE",null,"HIDE","HIDE","HIDE"]
[null,"No.","Description","Colour Description","Base Unit of Measure","AU",null,null,null,"Last Update:","2023-11-13"]
[null,"AW91-1401-338000","Idler Housing - 78mm tube","Silver Grey","PIECE",5.44]
[null,"AW91-1501-050000","Fabric Brush T Slot Fit - 7 x 4.8mm | 350m Roll","Black, Satin","METRE",1.59]
[null,"MG10-6001-010909","Idler Spring - O/D 7x43 - 0.71 GALV. wire (RB10)","S/S 304, Natural","PIECE",0.78]
[null,"MG10-6001-025908","Idler Shaft 8 x 8 x 45mm (RB10)","Silver ZINC Plated","PIECE",0.89]
{"$rows_left_out":125}
{"sheet":"ToDo","index":10,"n_rows":12,"n_cols":3,"rows_kept":12,"cut":false,"hidden":true,"merged":[]}
[]
[]
[null,null,"ToDo"]
[null,"NOW"]
[]
[]
{"$rows_left_out":7}
{"sheet":"ChangeLog","index":11,"n_rows":18,"n_cols":6,"rows_kept":18,"cut":false,"hidden":true,"merged":[]}
[]
[]
[]
[null,"xxx"]
[null,0.04,"Added 2\" components",null,null,{"$f":"_xlfn.TEXTJOIN(\"*|\",TRUE,_xlfn.UNIQUE(LEFT(L_AllCodes,9)))","v":{"$error":"#VALUE!"}}]
[null,null,"Formatting & Headings"]
{"$rows_left_out":13}
{"sheet":"Ctrl_SpringData_excl","index":12,"n_rows":40,"n_cols":25,"rows_kept":40,"cut":false,"hidden":true,"merged":[]}
[]
[null,"TABLE NOT USED."]
[null,null,null,null,{"$f":"IF(AND(o_Widthmm>D4,o_Widthmm<=E4),1,0)","v":0},0,0,0,0,0,0,0,0,0,0,0,0,0,0,0,0,0,0,0,0]
[null,null,"Up to",400,500,600,700,800,900,1000,1100,1200,1300,1400,1500,1600,1700,1800,1900,2000,2100,2200,2300,2400,4000]
[null,null,800,"8/3/Mini","8/3/Mini","14/8/L","14/8/L","14/7/L","16/7/L","15/6/L","10/6/M","10/6/M","10/6/M","11/6/M","12/6/M","12/6/M","12/6/M","13/6/M","13/6/M","14/7/M","14/7/M","14/7/M","16/9/M","16/9/M"]
[null,{"$f":"IF(AND(o_Dropmm>C5,o_Dropmm<=C6),1,0)","v":0},1000,"8/4/Mini","8/3/Mini","14/8/L","14/8/L","15/7/L","17/7/L","17/7/L","10/8/M","11/8/M","11/8/M","11/8/M","12/8/M","12/8/M","12/8/M","13/8/M","13/8/M","14/8/M","14/8/M","14/8/M","16/9/M","16/9/M"]
{"$rows_left_out":35}
{"sheet":"Calc_Reference_excl","index":13,"n_rows":54,"n_cols":65,"rows_kept":54,"cut":false,"hidden":true,"merged":[[47,51,48,51],[44,51,45,51],[6,45,6,46],[30,1,30,3],[45,1,45,3],[52,1,52,3],[6,25,6,27],[6,29,6,32],[6,34,6,38],[6,40,6,43],[10,1,10,3],[11,1,11,3],[13,1,13,3],[6,20,6,23],[1,1,1,3],[6,16,6,18],[6,13,6,14],[8,1,8,3],[9,1,9,3]]}
[]
[null,"Input Constants"]
[null,"Maximum User Effort",null,"kg",null,null,null,null,null,null,null,null,null,null,null,null,null,null,null,null,null,null,null,null,null,null,null,null,null,null,null,null,null,null,null,null,null,null,null,null,null,null,null,null,null,null,null,null,null,null,null,"Selected Fabric",{"$f":"i_FabricSelection","v":0}]
[null,"Tube Deflection Limit (internal)",null,"mm/m",null,null,null,null,null,null,null,null,null,null,null,null,null,null,null,null,null,null,null,null,null,null,null,null,null,null,null,null,null,null,null,null,null,null,null,null,null,null,null,null,null,null,null,null,null,null,null,"lookup thickness",{"$f":"INDEX(#REF!,MATCH(i_FabricSelection,#REF!,0))","v":{"$error":"#REF!"}},"mm",null,null,null,null,null,null,null,null,"#6 zip",1.45,"mm"]
[null,"Tube Deflection Limit (external)",null,"mm/m",null,null,null,null,null,null,null,null,null,null,null,null,null,null,null,null,null,null,null,null,null,null,null,null,null,null,null,null,null,null,null,null,null,null,null,null,null,null,null,null,null,null,null,null,null,null,null,"lookup density",{"$f":"INDEX(#REF!,MATCH(i_FabricSelection,#REF!,0))","v":{"$error":"#REF!"}},"gsm"]
[null,"Zip Thickness",null,"mm"]
{"$rows_left_out":48}