{"text_format":"1","workbook":"xlsx","n_sheets":16,"sheets":["0. Intro","Inputs","BOM","Ctrl_Lists","Ctrl_Selections","Ctrl_Deductions","Ctrl_Recommendations","Calc_Torque","Ctrl_SpringData","Ctrl_Limitations","Calc_Reference","Calc_Fabric","PriceList_AU","Items_US","ToDo","ChangeLog"],"not_rendered":{"charts":0,"images":4,"macros":1,"external_links":2,"defined_names":221,"comments":9,"pivot_tables":0},"unopened":[],"bounds":{"document_bytes":16777216,"sheet_cells":100000,"rows_first":2000,"rows_last":500,"rows_between":2000,"halvings":0,"cell_chars":16384,"cell_head_chars":4096},"cells_cut":0,"cells_raw":0,"read":"whole","date_system":"1900"}

{"sheet":"0. Intro","index":0,"n_rows":27,"n_cols":5,"rows_kept":27,"cut":false,"hidden":false,"merged":[[3,1,5,16]]}
[]
[null,"If you are seeing this page, it means Excel Macro's have not been enabled. "]
[]
[null,"Excel Macros provide improved functionality for this file, and it will not work properly unless they are enabled. "]
[]
[]
[]
[null,"This may be caused by one of the following warnings:"]
[null,null,"Follow the steps below each warning to enable Macros."]
[]
[]
[]
[]
[]
[null,null,"Simply click 'Enable Content'"]
[]
[]
[]
[]
[]
[]
[null,null,"Find out more here: ",null,"https://docs.microsoft.com/en-us/deployoffice/security/internet-macros-blocked#remove-mark-of-the-web-from-a-file"]
[]
[null,null,"1. Close workbook"]
[null,null,"2. Right click on the Excel file and click 'Properties'"]
[null,null,"3. Tick 'Unblock' and click 'OK'"]
[null,null,"4. Re-open file"]

{"sheet":"Inputs","index":1,"n_rows":55,"n_cols":22,"rows_kept":55,"cut":false,"hidden":false,"merged":[[40,16,40,20],[44,17,44,18],[51,16,51,21],[49,16,49,21],[50,16,50,21],[41,17,41,18],[43,17,43,18],[48,17,48,20],[47,17,47,20]]}
[1,1,"1",1,1,1,1,1,1,1,1,1,1,1,1]
["macro disabled",false]
["Row # of First Flag",null,{"$f":"ROW(INDEX(A7:OFFSET(A7,options_count-1,0),MATCH(FALSE,ISBLANK(A7:OFFSET(A7,options_count-1,0)),0)))","v":9}]
["Number of Options",null,{"$f":"COUNTA(Q7:Q37)","v":30},null,null,null,null,null,"is open but not extreme",null,null,null,null,null,null,null,null,null,null,null,"Release"]
[{"$f":"SUM(A7:OFFSET(A7,options_count-1,0))","v":16},{"$f":"COUNTIF(B7:OFFSET(B7,options_count-1,0),1)","v":0},{"$f":"SUM(C7:OFFSET(C7,options_count-1,0))","v":4},null,null,null,null,null,null,null,null,null,null,{"$f":"\"Col: \" &COLUMN(N6)","v":"Col: 14"},null,null,null,null,null,null,null,"Last Updated: 8 September 2023"]
["Must Fill Flag","Check error Flag","Check Fill Flag","Condition_1",null,"Condition_2",null,"Optional?","Enter Precedent",null,"Check For_1","Check For_2","Row Outcome*","WarningCol",null,null,"OPTIONS","INPUT",null,"INSTRUCTIONS",null,"COMMENTS "]
[null,null,null,"i_SystemType",null,"i_InstallationType",null,null,null,null,null,null,null,null,null,null,"Customer's Name",null,null,"← Enter Name (Optional)"]
[null,null,null,null,null,null,null,null,null,null,null,null,null,null,null,null,"Customer's Job Number",null,null,"← Enter Job Number (Optional)"]
[1,null,{"$f":"IF(AND(LEN(R9)>0,M9<>\"HIDE\"),1,0)","v":0},null,null,null,null,null,null,null,null,null,null,null,null,null,"Region",null,{"$f":"HYPERLINK(\"#\"&ADDRESS(ROW(),COLUMN()-1),CHAR(128))","v":"€"},"← Select Region (US)",null,{"$f":"IF(i_Location=\"\",\"Please select a Region.\",\"\")","v":"Please select a Region."}]
[1,null,{"$f":"IF(AND(LEN(R10)>0,M10<>\"HIDE\"),1,0)","v":0},null,null,null,null,null,null,null,null,null,null,null,null,null,"Units",null,{"$f":"HYPERLINK(\"#\"&ADDRESS(ROW(),COLUMN()-1),CHAR(128))","v":"€"},"← Select Units (Metric/Imperial)"]
[null,null,null,null,null,null,null,null,null,null,null,null,"HIDE",null,null,null,"Fabric",null,{"$f":"HYPERLINK(\"#\"&ADDRESS(ROW(),COLUMN()-1),CHAR(128))","v":"€"},"← Select Fabric"]
[1,null,{"$f":"IF(AND(R12>0,M12<>\"HIDE\"),1,0)","v":0},null,null,null,null,null,null,null,null,null,null,{"$f":"IFERROR(IF(SEARCH(\"Warning\",V12)>0,1,0),0)","v":0},null,null,"Blind Width",null,null,{"$f":"_xlfn.IFNA(\"← Enter Total Blind Width (\"&INDEX(T_UnitSelection[Units],MATCH(i_Units,T_UnitSelection[UnitSelection],0))&\")\",\"← Enter Blind Width\")","v":"← Enter Blind Width"},null,{"$f":"IFERROR(IF(SUM(Ctrl_Recommendations!$T$12:$T$13)>0,INDEX(Ctrl_Recommendations!$W$12:$W$13,MATCH(1,Ctrl_Recommendations!$T$12:$T$13)),\"\"),\"\")","v":""}]
[{"$f":"IF(M13=\"HIDE\",0,1)","v":1},null,{"$f":"IF(AND(R13>0,M13<>\"HIDE\"),1,0)","v":0},null,null,null,null,null,"i_SystemType",null,"VEUE - Pivot Arm",null,{"$f":"IF(ISNUMBER(SEARCH(K13,INDIRECT(I13))),\"HIDE\",\"SHOW\")","v":"SHOW"},{"$f":"IFERROR(IF(SEARCH(\"Warning\",V13)>0,1,0),0)","v":0},null,null,"Blind Drop",null,null,{"$f":"_xlfn.IFNA(\"← Enter Total Blind Drop (\"&INDEX(T_UnitSelection[Units],MATCH(i_Units,T_UnitSelection[UnitSelection],0))&\")\",\"← Enter Blind Drop\")","v":"← Enter Blind Drop"},null,{"$f":"IFERROR(IF(w_BlindDrop>0,INDEX(Ctrl_Recommendations!$W$6:$W$8,MATCH(\"on\",Ctrl_Recommendations!$V$6:$V$8,0)),\"\"),\"\")","v":""}]
[{"$f":"IF(M14=\"HIDE\",0,1)","v":0},null,{"$f":"IF(AND(LEN(R14)>0,M14<>\"HIDE\"),1,0)","v":0},null,null,null,null,null,null,null,null,null,"HIDE",{"$f":"IFERROR(IF(SEARCH(\"Warning\",V14)>0,1,0),0)","v":0},null,null,"System Type",null,{"$f":"HYPERLINK(\"#\"&ADDRESS(ROW(),COLUMN()-1),CHAR(128))","v":"€"},{"$f":"\"← Select \"&Q14","v":"← Select System Type"},null,{"$f":"IFERROR(IF(AND(i_Tube<>\"\",i_SystemType<>\"\",w_MaxArea=\"On\"),OFFSET(w_MaxArea,0,1,),\"\"),\"\")","v":""}]
[{"$f":"IF(M15=\"HIDE\",0,1)","v":1},null,0,null,null,null,null,null,null,null,null,null,null,{"$f":"IFERROR(IF(SEARCH(\"Warning\",V15)>0,1,0),0)","v":0},null,null,"Installation Type",null,{"$f":"HYPERLINK(\"#\"&ADDRESS(ROW(),COLUMN()-1),CHAR(128))","v":"€"},"← Select Installation Type",null,"Refer to Catalog for available System Upgrades."]
[{"$f":"IF(M16=\"HIDE\",0,1)","v":1},null,{"$f":"IF(AND(LEN(R16)>0,M16<>\"HIDE\"),1,0)","v":0},null,null,null,null,null,"i_InstallationType","!=","Recess",null,{"$f":"IF(ISNUMBER(SEARCH(K16,INDIRECT(I16))),\"HIDE\",\"SHOW\")","v":"SHOW"},null,null,null,"Bracket Fix Orientation",null,"€",{"$f":"\"← Select \"&Q16","v":"← Select Bracket Fix Orientation"}]
[{"$f":"IF(M17=\"HIDE\",0,1)","v":1},null,{"$f":"IF(AND(LEN(R17)>0,M17<>\"HIDE\"),1,0)","v":0},{"$f":"IFERROR(IF(FIND(\"EXTREME\",i_SystemType)>0,\"\",i_SystemType),i_SystemType)","v":0},null,null,null,null,"i_installationType",null,"Open",null,"SHOW",null,null,null,"Open Bracket Style",null,"€","← Select Open Bracket Style"]
[{"$f":"IF(M18=\"HIDE\",0,1)","v":1},null,0,{"$f":"IFERROR(IF(FIND(\"EXTREME\",i_SystemType)>0,\"\",i_SystemType),i_SystemType)","v":0},null,null,null,null,"i_installationType",null,"Open",null,"SHOW",null,null,null,"Open Bracket Covers",null,"€","← Select Open Bracket Covers"]
[{"$f":"IF(M19=\"HIDE\",0,1)","v":0},null,{"$f":"IF(AND(LEN(R19)>0,M19<>\"HIDE\"),1,0)","v":0},null,null,null,null,null,null,null,null,null,{"$f":"IF(ISNUMBER(SEARCH(K19,INDIRECT(I19))),\"SHOW\",\"HIDE\")","v":"HIDE"},null,null,null,"Wire Guide Top Terminal",null,"€","← Select Wire Guide Top Terminal"]
[1,null,0,null,null,null,null,null,null,null,null,null,null,{"$f":"IFERROR(IF(SEARCH(\"Warning\",V20)>0,1,0),0)","v":0},null,null,"Spring Size",null,{"$f":"HYPERLINK(\"#\"&ADDRESS(ROW(),COLUMN()-1),CHAR(128))","v":"€"},"← Select Spring Size",null,"Refer to Product Specifications for spring selection guidance."]
[{"$f":"IF(M21=\"HIDE\",0,1)","v":1},null,{"$f":"IF(AND(LEN(R21)>0,M21<>\"HIDE\"),1,0)","v":0},null,null,null,null,null,"i_Booster","!=","Dual Heavy",null,{"$f":"IF(ISNUMBER(SEARCH(K21,INDIRECT(I21))),\"HIDE\",\"SHOW\")","v":"SHOW"},null,null,null,"Idler Type",null,{"$f":"HYPERLINK(\"#\"&ADDRESS(ROW(),COLUMN()-1),CHAR(128))","v":"€"},{"$f":"\"← Select \"&Q21","v":"← Select Idler Type"}]
[0,null,{"$f":"IF(AND(H22=1,M22=\"SHOW\"),1,IF(AND(LEN(R22)>0,M22<>\"HIDE\"),1,0))","v":0},null,null,null,null,1,"i_motor",null,"AUTOMATE",null,{"$f":"IF(ISNUMBER(SEARCH(K22,INDIRECT(I22))),\"SHOW\",\"HIDE\")","v":"HIDE"},null,null,null,"Remote",null,{"$f":"HYPERLINK(\"#\"&ADDRESS(ROW(),COLUMN()-1),CHAR(128))","v":"€"},{"$f":"\"← Select \"&Q22","v":"← Select Remote"}]
[0,null,{"$f":"IF(AND(H23=1,M23=\"SHOW\"),1,IF(AND(LEN(R23)>0,M23<>\"HIDE\"),1,0))","v":0},null,null,null,null,1,"i_motor",null,"AUTOMATE",null,{"$f":"IF(ISNUMBER(SEARCH(K23,INDIRECT(I23))),\"SHOW\",\"HIDE\")","v":"HIDE"},null,null,null,"Sensor",null,{"$f":"HYPERLINK(\"#\"&ADDRESS(ROW(),COLUMN()-1),CHAR(128))","v":"€"},{"$f":"\"← Select \"&Q23","v":"← Select Sensor"}]
[{"$f":"IF(M24=\"HIDE\",0,1)","v":1},null,0,null,null,null,null,null,null,null,null,null,null,{"$f":"IFERROR(IF(SEARCH(\"Warning\",V24)>0,1,0),0)","v":0},null,null,"Tube",null,"€",{"$f":"\"← Select \"&Q24","v":"← Select Tube"}]
[0,null,0,null,null,null,null,null,null,null,null,null,"HIDE",null,null,null,"Tube Extras",null,"€","← Select Tube Extras"]
[{"$f":"IF(M26=\"HIDE\",0,1)","v":1},null,{"$f":"IF(AND(LEN(R26)>0,M26<>\"HIDE\"),1,0)","v":0},null,null,null,null,null,null,null,null,null,{"$f":"IF(ISNUMBER(SEARCH(K26,INDIRECT(I26))),\"HIDE\",\"SHOW\")","v":"SHOW"},null,null,null,{"$f":"IF(i_Location=\"AU\",\"Weight Bar Bar\",\"Hem Bar\")","v":"Hem Bar"},null,"€","← Select Hem Bar"]
[{"$f":"IF(M27=\"HIDE\",0,1)","v":0},null,{"$f":"IF(AND(H27=1,M27=\"SHOW\"),1,IF(AND(LEN(R27)>0,M27<>\"HIDE\"),1,0))","v":0},null,null,null,null,1,"i_SystemType","!=","Pivot",null,"HIDE",null,null,null,{"$f":"IF(i_Location=\"US\",\"Hem Bar Lock\",\"Weight Bar Lock\")","v":"Weight Bar Lock"},null,"€",{"$f":"\"← Select \"&Q27","v":"← Select Weight Bar Lock"}]
[{"$f":"IF(M28=\"HIDE\",0,1)","v":0},null,{"$f":"IF(AND(LEN(R28)>0,M28<>\"HIDE\"),1,0)","v":0},null,null,null,null,null,null,null,null,null,{"$f":"IF(ISERROR(INDEX(L_wbStrap,1)),\"HIDE\",\"SHOW\")","v":"HIDE"},null,null,null,{"$f":"IF(i_Location=\"US\",\"Hem Bar Spline\",\"Weight Bar Strap\")","v":"Weight Bar Strap"},null,"€",{"$f":"\"← Select \"&Q28","v":"← Select Weight Bar Strap"}]
[{"$f":"IF(M29=\"HIDE\",0,1)","v":1},null,{"$f":"IF(AND(H29=1,M29=\"SHOW\"),1,IF(AND(LEN(#REF!)>0,M29<>\"HIDE\"),1,0))","v":1},null,null,null,null,1,"i_SystemType","!=","VEUE - Pivot Arm",null,{"$f":"IF(ISNUMBER(SEARCH(K29,INDIRECT(I29))),\"HIDE\",\"SHOW\")","v":"SHOW"},null,null,null,{"$f":"IF(i_Location=\"AU\",\"Weight Bar Spline Type\",\"Hem Bar Spline Type\")","v":"Hem Bar Spline Type"},null,"€","← Select Hem Bar Spline Type"]
[{"$f":"IF(M30=\"HIDE\",0,1)","v":1},null,{"$f":"IF(AND(H30=1,M30=\"SHOW\"),1,IF(AND(LEN(R30)>0,M30<>\"HIDE\"),1,0))","v":1},null,null,null,null,1,null,null,null,null,"SHOW",null,null,null,{"$f":"IF(i_Location=\"US\",\"Hem Bar Accessories\",\"Weight Bar Accessories\")","v":"Weight Bar Accessories"},null,"€","← Select Weight Bar Accessories"]
[0,null,{"$f":"IF(AND(LEN(R30)>0,M31<>\"HIDE\"),1,0)","v":0},null,null,null,null,null,null,null,null,null,"HIDE",null,null,null,"Weight Bar Spline",null,"€","← Select Weight Bar Spline"]
[{"$f":"IF(M32=\"HIDE\",0,1)","v":1},null,{"$f":"IF(AND(H32=1,M32=\"SHOW\"),1,IF(AND(LEN(R32)>0,M32<>\"HIDE\"),1,0))","v":1},null,null,null,null,1,null,null,null,null,"SHOW",null,null,null,"Accessories",null,"€","← Select Accessories"]
[0,null,0,null,null,null,null,null,null,null,null,null,"HIDE",null,null,null,"Finish",null,"€",{"$f":"\"← Select \"&Q33","v":"← Select Finish"}]
[{"$f":"IF(M34=\"HIDE\",0,1)","v":0},null,{"$f":"IF(AND(H34=1,M34=\"SHOW\"),1,IF(AND(LEN(R34)>0,M34<>\"HIDE\"),1,0))","v":0},null,null,null,null,1,"i_Finish",null,"Powdercoat",null,{"$f":"IF(ISNUMBER(SEARCH(K34,INDIRECT(I34))),\"SHOW\",\"HIDE\")","v":"HIDE"},null,null,null,"Colour",null,"€",{"$f":"\"← Select \"&Q34","v":"← Select Colour"}]
[1,null,1,null,null,null,null,null,null,null,null,null,null,null,null,null,null,0]
[{"$f":"IF(M36=\"HIDE\",0,1)","v":0},null,{"$f":"IF(AND(LEN(R36)>0,M36<>\"HIDE\"),1,0)","v":0},null,null,null,null,null,"i_Location",null,"AU",null,{"$f":"IF(SUMPRODUCT(--ISNUMBER(SEARCH(K36,INDIRECT(I36)))),\"SHOW\",\"HIDE\")","v":"HIDE"},null,null,null,"HARDWARE DISCOUNT",0,null,"← Enter Discount %"]
[{"$f":"IF(M37=\"HIDE\",0,1)","v":0},null,{"$f":"IF(AND(LEN(R37)>0,M37<>\"HIDE\"),1,0)","v":0},null,null,null,null,null,"i_Location",null,"AU",null,{"$f":"IF(SUMPRODUCT(--ISNUMBER(SEARCH(K37,INDIRECT(I37)))),\"SHOW\",\"HIDE\")","v":"HIDE"},null,null,null,"AUTOMATE DISCOUNT",0,null,"← Enter Discount %"]
[null,null,null,null,null,null,null,null,null,null,null,null,"HIDE",null,null,null,"SHOW PRICING","No",null,"← Select if pricing is to be shown on BOM"]
[0,null,0,null,null,null,null,null,null,null,null,null,"HIDE",null,null,null,"SYSTEM QTY",1,null,"← Enter QTY Required"]
[]
[null,null,null,null,null,null,null,null,null,null,null,null,"HIDE",null,null,null,"CALCULATOR"]
[null,null,null,null,null,null,null,null,null,null,null,null,"HIDE",null,null,null,"Booster Pre-turns",{"$f":"IF(i_ControlType=\"Spring\",Calc_Reference!BA38,\"\")","v":""},null,"Turns"]
[null,null,null,null,null,null,null,null,null,null,null,null,"HIDE",null,null,null,"Motor cycle time (1-way)",null,null,"sec"]
[null,null,null,null,null,null,null,null,null,null,null,null,"HIDE",null,null,null,"Tube Deflection",{"$f":"(5/384)*((g*(Fabric_Density*o_BlindDropm+Tube_UnitMass+wb_UnitMass)*o_BlindWidthm^4)/Tube_IE)*1000","v":{"$error":"#N/A"}},null,"mm"]
[null,null,null,null,null,null,null,null,null,null,null,null,"HIDE",null,null,null,"Roll Diameter",null,null,"mm",null,"including zip (if applicable) - data bar needs to be box/open bracket limit"]
[null,null,null,null,null,null,null,null,null,null,null,null,"SHOW"]
[null,null,null,null,null,null,null,null,null,null,null,null,null,null,null,null,"LEGEND","INSTRUCTIONS"]
[null,null,null,null,null,null,null,null,null,null,null,null,null,null,null,null,"OPTIONAL FIELD","STEP 1: In order to obtain cutting lists, ensure all required fields are filled in"]
["Row # of First Option",null,{"$f":"ROW(Q7)","v":7},null,null,null,null,null,null,null,null,null,null,null,null,null,"REQUIRED FIELD","STEP 2: Once Inputs are completed, click SUBMIT button to generate Bill of Materials & Cutting List",null,null,null,"For other fabrics, refer to Pre-tension Charts for Booster and Pre-turn recommendations."]
["Row # of Last Option",null,{"$f":"ROW(i_Finish)","v":33}]
[null,null,null,null,null,null,null,null,null,null,null,null,null,null,null,null,"NOTE: Microsoft Excel 2007 or later required for complete functionality. MACROS MUST BE ENABLED."]
[null,null,null,null,null,null,null,null,null,null,null,{"$f":"IF(SUM(N9:N36)>=1,\"Warnings\",\"No Warnings\")","v":"No Warnings"},null,null,null,null,"DISCLAIMER: Rollease Acmeda has used reasonable care in preparing the information included in this workbook, but makes no representations or warranties as to the completeness or accuracy of the information. Information is supplied upon the condition that the persons receiving the information will make their own determination as to is suitability for their purposes prior to use. Rollease Acmeda assumes no liability whatsoever for any damages incurred by you resulting from errors in or omissions from the information included herein. The pricing tool is an indicative estimation only based on selections and does not account for indicidental wastage. Rollease Acmeda reserves the right to make changes without further notice to any products to improve the reliability, function or design."]
[]
[null,null,"={IF(SUMPRODUCT(--ISNUMBER(SEARCH(E42,INDIRECT(D42)))),\"HIDE\",\"SHOW\")}"]
[null,null,"=IF(AND(ISNUMBER(SEARCH(K20,@INDIRECT(I20))),(D20=@INDIRECT($D$7))),\"SHOW\",\"HIDE\")"]

{"sheet":"BOM","index":2,"n_rows":238,"n_cols":86,"rows_kept":238,"cut":false,"hidden":true,"merged":[[8,77,9,77],[8,68,9,68],[8,75,9,75],[8,74,9,74],[8,76,9,76],[67,73,68,73],[67,71,68,71],[8,72,9,72],[67,72,68,72],[8,73,9,73],[8,71,9,71],[2,2,6,2],[2,25,6,25],[2,33,6,33],[8,26,8,31],[9,13,9,14],[9,15,9,16],[8,3,8,23],[9,3,9,4],[9,5,9,6],[9,7,9,8],[9,9,9,10],[9,11,9,12],[9,17,9,18],[9,19,9,20],[9,21,9,22],[13,34,13,42],[8,34,8,48],[8,58,9,58],[8,57,9,57],[8,56,9,56],[8,54,9,54],[9,45,10,45],[67,56,68,56],[67,54,68,54],[8,64,9,64],[8,70,9,70],[8,63,9,63],[8,65,9,65],[8,59,9,59],[8,60,9,60],[8,61,9,61],[8,66,9,66],[8,62,9,62],[8,67,9,67],[8,69,9,69]]}
["HIDE","HIDE","HIDE","HIDE","HIDE","HIDE","HIDE","HIDE","HIDE","HIDE","HIDE","HIDE","HIDE","HIDE","HIDE","HIDE","HIDE","HIDE","HIDE","HIDE","HIDE","HIDE","HIDE","HIDE","HIDE","HIDE","HIDE","HIDE","HIDE","HIDE","HIDE","HIDE","HIDE","HIDE","HIDE","HIDE","HIDE","HIDE","HIDE","HIDE","HIDE","HIDE","HIDE","HIDE","HIDE","HIDE","HIDE","HIDE","HIDE","HIDE","HIDE","HIDE","HIDE","HIDE","HIDE",null,null,null,"HIDE","HIDE","HIDE","HIDE","HIDE","HIDE",{"$f":"IF(i_Units=\"Metric\",\"SHOW\",\"HIDE\")","v":"HIDE"},{"$f":"IF(i_Units=\"Imperial\",\"SHOW\",\"HIDE\")","v":"HIDE"},null,"HIDE","HIDE","HIDE","HIDE","HIDE","HIDE",null,"HIDE","HIDE","HIDE",{"$f":"IF(i_Pricing=\"Yes\",\"SHOW\",\"HIDE\")","v":"HIDE"},null,"HIDE","HIDE","HIDE","HIDE","HIDE","HIDE","HIDE"]
[null,null,null,null,null,null,null,null,null,null,null,null,null,null,null,null,null,null,null,null,null,null,null,null,null,null,null,null,null,null,null,null,null,null,null,null,null,null,null,null,null,null,null,null,null,null,null,null,null,null,"SHOW"]
[null,null,"CONDITIONS",null,null,null,null,null,null,null,null,null,null,null,null,null,null,null,null,null,null,null,null,null,null,"QTY",null,null,null,null,null,null,null,"COLOURS",null,null,null,null,null,null,null,null,null,null,null,null,null,null,null,null,"SHOW",null,null,null,null,null,null,"Customers Name:",null,null,null,null,null,null,{"$f":"IF(i_CustName=0,\"\",i_CustName)","v":""},{"$f":"IF(i_CustName=0,\"\",i_CustName)","v":""}]
[null,null,null,null,null,null,null,null,null,null,null,null,null,null,null,null,null,null,null,null,null,null,null,null,null,null,null,null,null,null,null,null,null,null,null,null,null,null,null,null,null,null,null,null,null,null,null,null,null,null,"SHOW",null,null,null,null,null,null,"Job Number:",null,null,null,null,null,null,{"$f":"IF(i_JobNumber=0,\"\",i_JobNumber)","v":""},{"$f":"IF(i_JobNumber=0,\"\",i_JobNumber)","v":""}]
[null,null,null,null,null,null,null,null,null,null,null,null,null,null,null,null,null,null,null,null,null,null,null,null,null,null,null,null,null,null,null,null,null,null,null,null,null,null,null,null,null,null,null,null,null,null,null,null,null,null,"SHOW",null,null,null,null,null,null,"Blind Width:",null,null,null,null,null,null,{"$f":"o_Widthmm","v":0},{"$f":"TEXT(o_Widthin,\"0\"&IF(ABS(o_Widthin-ROUND(o_Widthin,0))>1/32,\"-0/\"&CHOOSE(ROUND(MOD(o_Widthin,1)*16,0),16,8,16,4,16,8,16,2,16,8,16,4,16,8,16),\"\"))","v":"0"},{"$f":"INDEX(T_UnitSelection[Units],MATCH(i_Units,T_UnitSelection[UnitSelection],0))","v":{"$error":"#N/A"}}]
[null,null,null,null,null,null,null,null,null,null,null,null,null,null,null,null,null,null,null,null,null,null,null,null,null,null,null,null,null,null,null,null,null,null,null,null,null,null,null,null,null,null,null,null,null,null,null,null,null,null,"SHOW",null,null,null,null,null,null,"Blind Drop:",null,null,null,null,null,null,{"$f":"o_Dropmm","v":0},{"$f":"TEXT(o_Dropin,\"0\"&IF(ABS(o_Dropin-ROUND(o_Dropin,0))>1/32,\"-0/\"&CHOOSE(ROUND(MOD(o_Dropin,1)*16,0),16,8,16,4,16,8,16,2,16,8,16,4,16,8,16),\"\"))","v":"0"},{"$f":"INDEX(T_UnitSelection[Units],MATCH(i_Units,T_UnitSelection[UnitSelection],0))","v":{"$error":"#N/A"}}]
[null,null,null,null,null,null,null,null,null,null,null,null,null,null,null,null,null,null,null,null,null,null,null,null,null,null,null,null,null,null,null,null,null,null,null,null,null,null,null,null,null,null,null,null,null,null,null,null,null,null,"SHOW",null,null,null,null,null,{"$f":"i_InstallationType&\", \"&i_WeightBar&\", \"&i_ControlType","v":", , "}]
[null,null,null,null,null,null,null,null,null,null,null,null,null,null,null,null,null,null,null,null,null,null,null,null,null,null,null,null,null,null,null,null,null,null,null,null,null,null,null,null,null,null,null,null,null,null,null,null,null,null,"SHOW"]
[null,null,null,"ROW HIDE/SHOW CONDITIONS",null,null,null,null,null,null,null,null,null,null,null,null,null,null,null,null,null,null,null,null,null,null,"QTY Modifiers",null,null,null,null,null,null,null,"Colour Selection",null,null,null,null,null,null,null,null,null,null,null,null,null,null,null,"SHOW",null,null,null,"PART NUMBER for NAV costs",null,"PART NUMBER","DESCRIPTION","Std Lengths (meters)","CutList?","Deduction Type","Deduction Lookup","Deduc Type","Cut length (mm)","CUT LENGTH\n(mm)","CUT LENGTH (in)","U.O.M","Supplied UOM","secondary UoM","UoM SWAP?","Discount","QTY (Base)","QTY / SYSTEM","Total QTY","unit/metre lookup cost",{"$f":"\"LINE COST\n(\"&i_Currency&\")\"","v":{"$error":"#N/A"}},{"$f":"\"$ Discount (\"&i_Currency&\")\"","v":{"$error":"#N/A"}},{"$f":"\"LINE COST\n(\"&i_Currency&\")\"","v":{"$error":"#N/A"}}]
[null,null,"RowCtrl","Condition_1",null,"Condition_2",null,"Condition_3",null,"Condition_4",null,"Condition_5",null,"Condition_6",null,"Condition_7",null,"Condition_8",null,"Condition_9",null,"Condition_10",null,null,null,null,"Links","Distance","Other Rules_1","Other Rules_x","QTY Factor.","Comments",null,null,null,null,null,null,null,null,null,null,null,null,"System Default",null,null,null,null,null,"SHOW",null,null,null,null,null,null,null,null,null,null,null,null,null,null,null,null,null,null,null,null,null,null,null,"COST $$$"]
[null,null,null,null,null,null,null,null,null,null,null,null,null,null,null,null,null,null,null,null,null,null,null,null,null,null,null,null,null,null,null,null,null,null,"Fallback ",null,null,null,null,null,null,null,null,null,"Black",null,null,null,null,null,{"$f":"IF(AND(ISBLANK(BC11),ISBLANK(C11)),\"HIDE\",_xlfn.SWITCH(PRODUCT(C11:Z11,B11),2,\"HEADING\",1,\"SHOW\",0,\"HIDE\"))","v":"HIDE"}]
[null,"2=heading",null,null,null,null,null,null,null,null,null,null,null,null,null,null,null,null,null,null,null,null,null,null,null,null,null,"i_Width","i_Drop",null,null,null,null,null,"Colour",null,null,null,null,null,null,null,null,null,null,null,null,null,null,null,{"$f":"IF(AND(ISBLANK(BC12),ISBLANK(C12)),\"HIDE\",_xlfn.SWITCH(PRODUCT(C12:Z12,B12),2,\"HEADING\",1,\"SHOW\",0,\"HIDE\"))","v":"HIDE"},null,null,null,null,null,null,null,null,null,null,null,null,null,"&\" (x\"&BT17&\")\""]
[null,null,null,null,null,null,null,null,null,null,null,null,null,null,null,null,null,null,null,null,null,null,null,null,null,null,null,{"$f":"IF(i_Units=\"Metric\",i_Width,CONVERT(i_Width,\"in\",\"mm\"))","v":0},{"$f":"IF(i_Units=\"Metric\",i_Drop,CONVERT(i_Drop,\"in\",\"mm\"))","v":0},null,null,null,null,null,1,2,3,4,5,6,7,8,9,null,null,null,null,null,null,null,{"$f":"IF(AND(ISBLANK(BC13),ISBLANK(C13)),\"HIDE\",_xlfn.SWITCH(PRODUCT(C13:Z13,B13),2,\"HEADING\",1,\"SHOW\",0,\"HIDE\"))","v":"HIDE"},null,null,null,null,null,null,null,null,null,null,null,null,null,"mm","in"]
[null,null,null,null,null,null,null,null,null,null,null,null,null,null,null,null,null,null,null,null,null,null,null,null,null,null,null,null,null,null,null,null,null,null,"COLOUR OPTIONS",null,null,null,null,null,null,null,null,"LOC.","DEFAULT","Col_IN Selec",null,"Col_OUT Desc","Col_OUT Code",null,{"$f":"IF(AND(ISBLANK(BC14),ISBLANK(C14)),\"HIDE\",_xlfn.SWITCH(PRODUCT(C14:Z14,B14),2,\"HEADING\",1,\"SHOW\",0,\"HIDE\"))","v":"HIDE"},null,null,null,null,null,null,null,null,null,null,null,null,null,"potential QTY column"]
[null,2,{"$f":"C16","v":0},null,null,null,null,null,null,null,null,null,null,null,null,null,null,null,null,null,null,null,null,null,null,null,null,null,null,null,{"$f":"IFERROR(_xlfn.SINGLE(IF(AND(AA15=\"Y\",PRODUCT(AB15:AD15)=0),o_nScreens,IF(PRODUCT(AB15:AD15)=0,\"\",PRODUCT(AB15:AD15)))),\"\")","v":""},null,null,null,null,null,null,null,null,null,null,null,null,null,{"$f":"IF(ISNUMBER(FIND(\"x\",BE15)),IFERROR(INDEX(AI15:AQ15,0,MATCH(AT15,AI15:AQ15,0)),IF(AI15<>\"\",AI15,i_DefaultColour)),\"\")","v":""},null,null,{"$f":"IF(ISNUMBER(FIND(\"x\",BE15)),IFERROR(INDEX(AI15:AQ15,0,MATCH(AT15,AI15:AQ15,0)),AS15),\"\")","v":""},{"$f":"IF(ISNUMBER(FIND(\"x\",BE15)),IFERROR(INDEX(INDIRECT(\"T_FinishColour[ColourCode-\"&IF(ISNUMBER(FIND(\"xxx\",BE15)),\"xxx\",IF(ISNUMBER(FIND(\"xx\",BE15)),\"xx\",\"error\"))&AR15&\"]\"),MATCH(AV15,T_FinishColour[Finish / Colour],0)),\"\"),\"\")","v":""},null,{"$f":"IF(AND(ISBLANK(BC15),ISBLANK(C15)),\"HIDE\",_xlfn.SWITCH(PRODUCT(C15:Z15,B15),2,\"HEADING\",1,\"SHOW\",0,\"HIDE\"))","v":"HIDE"},null,null,null,{"$f":"_xlfn.IFNA(SUBSTITUTE(IF(AR15=\"AU\",SUBSTITUTE(BE15,\"xxx\",AW15),SUBSTITUTE(SUBSTITUTE(BE15,\"xx\",AW15),\"x\",\"\")),\"LLL\",\"580\"),BE15)","v":""},null,null,null,null,{"$f":"IF(ISBLANK(BO15),\"\",IF(OR(BO15=L_Units),\"Y\",\"N\"))","v":""},null,{"$f":"IFERROR(_xlfn.SINGLE(IF(BH15=\"Y\",((INDEX(#REF!,MATCH(BI15,#REF!,0),0))),\"\")),\"\")","v":""},null,{"$f":"IFERROR(IF(BH15=\"Y\",INDIRECT(BK15)-BJ15,\"\"),\"\")","v":""},{"$f":"IFERROR(IF(BH15=\"Y\",BL15,\"\"),\"\")","v":""},{"$f":"IFERROR(IF(BH15=\"Y\",TEXT(BL15/25.4,\"0\"&IF(ABS(BL15/25.4-ROUND(BL15/25.4,0))>1/32,\"-0/\"&CHOOSE(ROUND(MOD(BL15/25.4,1)*16,0),16,8,16,4,16,8,16,2,16,8,16,4,16,8,16),\"\")),\"\"),\"\")","v":""},null,{"$f":"IFERROR(IF(ISBLANK(BC15),\"\",INDEX(T_NAV_AU[Base Unit of Measure],MATCH(BC15,T_NAV_AU[No.],0))),\"\")","v":""},null,null,null,null,{"$f":"IF(ISBLANK(BT15),\"\",PRODUCT(AE15,BT15))","v":""},{"$f":"IF(ISBLANK(BT15),\"\",PRODUCT(AE15,BT15,i_systemQTY))","v":""},{"$f":"IFERROR(INDEX(INDIRECT(\"T_NAV_\"&i_Location&\"[\"&i_Location&\"]\"),MATCH(1,--(BC15=INDIRECT(\"T_NAV_\"&i_Location&\"[No.]\"))*--((INDIRECT(\"T_NAV_\"&i_Location&\"[\"&i_Location&\"]\"))<>\"\"),0))/IF(AND(BQ15=\"METRE\",BG15<>\"\",BR15=\"\"),BG15,1),\"\")","v":""},{"$f":"IFERROR(IF(AND(AY15=\"SHOW\",BW15<>\"\"),BW15*BV15*IF(AND(BM15<>\"\",OR(BP15=\"LENGTH\",BP15=\"METRE\",BP15=\"ROLL\")),(BL15/1000),1),\"\"),\"\")","v":""},{"$f":"IF(BX15<>\"\",(INDIRECT(\"i_\"&BS15&\"discount\"))*BX15,\"\")","v":""},{"$f":"IFERROR(IF(BX15<>\"\",BX15-BY15,\"\"),\"\")","v":""}]
[null,2,{"$f":"IF(COUNTIF(AY17:AY20,\"SHOW\")>0,1,0)","v":0},"i_InstallationType",null,"i_OpenBktCovers",null,"i_OpenBktStyle",null,null,null,null,null,null,null,null,null,null,null,null,null,null,null,null,null,null,null,null,null,null,"",null,null,null,null,null,null,null,null,null,null,null,null,null,{"$f":"IF(ISNUMBER(FIND(\"x\",BE16)),IFERROR(INDEX(AI16:AQ16,0,MATCH(AT16,AI16:AQ16,0)),IF(AI16<>\"\",AI16,i_DefaultColour)),\"\")","v":""},null,null,{"$f":"IF(ISNUMBER(FIND(\"x\",BE16)),IFERROR(INDEX(AI16:AQ16,0,MATCH(AT16,AI16:AQ16,0)),AS16),\"\")","v":""},{"$f":"IF(ISNUMBER(FIND(\"x\",BE16)),IFERROR(INDEX(INDIRECT(\"T_FinishColour[ColourCode-\"&IF(ISNUMBER(FIND(\"xxx\",BE16)),\"xxx\",IF(ISNUMBER(FIND(\"xx\",BE16)),\"xx\",\"error\"))&AR16&\"]\"),MATCH(AV16,T_FinishColour[Finish / Colour],0)),\"\"),\"\")","v":""},null,{"$f":"IF(AND(ISBLANK(BC16),ISBLANK(C16)),\"HIDE\",_xlfn.SWITCH(PRODUCT(C16:Z16,B16),2,\"HEADING\",1,\"SHOW\",0,\"HIDE\"))","v":"HIDE"},null,null,null,{"$f":"_xlfn.IFNA(SUBSTITUTE(IF(AR16=\"AU\",SUBSTITUTE(BE16,\"xxx\",AW16),SUBSTITUTE(SUBSTITUTE(BE16,\"xx\",AW16),\"x\",\"\")),\"LLL\",\"580\"),BE16)","v":"BRACKETS"},null,"BRACKETS",null,null,null,null,{"$f":"IFERROR(_xlfn.SINGLE(IF(BH16=\"Y\",((INDEX(#REF!,MATCH(BI16,#REF!,0),0))),\"\")),\"\")","v":""},null,"","","",null,{"$f":"IFERROR(IF(ISBLANK(BC16),\"\",INDEX(T_NAV_AU[Base Unit of Measure],MATCH(BC16,T_NAV_AU[No.],0))),\"\")","v":""},null,null,null,null,"","",{"$f":"IFERROR(INDEX(INDIRECT(\"T_NAV_\"&i_Location&\"[\"&i_Location&\"]\"),MATCH(1,--(BC16=INDIRECT(\"T_NAV_\"&i_Location&\"[No.]\"))*--((INDIRECT(\"T_NAV_\"&i_Location&\"[\"&i_Location&\"]\"))<>\"\"),0))/IF(AND(BQ16=\"METRE\",BG16<>\"\",BR16=\"\"),BG16,1),\"\")","v":""},"","",""]
[null,null,null,"Open",{"$f":"IFERROR(IF(ISBLANK(D17),\"\",IF(FIND(D17,INDIRECT($D$16))>0,1,0)),0)","v":0},null,{"$f":"IFERROR(IF(ISBLANK(F17),\"\",IF(FIND(F17,INDIRECT($F$16))>0,1,0)),0)","v":""},"1.5\"",{"$f":"IFERROR(IF(ISBLANK(H17),\"\",IF(FIND(H17,INDIRECT($H$16))>0,1,0)),0)","v":0},null,null,null,null,null,null,null,null,null,null,null,null,null,null,null,null,null,null,null,null,null,"",null,null,null,"White",null,null,null,null,null,null,null,null,"AU","White",{"$f":"i_Finish","v":0},null,"White",{"$f":"IF(ISNUMBER(FIND(\"x\",BE17)),IFERROR(INDEX(INDIRECT(\"T_FinishColour[ColourCode-\"&IF(ISNUMBER(FIND(\"xxx\",BE17)),\"xxx\",IF(ISNUMBER(FIND(\"xx\",BE17)),\"xx\",\"error\"))&AR17&\"]\"),MATCH(AV17,T_FinishColour[Finish / Colour],0)),\"\"),\"\")","v":""},null,{"$f":"IF(AND(ISBLANK(BC17),ISBLANK(C17)),\"HIDE\",_xlfn.SWITCH(PRODUCT(C17:Z17,B17),2,\"HEADING\",1,\"SHOW\",0,\"HIDE\"))","v":"HIDE"},null,null,null,{"$f":"_xlfn.IFNA(SUBSTITUTE(IF(AR17=\"AU\",SUBSTITUTE(BE17,\"xxx\",AW17),SUBSTITUTE(SUBSTITUTE(BE17,\"xx\",AW17),\"x\",\"\")),\"LLL\",BG17*100),BE17)","v":"SLB660xx"},null,"SLB660xx","Skyline 1.5\" Brackets",null,{"$f":"IF(ISBLANK(BO17),\"\",IF(OR(BO17=L_Units),\"Y\",\"N\"))","v":"N"},null,{"$f":"IFERROR(_xlfn.SINGLE(IF(BH17=\"Y\",((INDEX(#REF!,MATCH(BI17,#REF!,0),0))),\"\")),\"\")","v":""},null,"","","","Piece",{"$f":"IFERROR(IF(ISBLANK(BC17),\"\",INDEX(T_NAV_AU[Base Unit of Measure],MATCH(BC17,T_NAV_AU[No.],0))),\"\")","v":""},null,null,"HW",2,2,2,{"$f":"IFERROR(INDEX(INDIRECT(\"T_NAV_\"&i_Location&\"[\"&i_Location&\"]\"),MATCH(1,--(BC17=INDIRECT(\"T_NAV_\"&i_Location&\"[No.]\"))*--((INDIRECT(\"T_NAV_\"&i_Location&\"[\"&i_Location&\"]\"))<>\"\"),0))/IF(AND(BQ17=\"METRE\",BG17<>\"\",BR17=\"\"),BG17,1),\"\")","v":""},"","",""]
[null,null,null,"Open",{"$f":"IFERROR(IF(ISBLANK(D18),\"\",IF(FIND(D18,INDIRECT($D$16))>0,1,0)),0)","v":0},"Yes",{"$f":"IFERROR(IF(ISBLANK(F18),\"\",IF(FIND(F18,INDIRECT($F$16))>0,1,0)),0)","v":0},"1.5\"",{"$f":"IFERROR(IF(ISBLANK(H18),\"\",IF(FIND(H18,INDIRECT($H$16))>0,1,0)),0)","v":0},null,null,null,null,null,null,null,null,null,null,null,null,null,null,null,null,null,null,null,null,null,"",null,null,null,"White",null,null,null,null,null,null,null,null,"AU",{"$f":"IF(ISNUMBER(FIND(\"x\",BE18)),IFERROR(INDEX(AI18:AQ18,0,MATCH(AT18,AI18:AQ18,0)),IF(AI18<>\"\",AI18,i_DefaultColour)),\"\")","v":"White"},{"$f":"i_Finish","v":0},null,{"$f":"IF(ISNUMBER(FIND(\"x\",BE18)),IFERROR(INDEX(AI18:AQ18,0,MATCH(AT18,AI18:AQ18,0)),AS18),\"\")","v":"White"},{"$f":"IF(ISNUMBER(FIND(\"x\",BE18)),IFERROR(INDEX(INDIRECT(\"T_FinishColour[ColourCode-\"&IF(ISNUMBER(FIND(\"xxx\",BE18)),\"xxx\",IF(ISNUMBER(FIND(\"xx\",BE18)),\"xx\",\"error\"))&AR18&\"]\"),MATCH(AV18,T_FinishColour[Finish / Colour],0)),\"\"),\"\")","v":""},null,{"$f":"IF(AND(ISBLANK(BC18),ISBLANK(C18)),\"HIDE\",_xlfn.SWITCH(PRODUCT(C18:Z18,B18),2,\"HEADING\",1,\"SHOW\",0,\"HIDE\"))","v":"HIDE"},null,null,null,{"$f":"_xlfn.IFNA(SUBSTITUTE(IF(AR18=\"AU\",SUBSTITUTE(BE18,\"xxx\",AW18),SUBSTITUTE(SUBSTITUTE(BE18,\"xx\",AW18),\"x\",\"\")),\"LLL\",BG18*100),BE18)","v":"SLBCxx"},null,"SLBCxx","Skyline 1.5\" Bracket Covers",null,{"$f":"IF(ISBLANK(BO18),\"\",IF(OR(BO18=L_Units),\"Y\",\"N\"))","v":"N"},null,{"$f":"IFERROR(_xlfn.SINGLE(IF(BH18=\"Y\",((INDEX(#REF!,MATCH(BI18,#REF!,0),0))),\"\")),\"\")","v":""},null,{"$f":"IFERROR(IF(BH18=\"Y\",INDIRECT(BK18)-BJ18,\"\"),\"\")","v":""},{"$f":"IFERROR(IF(BH18=\"Y\",BL18,\"\"),\"\")","v":""},{"$f":"IFERROR(IF(BH18=\"Y\",TEXT(BL18/25.4,\"0\"&IF(ABS(BL18/25.4-ROUND(BL18/25.4,0))>1/32,\"-0/\"&CHOOSE(ROUND(MOD(BL18/25.4,1)*16,0),16,8,16,4,16,8,16,2,16,8,16,4,16,8,16),\"\")),\"\"),\"\")","v":""},"Piece",{"$f":"IFERROR(IF(ISBLANK(BC18),\"\",INDEX(T_NAV_AU[Base Unit of Measure],MATCH(BC18,T_NAV_AU[No.],0))),\"\")","v":""},null,null,"HW",2,{"$f":"IF(ISBLANK(BT18),\"\",PRODUCT(AE18,BT18))","v":2},{"$f":"IF(ISBLANK(BT18),\"\",PRODUCT(AE18,BT18,i_systemQTY))","v":2},{"$f":"IFERROR(INDEX(INDIRECT(\"T_NAV_\"&i_Location&\"[\"&i_Location&\"]\"),MATCH(1,--(BC18=INDIRECT(\"T_NAV_\"&i_Location&\"[No.]\"))*--((INDIRECT(\"T_NAV_\"&i_Location&\"[\"&i_Location&\"]\"))<>\"\"),0))/IF(AND(BQ18=\"METRE\",BG18<>\"\",BR18=\"\"),BG18,1),\"\")","v":""},{"$f":"IFERROR(IF(AND(AY18=\"SHOW\",BW18<>\"\"),BW18*BV18*IF(AND(BM18<>\"\",OR(BP18=\"LENGTH\",BP18=\"METRE\",BP18=\"ROLL\")),(BL18/1000),1),\"\"),\"\")","v":""},{"$f":"IF(BX18<>\"\",(INDIRECT(\"i_\"&BS18&\"discount\"))*BX18,\"\")","v":""},{"$f":"IFERROR(IF(BX18<>\"\",BX18-BY18,\"\"),\"\")","v":""}]
[null,null,null,"Open",{"$f":"IFERROR(IF(ISBLANK(D19),\"\",IF(FIND(D19,INDIRECT($D$16))>0,1,0)),0)","v":0},null,{"$f":"IFERROR(IF(ISBLANK(F19),\"\",IF(FIND(F19,INDIRECT($F$16))>0,1,0)),0)","v":""},"LX",{"$f":"IFERROR(IF(ISBLANK(H19),\"\",IF(FIND(H19,INDIRECT($H$16))>0,1,0)),0)","v":0},null,null,null,null,null,null,null,null,null,null,null,null,null,null,null,null,null,null,null,null,null,"",null,null,null,"White",null,null,null,null,null,null,null,null,"AU","White",{"$f":"i_Finish","v":0},null,"White",{"$f":"IF(ISNUMBER(FIND(\"x\",BE19)),IFERROR(INDEX(INDIRECT(\"T_FinishColour[ColourCode-\"&IF(ISNUMBER(FIND(\"xxx\",BE19)),\"xxx\",IF(ISNUMBER(FIND(\"xx\",BE19)),\"xx\",\"error\"))&AR19&\"]\"),MATCH(AV19,T_FinishColour[Finish / Colour],0)),\"\"),\"\")","v":"069"},null,{"$f":"IF(AND(ISBLANK(BC19),ISBLANK(C19)),\"HIDE\",_xlfn.SWITCH(PRODUCT(C19:Z19,B19),2,\"HEADING\",1,\"SHOW\",0,\"HIDE\"))","v":"HIDE"},null,null,null,{"$f":"_xlfn.IFNA(SUBSTITUTE(IF(AR19=\"AU\",SUBSTITUTE(BE19,\"xxx\",AW19),SUBSTITUTE(SUBSTITUTE(BE19,\"xx\",AW19),\"x\",\"\")),\"LLL\",BG19*100),BE19)","v":"SL01-0306-069040"},null,"SL01-0306-xxx040","LX Skyline Brackets",null,{"$f":"IF(ISBLANK(BO19),\"\",IF(OR(BO19=L_Units),\"Y\",\"N\"))","v":"N"},null,{"$f":"IFERROR(_xlfn.SINGLE(IF(BH19=\"Y\",((INDEX(#REF!,MATCH(BI19,#REF!,0),0))),\"\")),\"\")","v":""},null,"","","","Piece",{"$f":"IFERROR(IF(ISBLANK(BC19),\"\",INDEX(T_NAV_AU[Base Unit of Measure],MATCH(BC19,T_NAV_AU[No.],0))),\"\")","v":""},null,null,"HW",2,2,2,{"$f":"IFERROR(INDEX(INDIRECT(\"T_NAV_\"&i_Location&\"[\"&i_Location&\"]\"),MATCH(1,--(BC19=INDIRECT(\"T_NAV_\"&i_Location&\"[No.]\"))*--((INDIRECT(\"T_NAV_\"&i_Location&\"[\"&i_Location&\"]\"))<>\"\"),0))/IF(AND(BQ19=\"METRE\",BG19<>\"\",BR19=\"\"),BG19,1),\"\")","v":""},"","",""]
[null,null,null,"Open",{"$f":"IFERROR(IF(ISBLANK(D20),\"\",IF(FIND(D20,INDIRECT($D$16))>0,1,0)),0)","v":0},"Yes",{"$f":"IFERROR(IF(ISBLANK(F20),\"\",IF(FIND(F20,INDIRECT($F$16))>0,1,0)),0)","v":0},"LX",{"$f":"IFERROR(IF(ISBLANK(H20),\"\",IF(FIND(H20,INDIRECT($H$16))>0,1,0)),0)","v":0},null,null,null,null,null,null,null,null,null,null,null,null,null,null,null,null,null,null,null,null,null,"",null,null,null,"White",null,null,null,null,null,null,null,null,"AU",{"$f":"IF(ISNUMBER(FIND(\"x\",BE20)),IFERROR(INDEX(AI20:AQ20,0,MATCH(AT20,AI20:AQ20,0)),IF(AI20<>\"\",AI20,i_DefaultColour)),\"\")","v":"White"},{"$f":"i_Finish","v":0},null,{"$f":"IF(ISNUMBER(FIND(\"x\",BE20)),IFERROR(INDEX(AI20:AQ20,0,MATCH(AT20,AI20:AQ20,0)),AS20),\"\")","v":"White"},{"$f":"IF(ISNUMBER(FIND(\"x\",BE20)),IFERROR(INDEX(INDIRECT(\"T_FinishColour[ColourCode-\"&IF(ISNUMBER(FIND(\"xxx\",BE20)),\"xxx\",IF(ISNUMBER(FIND(\"xx\",BE20)),\"xx\",\"error\"))&AR20&\"]\"),MATCH(AV20,T_FinishColour[Finish / Colour],0)),\"\"),\"\")","v":"069"},null,{"$f":"IF(AND(ISBLANK(BC20),ISBLANK(C20)),\"HIDE\",_xlfn.SWITCH(PRODUCT(C20:Z20,B20),2,\"HEADING\",1,\"SHOW\",0,\"HIDE\"))","v":"HIDE"},null,null,null,{"$f":"_xlfn.IFNA(SUBSTITUTE(IF(AR20=\"AU\",SUBSTITUTE(BE20,\"xxx\",AW20),SUBSTITUTE(SUBSTITUTE(BE20,\"xx\",AW20),\"x\",\"\")),\"LLL\",BG20*100),BE20)","v":"RB08-4151-069040"},null,"RB08-4151-xxx040","LX Bracket Covers",null,{"$f":"IF(ISBLANK(BO20),\"\",IF(OR(BO20=L_Units),\"Y\",\"N\"))","v":"N"},null,{"$f":"IFERROR(_xlfn.SINGLE(IF(BH20=\"Y\",((INDEX(#REF!,MATCH(BI20,#REF!,0),0))),\"\")),\"\")","v":""},null,{"$f":"IFERROR(IF(BH20=\"Y\",INDIRECT(BK20)-BJ20,\"\"),\"\")","v":""},{"$f":"IFERROR(IF(BH20=\"Y\",BL20,\"\"),\"\")","v":""},{"$f":"IFERROR(IF(BH20=\"Y\",TEXT(BL20/25.4,\"0\"&IF(ABS(BL20/25.4-ROUND(BL20/25.4,0))>1/32,\"-0/\"&CHOOSE(ROUND(MOD(BL20/25.4,1)*16,0),16,8,16,4,16,8,16,2,16,8,16,4,16,8,16),\"\")),\"\"),\"\")","v":""},"Piece",{"$f":"IFERROR(IF(ISBLANK(BC20),\"\",INDEX(T_NAV_AU[Base Unit of Measure],MATCH(BC20,T_NAV_AU[No.],0))),\"\")","v":""},null,null,"HW",2,{"$f":"IF(ISBLANK(BT20),\"\",PRODUCT(AE20,BT20))","v":2},{"$f":"IF(ISBLANK(BT20),\"\",PRODUCT(AE20,BT20,i_systemQTY))","v":2},{"$f":"IFERROR(INDEX(INDIRECT(\"T_NAV_\"&i_Location&\"[\"&i_Location&\"]\"),MATCH(1,--(BC20=INDIRECT(\"T_NAV_\"&i_Location&\"[No.]\"))*--((INDIRECT(\"T_NAV_\"&i_Location&\"[\"&i_Location&\"]\"))<>\"\"),0))/IF(AND(BQ20=\"METRE\",BG20<>\"\",BR20=\"\"),BG20,1),\"\")","v":""},{"$f":"IFERROR(IF(AND(AY20=\"SHOW\",BW20<>\"\"),BW20*BV20*IF(AND(BM20<>\"\",OR(BP20=\"LENGTH\",BP20=\"METRE\",BP20=\"ROLL\")),(BL20/1000),1),\"\"),\"\")","v":""},{"$f":"IF(BX20<>\"\",(INDIRECT(\"i_\"&BS20&\"discount\"))*BX20,\"\")","v":""},{"$f":"IFERROR(IF(BX20<>\"\",BX20-BY20,\"\"),\"\")","v":""}]
[null,2,{"$f":"C22","v":0},null,null,null,null,null,null,null,null,null,null,null,null,null,null,null,null,null,null,null,null,null,null,null,null,null,null,null,"",null,null,null,null,null,null,null,null,null,null,null,null,null,"",null,null,"",{"$f":"IF(ISNUMBER(FIND(\"x\",BE21)),IFERROR(INDEX(INDIRECT(\"T_FinishColour[ColourCode-\"&IF(ISNUMBER(FIND(\"xxx\",BE21)),\"xxx\",IF(ISNUMBER(FIND(\"xx\",BE21)),\"xx\",\"error\"))&AR21&\"]\"),MATCH(AV21,T_FinishColour[Finish / Colour],0)),\"\"),\"\")","v":""},null,{"$f":"IF(AND(ISBLANK(BC21),ISBLANK(C21)),\"HIDE\",_xlfn.SWITCH(PRODUCT(C21:Z21,B21),2,\"HEADING\",1,\"SHOW\",0,\"HIDE\"))","v":"HIDE"},null,null,null,{"$f":"_xlfn.IFNA(SUBSTITUTE(IF(AR21=\"AU\",SUBSTITUTE(BE21,\"xxx\",AW21),SUBSTITUTE(SUBSTITUTE(BE21,\"xx\",AW21),\"x\",\"\")),\"LLL\",\"580\"),BE21)","v":""},null,null,null,null,{"$f":"IF(ISBLANK(BO21),\"\",IF(OR(BO21=L_Units),\"Y\",\"N\"))","v":""},null,{"$f":"IFERROR(_xlfn.SINGLE(IF(BH21=\"Y\",((INDEX(#REF!,MATCH(BI21,#REF!,0),0))),\"\")),\"\")","v":""},null,{"$f":"IFERROR(IF(BH21=\"Y\",INDIRECT(BK21)-BJ21,\"\"),\"\")","v":""},"","",null,{"$f":"IFERROR(IF(ISBLANK(BC21),\"\",INDEX(T_NAV_AU[Base Unit of Measure],MATCH(BC21,T_NAV_AU[No.],0))),\"\")","v":""},null,null,null,null,"","",{"$f":"IFERROR(INDEX(INDIRECT(\"T_NAV_\"&i_Location&\"[\"&i_Location&\"]\"),MATCH(1,--(BC21=INDIRECT(\"T_NAV_\"&i_Location&\"[No.]\"))*--((INDIRECT(\"T_NAV_\"&i_Location&\"[\"&i_Location&\"]\"))<>\"\"),0))/IF(AND(BQ21=\"METRE\",BG21<>\"\",BR21=\"\"),BG21,1),\"\")","v":""},{"$f":"IFERROR(IF(AND(AY21=\"SHOW\",BW21<>\"\"),BW21*BV21*IF(AND(BM21<>\"\",OR(BP21=\"LENGTH\",BP21=\"METRE\",BP21=\"ROLL\")),(BL21/1000),1),\"\"),\"\")","v":""},{"$f":"IF(BX21<>\"\",(INDIRECT(\"i_\"&BS21&\"discount\"))*BX21,\"\")","v":""},{"$f":"IFERROR(IF(BX21<>\"\",BX21-BY21,\"\"),\"\")","v":""}]
[null,2,{"$f":"IF(COUNTIF(AY23:AY29,\"SHOW\")>0,1,0)","v":0},"i_ControlType",null,"i_Tube",null,null,null,null,null,null,null,null,null,null,null,null,null,null,null,null,null,null,null,null,null,null,null,null,"",null,null,null,null,null,null,null,null,null,null,null,null,null,"",null,null,"",{"$f":"IF(ISNUMBER(FIND(\"x\",BE22)),IFERROR(INDEX(INDIRECT(\"T_FinishColour[ColourCode-\"&IF(ISNUMBER(FIND(\"xxx\",BE22)),\"xxx\",IF(ISNUMBER(FIND(\"xx\",BE22)),\"xx\",\"error\"))&AR22&\"]\"),MATCH(AV22,T_FinishColour[Finish / Colour],0)),\"\"),\"\")","v":""},null,{"$f":"IF(AND(ISBLANK(BC22),ISBLANK(C22)),\"HIDE\",_xlfn.SWITCH(PRODUCT(C22:Z22,B22),2,\"HEADING\",1,\"SHOW\",0,\"HIDE\"))","v":"HIDE"},null,null,null,"EASY SPRING AIR",null,"EASY SPRING AIR",null,null,null,null,{"$f":"IFERROR(_xlfn.SINGLE(IF(BH22=\"Y\",((INDEX(#REF!,MATCH(BI22,#REF!,0),0))),\"\")),\"\")","v":""},null,"","","",null,{"$f":"IFERROR(IF(ISBLANK(BC22),\"\",INDEX(T_NAV_AU[Base Unit of Measure],MATCH(BC22,T_NAV_AU[No.],0))),\"\")","v":""},null,null,null,null,"",{"$f":"IF(ISBLANK(BT22),\"\",PRODUCT(AE22,BT22,i_systemQTY))","v":""},{"$f":"IFERROR(INDEX(INDIRECT(\"T_NAV_\"&i_Location&\"[\"&i_Location&\"]\"),MATCH(1,--(BC22=INDIRECT(\"T_NAV_\"&i_Location&\"[No.]\"))*--((INDIRECT(\"T_NAV_\"&i_Location&\"[\"&i_Location&\"]\"))<>\"\"),0))/IF(AND(BQ22=\"METRE\",BG22<>\"\",BR22=\"\"),BG22,1),\"\")","v":""},"","",""]
[null,null,null,"MICRO",{"$f":"IFERROR(IF(ISBLANK(D23),\"\",IF(FIND(D23,INDIRECT($D$22))>0,1,0)),0)","v":0},null,{"$f":"IFERROR(IF(ISBLANK(F23),\"\",IF(FIND(F23,INDIRECT($F$22))>0,1,0)),0)","v":""},null,{"$f":"IFERROR(IF(ISBLANK(H23),\"\",IF(FIND(H23,INDIRECT($H$22))>0,1,0)),0)","v":""},null,{"$f":"IFERROR(IF(ISBLANK(J23),\"\",IF(FIND(J23,INDIRECT($J$22))>0,1,0)),0)","v":""},null,{"$f":"IFERROR(IF(ISBLANK(L23),\"\",IF(FIND(L23,INDIRECT($L$22))>0,1,0)),0)","v":""},null,null,null,null,null,null,null,null,null,null,null,null,null,null,null,null,null,"",null,null,null,"White",null,null,null,null,null,null,null,null,"AU",{"$f":"IF(ISNUMBER(FIND(\"x\",BE23)),IFERROR(INDEX(AI23:AQ23,0,MATCH(AT23,AI23:AQ23,0)),IF(AI23<>\"\",AI23,i_DefaultColour)),\"\")","v":"White"},{"$f":"i_Finish","v":0},null,{"$f":"IF(ISNUMBER(FIND(\"x\",BE23)),IFERROR(INDEX(AI23:AQ23,0,MATCH(AT23,AI23:AQ23,0)),AS23),\"\")","v":"White"},{"$f":"IF(ISNUMBER(FIND(\"x\",BE23)),IFERROR(INDEX(INDIRECT(\"T_FinishColour[ColourCode-\"&IF(ISNUMBER(FIND(\"xxx\",BE23)),\"xxx\",IF(ISNUMBER(FIND(\"xx\",BE23)),\"xx\",\"error\"))&AR23&\"]\"),MATCH(AV23,T_FinishColour[Finish / Colour],0)),\"\"),\"\")","v":"069"},null,{"$f":"IF(AND(ISBLANK(BC23),ISBLANK(C23)),\"HIDE\",_xlfn.SWITCH(PRODUCT(C23:Z23,B23),2,\"HEADING\",1,\"SHOW\",0,\"HIDE\"))","v":"HIDE"},null,null,null,"RB12-3828-069038",null,"RB12-3828-xxx038","Easy Spring Air MICRO w. Adjust - 1.5\" LH",null,{"$f":"IF(ISBLANK(BO23),\"\",IF(OR(BO23=L_Units),\"Y\",\"N\"))","v":"N"},null,{"$f":"IFERROR(_xlfn.SINGLE(IF(BH23=\"Y\",((INDEX(#REF!,MATCH(BI23,#REF!,0),0))),\"\")),\"\")","v":""},null,"",{"$f":"IFERROR(IF(BH23=\"Y\",BL23,\"\"),\"\")","v":""},{"$f":"IFERROR(IF(BH23=\"Y\",TEXT(BL23/25.4,\"0\"&IF(ABS(BL23/25.4-ROUND(BL23/25.4,0))>1/32,\"-0/\"&CHOOSE(ROUND(MOD(BL23/25.4,1)*16,0),16,8,16,4,16,8,16,2,16,8,16,4,16,8,16),\"\")),\"\"),\"\")","v":""},"Set",{"$f":"IFERROR(IF(ISBLANK(BC23),\"\",INDEX(T_NAV_AU[Base Unit of Measure],MATCH(BC23,T_NAV_AU[No.],0))),\"\")","v":""},null,null,"HW",1,1,1,{"$f":"IFERROR(INDEX(INDIRECT(\"T_NAV_\"&i_Location&\"[\"&i_Location&\"]\"),MATCH(1,--(BC23=INDIRECT(\"T_NAV_\"&i_Location&\"[No.]\"))*--((INDIRECT(\"T_NAV_\"&i_Location&\"[\"&i_Location&\"]\"))<>\"\"),0))/IF(AND(BQ23=\"METRE\",BG23<>\"\",BR23=\"\"),BG23,1),\"\")","v":""},"","",""]
[null,null,null,"SMALL",0,null,"",null,"",null,"",null,"",null,null,null,null,null,null,null,null,null,null,null,null,null,null,null,null,null,"",null,null,null,"White",null,null,null,null,null,null,null,null,"AU",{"$f":"IF(ISNUMBER(FIND(\"x\",BE24)),IFERROR(INDEX(AI24:AQ24,0,MATCH(AT24,AI24:AQ24,0)),IF(AI24<>\"\",AI24,i_DefaultColour)),\"\")","v":"White"},0,null,{"$f":"IF(ISNUMBER(FIND(\"x\",BE24)),IFERROR(INDEX(AI24:AQ24,0,MATCH(AT24,AI24:AQ24,0)),AS24),\"\")","v":"White"},{"$f":"IF(ISNUMBER(FIND(\"x\",BE24)),IFERROR(INDEX(INDIRECT(\"T_FinishColour[ColourCode-\"&IF(ISNUMBER(FIND(\"xxx\",BE24)),\"xxx\",IF(ISNUMBER(FIND(\"xx\",BE24)),\"xx\",\"error\"))&AR24&\"]\"),MATCH(AV24,T_FinishColour[Finish / Colour],0)),\"\"),\"\")","v":"069"},null,{"$f":"IF(AND(ISBLANK(BC24),ISBLANK(C24)),\"HIDE\",_xlfn.SWITCH(PRODUCT(C24:Z24,B24),2,\"HEADING\",1,\"SHOW\",0,\"HIDE\"))","v":"HIDE"},null,null,null,{"$f":"_xlfn.IFNA(SUBSTITUTE(IF(AR24=\"AU\",SUBSTITUTE(BE24,\"xxx\",AW24),SUBSTITUTE(SUBSTITUTE(BE24,\"xx\",AW24),\"x\",\"\")),\"LLL\",\"580\"),BE24)","v":"RB12-3829-069038"},null,"RB12-3829-xxx038","Easy Spring Air SMALL w. Adjust - 1.5\" LH",null,{"$f":"IF(ISBLANK(BO24),\"\",IF(OR(BO24=L_Units),\"Y\",\"N\"))","v":"N"},null,{"$f":"IFERROR(_xlfn.SINGLE(IF(BH24=\"Y\",((INDEX(#REF!,MATCH(BI24,#REF!,0),0))),\"\")),\"\")","v":""},null,{"$f":"IFERROR(IF(BH24=\"Y\",INDIRECT(BK24)-BJ24,\"\"),\"\")","v":""},{"$f":"IFERROR(IF(BH24=\"Y\",BL24,\"\"),\"\")","v":""},{"$f":"IFERROR(IF(BH24=\"Y\",TEXT(BL24/25.4,\"0\"&IF(ABS(BL24/25.4-ROUND(BL24/25.4,0))>1/32,\"-0/\"&CHOOSE(ROUND(MOD(BL24/25.4,1)*16,0),16,8,16,4,16,8,16,2,16,8,16,4,16,8,16),\"\")),\"\"),\"\")","v":""},"Set",{"$f":"IFERROR(IF(ISBLANK(BC24),\"\",INDEX(T_NAV_AU[Base Unit of Measure],MATCH(BC24,T_NAV_AU[No.],0))),\"\")","v":""},null,null,"HW",1,{"$f":"IF(ISBLANK(BT24),\"\",PRODUCT(AE24,BT24))","v":1},{"$f":"IF(ISBLANK(BT24),\"\",PRODUCT(AE24,BT24,i_systemQTY))","v":1},{"$f":"IFERROR(INDEX(INDIRECT(\"T_NAV_\"&i_Location&\"[\"&i_Location&\"]\"),MATCH(1,--(BC24=INDIRECT(\"T_NAV_\"&i_Location&\"[No.]\"))*--((INDIRECT(\"T_NAV_\"&i_Location&\"[\"&i_Location&\"]\"))<>\"\"),0))/IF(AND(BQ24=\"METRE\",BG24<>\"\",BR24=\"\"),BG24,1),\"\")","v":""},{"$f":"IFERROR(IF(AND(AY24=\"SHOW\",BW24<>\"\"),BW24*BV24*IF(AND(BM24<>\"\",OR(BP24=\"LENGTH\",BP24=\"METRE\",BP24=\"ROLL\")),(BL24/1000),1),\"\"),\"\")","v":""},{"$f":"IF(BX24<>\"\",(INDIRECT(\"i_\"&BS24&\"discount\"))*BX24,\"\")","v":""},{"$f":"IFERROR(IF(BX24<>\"\",BX24-BY24,\"\"),\"\")","v":""}]
[null,null,null,"MINI",0,null,"",null,"",null,"",null,"",null,null,null,null,null,null,null,null,null,null,null,null,null,null,null,null,null,"",null,null,null,"White",null,null,null,null,null,null,null,null,"AU","White",0,null,"White",{"$f":"IF(ISNUMBER(FIND(\"x\",BE25)),IFERROR(INDEX(INDIRECT(\"T_FinishColour[ColourCode-\"&IF(ISNUMBER(FIND(\"xxx\",BE25)),\"xxx\",IF(ISNUMBER(FIND(\"xx\",BE25)),\"xx\",\"error\"))&AR25&\"]\"),MATCH(AV25,T_FinishColour[Finish / Colour],0)),\"\"),\"\")","v":"069"},null,{"$f":"IF(AND(ISBLANK(BC25),ISBLANK(C25)),\"HIDE\",_xlfn.SWITCH(PRODUCT(C25:Z25,B25),2,\"HEADING\",1,\"SHOW\",0,\"HIDE\"))","v":"HIDE"},null,null,null,"RB12-3831-069038",null,"RB12-3831-xxx038","Easy Spring Air MINI w. Adjust - 1.5\" LH",null,{"$f":"IF(ISBLANK(BO25),\"\",IF(OR(BO25=L_Units),\"Y\",\"N\"))","v":"N"},null,{"$f":"IFERROR(_xlfn.SINGLE(IF(BH25=\"Y\",((INDEX(#REF!,MATCH(BI25,#REF!,0),0))),\"\")),\"\")","v":""},null,"","","","Set",{"$f":"IFERROR(IF(ISBLANK(BC25),\"\",INDEX(T_NAV_AU[Base Unit of Measure],MATCH(BC25,T_NAV_AU[No.],0))),\"\")","v":""},null,null,"HW",1,1,1,{"$f":"IFERROR(INDEX(INDIRECT(\"T_NAV_\"&i_Location&\"[\"&i_Location&\"]\"),MATCH(1,--(BC25=INDIRECT(\"T_NAV_\"&i_Location&\"[No.]\"))*--((INDIRECT(\"T_NAV_\"&i_Location&\"[\"&i_Location&\"]\"))<>\"\"),0))/IF(AND(BQ25=\"METRE\",BG25<>\"\",BR25=\"\"),BG25,1),\"\")","v":""},"","",""]
[null,null,null,"LIGHT",0,null,"",null,"",null,"",null,"",null,null,null,null,null,null,null,null,null,null,null,null,null,null,null,null,null,"",null,null,null,"White",null,null,null,null,null,null,null,null,"AU","White",0,null,"White",{"$f":"IF(ISNUMBER(FIND(\"x\",BE26)),IFERROR(INDEX(INDIRECT(\"T_FinishColour[ColourCode-\"&IF(ISNUMBER(FIND(\"xxx\",BE26)),\"xxx\",IF(ISNUMBER(FIND(\"xx\",BE26)),\"xx\",\"error\"))&AR26&\"]\"),MATCH(AV26,T_FinishColour[Finish / Colour],0)),\"\"),\"\")","v":"069"},null,{"$f":"IF(AND(ISBLANK(BC26),ISBLANK(C26)),\"HIDE\",_xlfn.SWITCH(PRODUCT(C26:Z26,B26),2,\"HEADING\",1,\"SHOW\",0,\"HIDE\"))","v":"HIDE"},null,null,null,"RB12-3832-069038",null,"RB12-3832-xxx038","Easy Spring Air LIGHT w. Adjust - 1.5\" LH",null,{"$f":"IF(ISBLANK(BO26),\"\",IF(OR(BO26=L_Units),\"Y\",\"N\"))","v":"N"},null,{"$f":"IFERROR(_xlfn.SINGLE(IF(BH26=\"Y\",((INDEX(#REF!,MATCH(BI26,#REF!,0),0))),\"\")),\"\")","v":""},null,"","","","Set",{"$f":"IFERROR(IF(ISBLANK(BC26),\"\",INDEX(T_NAV_AU[Base Unit of Measure],MATCH(BC26,T_NAV_AU[No.],0))),\"\")","v":""},null,null,"HW",1,1,1,{"$f":"IFERROR(INDEX(INDIRECT(\"T_NAV_\"&i_Location&\"[\"&i_Location&\"]\"),MATCH(1,--(BC26=INDIRECT(\"T_NAV_\"&i_Location&\"[No.]\"))*--((INDIRECT(\"T_NAV_\"&i_Location&\"[\"&i_Location&\"]\"))<>\"\"),0))/IF(AND(BQ26=\"METRE\",BG26<>\"\",BR26=\"\"),BG26,1),\"\")","v":""},"","",""]
[null,null,null,"MED",0,null,"",null,"",null,"",null,"",null,null,null,null,null,null,null,null,null,null,null,null,null,null,null,null,null,"",null,null,null,"White",null,null,null,null,null,null,null,null,"AU","White",0,null,"White",{"$f":"IF(ISNUMBER(FIND(\"x\",BE27)),IFERROR(INDEX(INDIRECT(\"T_FinishColour[ColourCode-\"&IF(ISNUMBER(FIND(\"xxx\",BE27)),\"xxx\",IF(ISNUMBER(FIND(\"xx\",BE27)),\"xx\",\"error\"))&AR27&\"]\"),MATCH(AV27,T_FinishColour[Finish / Colour],0)),\"\"),\"\")","v":"069"},null,{"$f":"IF(AND(ISBLANK(BC27),ISBLANK(C27)),\"HIDE\",_xlfn.SWITCH(PRODUCT(C27:Z27,B27),2,\"HEADING\",1,\"SHOW\",0,\"HIDE\"))","v":"HIDE"},null,null,null,"RB12-3833-069038",null,"RB12-3833-xxx038","Easy Spring Air MEDIUM w. Adjust - 1.5\" LH",null,{"$f":"IF(ISBLANK(BO27),\"\",IF(OR(BO27=L_Units),\"Y\",\"N\"))","v":"N"},null,{"$f":"IFERROR(_xlfn.SINGLE(IF(BH27=\"Y\",((INDEX(#REF!,MATCH(BI27,#REF!,0),0))),\"\")),\"\")","v":""},null,"","","","Set",{"$f":"IFERROR(IF(ISBLANK(BC27),\"\",INDEX(T_NAV_AU[Base Unit of Measure],MATCH(BC27,T_NAV_AU[No.],0))),\"\")","v":""},null,null,"HW",1,{"$f":"IF(ISBLANK(BT27),\"\",PRODUCT(AE27,BT27))","v":1},1,{"$f":"IFERROR(INDEX(INDIRECT(\"T_NAV_\"&i_Location&\"[\"&i_Location&\"]\"),MATCH(1,--(BC27=INDIRECT(\"T_NAV_\"&i_Location&\"[No.]\"))*--((INDIRECT(\"T_NAV_\"&i_Location&\"[\"&i_Location&\"]\"))<>\"\"),0))/IF(AND(BQ27=\"METRE\",BG27<>\"\",BR27=\"\"),BG27,1),\"\")","v":""},"","",""]
[null,null,null,"HEAVY",0,null,"",null,"",null,"",null,"",null,null,null,null,null,null,null,null,null,null,null,null,null,null,null,null,null,"",null,null,null,"White",null,null,null,null,null,null,null,null,"AU","White",0,null,"White",{"$f":"IF(ISNUMBER(FIND(\"x\",BE28)),IFERROR(INDEX(INDIRECT(\"T_FinishColour[ColourCode-\"&IF(ISNUMBER(FIND(\"xxx\",BE28)),\"xxx\",IF(ISNUMBER(FIND(\"xx\",BE28)),\"xx\",\"error\"))&AR28&\"]\"),MATCH(AV28,T_FinishColour[Finish / Colour],0)),\"\"),\"\")","v":"069"},null,{"$f":"IF(AND(ISBLANK(BC28),ISBLANK(C28)),\"HIDE\",_xlfn.SWITCH(PRODUCT(C28:Z28,B28),2,\"HEADING\",1,\"SHOW\",0,\"HIDE\"))","v":"HIDE"},null,null,null,"RB12-3834-069038",null,"RB12-3834-xxx038","Easy Spring Air HEAVY w. Adjust - 1.5\" LH",null,{"$f":"IF(ISBLANK(BO28),\"\",IF(OR(BO28=L_Units),\"Y\",\"N\"))","v":"N"},null,{"$f":"IFERROR(_xlfn.SINGLE(IF(BH28=\"Y\",((INDEX(#REF!,MATCH(BI28,#REF!,0),0))),\"\")),\"\")","v":""},null,"","","","Set",{"$f":"IFERROR(IF(ISBLANK(BC28),\"\",INDEX(T_NAV_AU[Base Unit of Measure],MATCH(BC28,T_NAV_AU[No.],0))),\"\")","v":""},null,null,"HW",1,1,1,{"$f":"IFERROR(INDEX(INDIRECT(\"T_NAV_\"&i_Location&\"[\"&i_Location&\"]\"),MATCH(1,--(BC28=INDIRECT(\"T_NAV_\"&i_Location&\"[No.]\"))*--((INDIRECT(\"T_NAV_\"&i_Location&\"[\"&i_Location&\"]\"))<>\"\"),0))/IF(AND(BQ28=\"METRE\",BG28<>\"\",BR28=\"\"),BG28,1),\"\")","v":""},"","",""]
[null,null,null,null,{"$f":"IFERROR(IF(ISBLANK(D29),\"\",IF(FIND(D29,INDIRECT($D$31))>0,1,0)),0)","v":""},"2\"",{"$f":"IFERROR(IF(ISBLANK(F29),\"\",IF(FIND(F29,INDIRECT($F$22))>0,1,0)),0)","v":0},null,null,null,null,null,null,null,null,null,null,null,null,null,null,null,null,null,null,null,null,null,null,null,null,null,null,null,null,null,null,null,null,null,null,null,null,"AU","White",null,null,"White","069",null,{"$f":"IF(AND(ISBLANK(BC29),ISBLANK(C29)),\"HIDE\",_xlfn.SWITCH(PRODUCT(C29:Z29,B29),2,\"HEADING\",1,\"SHOW\",0,\"HIDE\"))","v":"HIDE"},null,null,null,"RB01-0107-069050",null,"RB01-0107-xxx050","Easy Spring Air Adapter kit, 2\" ",null,"N",null,null,null,"","","","Set",{"$f":"IFERROR(IF(ISBLANK(BC29),\"\",INDEX(T_NAV_AU[Base Unit of Measure],MATCH(BC29,T_NAV_AU[No.],0))),\"\")","v":""},null,null,"HW",1,1,1]
[null,2,{"$f":"C31","v":0},null,null,null,null,null,null,null,null,null,null,null,null,null,null,null,null,null,null,null,null,null,null,null,null,null,null,null,"",null,null,null,null,null,null,null,null,null,null,null,null,null,{"$f":"IF(ISNUMBER(FIND(\"x\",BE30)),IFERROR(INDEX(AI30:AQ30,0,MATCH(AT30,AI30:AQ30,0)),IF(AI30<>\"\",AI30,i_DefaultColour)),\"\")","v":""},null,null,{"$f":"IF(ISNUMBER(FIND(\"x\",BE30)),IFERROR(INDEX(AI30:AQ30,0,MATCH(AT30,AI30:AQ30,0)),AS30),\"\")","v":""},{"$f":"IF(ISNUMBER(FIND(\"x\",BE30)),IFERROR(INDEX(INDIRECT(\"T_FinishColour[ColourCode-\"&IF(ISNUMBER(FIND(\"xxx\",BE30)),\"xxx\",IF(ISNUMBER(FIND(\"xx\",BE30)),\"xx\",\"error\"))&AR30&\"]\"),MATCH(AV30,T_FinishColour[Finish / Colour],0)),\"\"),\"\")","v":""},null,{"$f":"IF(AND(ISBLANK(BC30),ISBLANK(C30)),\"HIDE\",_xlfn.SWITCH(PRODUCT(C30:Z30,B30),2,\"HEADING\",1,\"SHOW\",0,\"HIDE\"))","v":"HIDE"},null,null,null,{"$f":"_xlfn.IFNA(SUBSTITUTE(IF(AR30=\"AU\",SUBSTITUTE(BE30,\"xxx\",AW30),SUBSTITUTE(SUBSTITUTE(BE30,\"xx\",AW30),\"x\",\"\")),\"LLL\",\"580\"),BE30)","v":""},null,null,null,null,null,null,{"$f":"IFERROR(_xlfn.SINGLE(IF(BH30=\"Y\",((INDEX(#REF!,MATCH(BI30,#REF!,0),0))),\"\")),\"\")","v":""},null,{"$f":"IFERROR(IF(BH30=\"Y\",INDIRECT(BK30)-BJ30,\"\"),\"\")","v":""},{"$f":"IFERROR(IF(BH30=\"Y\",BL30,\"\"),\"\")","v":""},{"$f":"IFERROR(IF(BH30=\"Y\",TEXT(BL30/25.4,\"0\"&IF(ABS(BL30/25.4-ROUND(BL30/25.4,0))>1/32,\"-0/\"&CHOOSE(ROUND(MOD(BL30/25.4,1)*16,0),16,8,16,4,16,8,16,2,16,8,16,4,16,8,16),\"\")),\"\"),\"\")","v":""},null,{"$f":"IFERROR(IF(ISBLANK(BC30),\"\",INDEX(T_NAV_AU[Base Unit of Measure],MATCH(BC30,T_NAV_AU[No.],0))),\"\")","v":""},null,null,null,null,{"$f":"IF(ISBLANK(BT30),\"\",PRODUCT(AE30,BT30))","v":""},{"$f":"IF(ISBLANK(BT30),\"\",PRODUCT(AE30,BT30,i_systemQTY))","v":""},{"$f":"IFERROR(INDEX(INDIRECT(\"T_NAV_\"&i_Location&\"[\"&i_Location&\"]\"),MATCH(1,--(BC30=INDIRECT(\"T_NAV_\"&i_Location&\"[No.]\"))*--((INDIRECT(\"T_NAV_\"&i_Location&\"[\"&i_Location&\"]\"))<>\"\"),0))/IF(AND(BQ30=\"METRE\",BG30<>\"\",BR30=\"\"),BG30,1),\"\")","v":""},{"$f":"IFERROR(IF(AND(AY30=\"SHOW\",BW30<>\"\"),BW30*BV30*IF(AND(BM30<>\"\",OR(BP30=\"LENGTH\",BP30=\"METRE\",BP30=\"ROLL\")),(BL30/1000),1),\"\"),\"\")","v":""},{"$f":"IF(BX30<>\"\",(INDIRECT(\"i_\"&BS30&\"discount\"))*BX30,\"\")","v":""},{"$f":"IFERROR(IF(BX30<>\"\",BX30-BY30,\"\"),\"\")","v":""}]
[null,2,{"$f":"IF(COUNTIF(AY32:AY36,\"SHOW\")>0,1,0)","v":0},"i_Tube",null,"i_IdlerType",null,null,null,null,null,null,null,null,null,null,null,null,null,null,null,null,null,null,null,null,null,null,null,null,"",null,null,null,null,null,null,null,null,null,null,null,null,null,{"$f":"IF(ISNUMBER(FIND(\"x\",BE31)),IFERROR(INDEX(AI31:AQ31,0,MATCH(AT31,AI31:AQ31,0)),IF(AI31<>\"\",AI31,i_DefaultColour)),\"\")","v":""},null,null,{"$f":"IF(ISNUMBER(FIND(\"x\",BE31)),IFERROR(INDEX(AI31:AQ31,0,MATCH(AT31,AI31:AQ31,0)),AS31),\"\")","v":""},{"$f":"IF(ISNUMBER(FIND(\"x\",BE31)),IFERROR(INDEX(INDIRECT(\"T_FinishColour[ColourCode-\"&IF(ISNUMBER(FIND(\"xxx\",BE31)),\"xxx\",IF(ISNUMBER(FIND(\"xx\",BE31)),\"xx\",\"error\"))&AR31&\"]\"),MATCH(AV31,T_FinishColour[Finish / Colour],0)),\"\"),\"\")","v":""},null,{"$f":"IF(AND(ISBLANK(BC31),ISBLANK(C31)),\"HIDE\",_xlfn.SWITCH(PRODUCT(C31:Z31,B31),2,\"HEADING\",1,\"SHOW\",0,\"HIDE\"))","v":"HIDE"},null,null,null,"IDLER",null,"IDLER",null,null,null,null,{"$f":"IFERROR(_xlfn.SINGLE(IF(BH31=\"Y\",((INDEX(#REF!,MATCH(BI31,#REF!,0),0))),\"\")),\"\")","v":""},null,{"$f":"IFERROR(IF(BH31=\"Y\",INDIRECT(BK31)-BJ31,\"\"),\"\")","v":""},{"$f":"IFERROR(IF(BH31=\"Y\",BL31,\"\"),\"\")","v":""},{"$f":"IFERROR(IF(BH31=\"Y\",TEXT(BL31/25.4,\"0\"&IF(ABS(BL31/25.4-ROUND(BL31/25.4,0))>1/32,\"-0/\"&CHOOSE(ROUND(MOD(BL31/25.4,1)*16,0),16,8,16,4,16,8,16,2,16,8,16,4,16,8,16),\"\")),\"\"),\"\")","v":""},null,{"$f":"IFERROR(IF(ISBLANK(BC31),\"\",INDEX(T_NAV_AU[Base Unit of Measure],MATCH(BC31,T_NAV_AU[No.],0))),\"\")","v":""},null,null,null,null,{"$f":"IF(ISBLANK(BT31),\"\",PRODUCT(AE31,BT31))","v":""},{"$f":"IF(ISBLANK(BT31),\"\",PRODUCT(AE31,BT31,i_systemQTY))","v":""},{"$f":"IFERROR(INDEX(INDIRECT(\"T_NAV_\"&i_Location&\"[\"&i_Location&\"]\"),MATCH(1,--(BC31=INDIRECT(\"T_NAV_\"&i_Location&\"[No.]\"))*--((INDIRECT(\"T_NAV_\"&i_Location&\"[\"&i_Location&\"]\"))<>\"\"),0))/IF(AND(BQ31=\"METRE\",BG31<>\"\",BR31=\"\"),BG31,1),\"\")","v":""},{"$f":"IFERROR(IF(AND(AY31=\"SHOW\",BW31<>\"\"),BW31*BV31*IF(AND(BM31<>\"\",OR(BP31=\"LENGTH\",BP31=\"METRE\",BP31=\"ROLL\")),(BL31/1000),1),\"\"),\"\")","v":""},{"$f":"IF(BX31<>\"\",(INDIRECT(\"i_\"&BS31&\"discount\"))*BX31,\"\")","v":""},{"$f":"IFERROR(IF(BX31<>\"\",BX31-BY31,\"\"),\"\")","v":""}]
[null,null,null,null,{"$f":"IFERROR(IF(ISBLANK(D32),\"\",IF(FIND(D32,INDIRECT($D$31))>0,1,0)),0)","v":""},"Skyline Pin End",{"$f":"IFERROR(IF(ISBLANK(F32),\"\",IF(FIND(F32,INDIRECT($F$31))>0,1,0)),0)","v":0},null,{"$f":"IFERROR(IF(ISBLANK(H32),\"\",IF(FIND(H32,INDIRECT($H$31))>0,1,0)),0)","v":""},null,{"$f":"IFERROR(IF(ISBLANK(J32),\"\",IF(FIND(J32,INDIRECT($J$31))>0,1,0)),0)","v":""},null,{"$f":"IFERROR(IF(ISBLANK(L32),\"\",IF(FIND(L32,INDIRECT($L$31))>0,1,0)),0)","v":""},null,{"$f":"IFERROR(IF(ISBLANK(N32),\"\",IF(FIND(N32,INDIRECT($N$31))>0,1,0)),0)","v":""},null,{"$f":"IFERROR(IF(ISBLANK(P32),\"\",IF(FIND(P32,INDIRECT($P$31))>0,1,0)),0)","v":""},null,{"$f":"IFERROR(IF(ISBLANK(R32),\"\",IF(FIND(R32,INDIRECT($R$31))>0,1,0)),0)","v":""},null,{"$f":"IFERROR(IF(ISBLANK(T32),\"\",IF(FIND(T32,INDIRECT($T$31))>0,1,0)),0)","v":""},null,{"$f":"IFERROR(IF(ISBLANK(V32),\"\",IF(FIND(V32,INDIRECT($V$31))>0,1,0)),0)","v":""},null,null,null,null,null,null,null,"",null,null,null,null,null,null,null,null,null,null,null,null,"AU",{"$f":"IF(ISNUMBER(FIND(\"x\",BE32)),IFERROR(INDEX(AI32:AQ32,0,MATCH(AT32,AI32:AQ32,0)),IF(AI32<>\"\",AI32,i_DefaultColour)),\"\")","v":"Black"},{"$f":"i_Finish","v":0},null,{"$f":"IF(ISNUMBER(FIND(\"x\",BE32)),IFERROR(INDEX(AI32:AQ32,0,MATCH(AT32,AI32:AQ32,0)),AS32),\"\")","v":"Black"},{"$f":"IF(ISNUMBER(FIND(\"x\",BE32)),IFERROR(INDEX(INDIRECT(\"T_FinishColour[ColourCode-\"&IF(ISNUMBER(FIND(\"xxx\",BE32)),\"xxx\",IF(ISNUMBER(FIND(\"xx\",BE32)),\"xx\",\"error\"))&AR32&\"]\"),MATCH(AV32,T_FinishColour[Finish / Colour],0)),\"\"),\"\")","v":""},null,{"$f":"IF(AND(ISBLANK(BC32),ISBLANK(C32)),\"HIDE\",_xlfn.SWITCH(PRODUCT(C32:Z32,B32),2,\"HEADING\",1,\"SHOW\",0,\"HIDE\"))","v":"HIDE"},null,null,null,"SLPEV653xx",null,"SLPEV653xx","Skyline Pin End 1.5\"",null,{"$f":"IF(ISBLANK(BO32),\"\",IF(OR(BO32=L_Units),\"Y\",\"N\"))","v":"N"},null,{"$f":"IFERROR(_xlfn.SINGLE(IF(BH32=\"Y\",((INDEX(#REF!,MATCH(BI32,#REF!,0),0))),\"\")),\"\")","v":""},null,{"$f":"IFERROR(IF(BH32=\"Y\",INDIRECT(BK32)-BJ32,\"\"),\"\")","v":""},{"$f":"IFERROR(IF(BH32=\"Y\",BL32,\"\"),\"\")","v":""},{"$f":"IFERROR(IF(BH32=\"Y\",TEXT(BL32/25.4,\"0\"&IF(ABS(BL32/25.4-ROUND(BL32/25.4,0))>1/32,\"-0/\"&CHOOSE(ROUND(MOD(BL32/25.4,1)*16,0),16,8,16,4,16,8,16,2,16,8,16,4,16,8,16),\"\")),\"\"),\"\")","v":""},"Set",{"$f":"IFERROR(IF(ISBLANK(BC32),\"\",INDEX(T_NAV_AU[Base Unit of Measure],MATCH(BC32,T_NAV_AU[No.],0))),\"\")","v":""},null,null,"HW",1,{"$f":"IF(ISBLANK(BT32),\"\",PRODUCT(AE32,BT32))","v":1},{"$f":"IF(ISBLANK(BT32),\"\",PRODUCT(AE32,BT32,i_systemQTY))","v":1},{"$f":"IFERROR(INDEX(INDIRECT(\"T_NAV_\"&i_Location&\"[\"&i_Location&\"]\"),MATCH(1,--(BC32=INDIRECT(\"T_NAV_\"&i_Location&\"[No.]\"))*--((INDIRECT(\"T_NAV_\"&i_Location&\"[\"&i_Location&\"]\"))<>\"\"),0))/IF(AND(BQ32=\"METRE\",BG32<>\"\",BR32=\"\"),BG32,1),\"\")","v":""},{"$f":"IFERROR(IF(AND(AY32=\"SHOW\",BW32<>\"\"),BW32*BV32*IF(AND(BM32<>\"\",OR(BP32=\"LENGTH\",BP32=\"METRE\",BP32=\"ROLL\")),(BL32/1000),1),\"\"),\"\")","v":""},{"$f":"IF(BX32<>\"\",(INDIRECT(\"i_\"&BS32&\"discount\"))*BX32,\"\")","v":""},{"$f":"IFERROR(IF(BX32<>\"\",BX32-BY32,\"\"),\"\")","v":""}]
[null,null,null,null,{"$f":"IFERROR(IF(ISBLANK(D33),\"\",IF(FIND(D33,INDIRECT($D$31))>0,1,0)),0)","v":""},"Heavy",{"$f":"IFERROR(IF(ISBLANK(F33),\"\",IF(FIND(F33,INDIRECT($F$31))>0,1,0)),0)","v":0},null,{"$f":"IFERROR(IF(ISBLANK(H33),\"\",IF(FIND(H33,INDIRECT($H$31))>0,1,0)),0)","v":""},null,{"$f":"IFERROR(IF(ISBLANK(J33),\"\",IF(FIND(J33,INDIRECT($J$31))>0,1,0)),0)","v":""},null,{"$f":"IFERROR(IF(ISBLANK(L33),\"\",IF(FIND(L33,INDIRECT($L$31))>0,1,0)),0)","v":""},null,{"$f":"IFERROR(IF(ISBLANK(N33),\"\",IF(FIND(N33,INDIRECT($N$31))>0,1,0)),0)","v":""},null,{"$f":"IFERROR(IF(ISBLANK(P33),\"\",IF(FIND(P33,INDIRECT($P$31))>0,1,0)),0)","v":""},null,{"$f":"IFERROR(IF(ISBLANK(R33),\"\",IF(FIND(R33,INDIRECT($R$31))>0,1,0)),0)","v":""},null,{"$f":"IFERROR(IF(ISBLANK(T33),\"\",IF(FIND(T33,INDIRECT($T$31))>0,1,0)),0)","v":""},null,{"$f":"IFERROR(IF(ISBLANK(V33),\"\",IF(FIND(V33,INDIRECT($V$31))>0,1,0)),0)","v":""},null,null,null,null,null,null,null,"",null,null,null,null,null,null,null,null,null,null,null,null,"AU",{"$f":"IF(ISNUMBER(FIND(\"x\",BE33)),IFERROR(INDEX(AI33:AQ33,0,MATCH(AT33,AI33:AQ33,0)),IF(AI33<>\"\",AI33,i_DefaultColour)),\"\")","v":"Black"},{"$f":"i_Finish","v":0},null,{"$f":"IF(ISNUMBER(FIND(\"x\",BE33)),IFERROR(INDEX(AI33:AQ33,0,MATCH(AT33,AI33:AQ33,0)),AS33),\"\")","v":"Black"},{"$f":"IF(ISNUMBER(FIND(\"x\",BE33)),IFERROR(INDEX(INDIRECT(\"T_FinishColour[ColourCode-\"&IF(ISNUMBER(FIND(\"xxx\",BE33)),\"xxx\",IF(ISNUMBER(FIND(\"xx\",BE33)),\"xx\",\"error\"))&AR33&\"]\"),MATCH(AV33,T_FinishColour[Finish / Colour],0)),\"\"),\"\")","v":""},null,{"$f":"IF(AND(ISBLANK(BC33),ISBLANK(C33)),\"HIDE\",_xlfn.SWITCH(PRODUCT(C33:Z33,B33),2,\"HEADING\",1,\"SHOW\",0,\"HIDE\"))","v":"HIDE"},null,null,null,"SLPEHD53xx",null,"SLPEHD53xx","Skyline Heavy Duty Pin End 1.5\"",null,{"$f":"IF(ISBLANK(BO33),\"\",IF(OR(BO33=L_Units),\"Y\",\"N\"))","v":"N"},null,{"$f":"IFERROR(_xlfn.SINGLE(IF(BH33=\"Y\",((INDEX(#REF!,MATCH(BI33,#REF!,0),0))),\"\")),\"\")","v":""},null,{"$f":"IFERROR(IF(BH33=\"Y\",INDIRECT(BK33)-BJ33,\"\"),\"\")","v":""},{"$f":"IFERROR(IF(BH33=\"Y\",BL33,\"\"),\"\")","v":""},{"$f":"IFERROR(IF(BH33=\"Y\",TEXT(BL33/25.4,\"0\"&IF(ABS(BL33/25.4-ROUND(BL33/25.4,0))>1/32,\"-0/\"&CHOOSE(ROUND(MOD(BL33/25.4,1)*16,0),16,8,16,4,16,8,16,2,16,8,16,4,16,8,16),\"\")),\"\"),\"\")","v":""},"Set",{"$f":"IFERROR(IF(ISBLANK(BC33),\"\",INDEX(T_NAV_AU[Base Unit of Measure],MATCH(BC33,T_NAV_AU[No.],0))),\"\")","v":""},null,null,"HW",1,{"$f":"IF(ISBLANK(BT33),\"\",PRODUCT(AE33,BT33))","v":1},{"$f":"IF(ISBLANK(BT33),\"\",PRODUCT(AE33,BT33,i_systemQTY))","v":1},{"$f":"IFERROR(INDEX(INDIRECT(\"T_NAV_\"&i_Location&\"[\"&i_Location&\"]\"),MATCH(1,--(BC33=INDIRECT(\"T_NAV_\"&i_Location&\"[No.]\"))*--((INDIRECT(\"T_NAV_\"&i_Location&\"[\"&i_Location&\"]\"))<>\"\"),0))/IF(AND(BQ33=\"METRE\",BG33<>\"\",BR33=\"\"),BG33,1),\"\")","v":""},{"$f":"IFERROR(IF(AND(AY33=\"SHOW\",BW33<>\"\"),BW33*BV33*IF(AND(BM33<>\"\",OR(BP33=\"LENGTH\",BP33=\"METRE\",BP33=\"ROLL\")),(BL33/1000),1),\"\"),\"\")","v":""},{"$f":"IF(BX33<>\"\",(INDIRECT(\"i_\"&BS33&\"discount\"))*BX33,\"\")","v":""},{"$f":"IFERROR(IF(BX33<>\"\",BX33-BY33,\"\"),\"\")","v":""}]
[null,null,null,"1.5\"",{"$f":"IFERROR(IF(ISBLANK(D34),\"\",IF(FIND(D34,INDIRECT($D$31))>0,1,0)),0)","v":0},"Universal",{"$f":"IFERROR(IF(ISBLANK(F34),\"\",IF(FIND(F34,INDIRECT($F$31))>0,1,0)),0)","v":0},null,{"$f":"IFERROR(IF(ISBLANK(H34),\"\",IF(FIND(H34,INDIRECT($H$31))>0,1,0)),0)","v":""},null,{"$f":"IFERROR(IF(ISBLANK(J34),\"\",IF(FIND(J34,INDIRECT($J$31))>0,1,0)),0)","v":""},null,{"$f":"IFERROR(IF(ISBLANK(L34),\"\",IF(FIND(L34,INDIRECT($L$31))>0,1,0)),0)","v":""},null,{"$f":"IFERROR(IF(ISBLANK(N34),\"\",IF(FIND(N34,INDIRECT($N$31))>0,1,0)),0)","v":""},null,{"$f":"IFERROR(IF(ISBLANK(P34),\"\",IF(FIND(P34,INDIRECT($P$31))>0,1,0)),0)","v":""},null,{"$f":"IFERROR(IF(ISBLANK(R34),\"\",IF(FIND(R34,INDIRECT($R$31))>0,1,0)),0)","v":""},null,{"$f":"IFERROR(IF(ISBLANK(T34),\"\",IF(FIND(T34,INDIRECT($T$31))>0,1,0)),0)","v":""},null,{"$f":"IFERROR(IF(ISBLANK(V34),\"\",IF(FIND(V34,INDIRECT($V$31))>0,1,0)),0)","v":""},null,null,null,null,null,null,null,"",null,null,null,null,null,null,null,null,null,null,null,null,"AU",{"$f":"IF(ISNUMBER(FIND(\"x\",BE34)),IFERROR(INDEX(AI34:AQ34,0,MATCH(AT34,AI34:AQ34,0)),IF(AI34<>\"\",AI34,i_DefaultColour)),\"\")","v":""},{"$f":"i_Finish","v":0},null,{"$f":"IF(ISNUMBER(FIND(\"x\",BE34)),IFERROR(INDEX(AI34:AQ34,0,MATCH(AT34,AI34:AQ34,0)),AS34),\"\")","v":""},{"$f":"IF(ISNUMBER(FIND(\"x\",BE34)),IFERROR(INDEX(INDIRECT(\"T_FinishColour[ColourCode-\"&IF(ISNUMBER(FIND(\"xxx\",BE34)),\"xxx\",IF(ISNUMBER(FIND(\"xx\",BE34)),\"xx\",\"error\"))&AR34&\"]\"),MATCH(AV34,T_FinishColour[Finish / Colour],0)),\"\"),\"\")","v":""},null,{"$f":"IF(AND(ISBLANK(BC34),ISBLANK(C34)),\"HIDE\",_xlfn.SWITCH(PRODUCT(C34:Z34,B34),2,\"HEADING\",1,\"SHOW\",0,\"HIDE\"))","v":"HIDE"},null,null,null,"RB12-6101-069038",null,"RB12-6101-069038","Single Limiter | Universal 1.5\"",null,{"$f":"IF(ISBLANK(BO34),\"\",IF(OR(BO34=L_Units),\"Y\",\"N\"))","v":"N"},null,{"$f":"IFERROR(_xlfn.SINGLE(IF(BH34=\"Y\",((INDEX(#REF!,MATCH(BI34,#REF!,0),0))),\"\")),\"\")","v":""},null,{"$f":"IFERROR(IF(BH34=\"Y\",INDIRECT(BK34)-BJ34,\"\"),\"\")","v":""},{"$f":"IFERROR(IF(BH34=\"Y\",BL34,\"\"),\"\")","v":""},{"$f":"IFERROR(IF(BH34=\"Y\",TEXT(BL34/25.4,\"0\"&IF(ABS(BL34/25.4-ROUND(BL34/25.4,0))>1/32,\"-0/\"&CHOOSE(ROUND(MOD(BL34/25.4,1)*16,0),16,8,16,4,16,8,16,2,16,8,16,4,16,8,16),\"\")),\"\"),\"\")","v":""},"Set",{"$f":"IFERROR(IF(ISBLANK(BC34),\"\",INDEX(T_NAV_AU[Base Unit of Measure],MATCH(BC34,T_NAV_AU[No.],0))),\"\")","v":""},null,null,"HW",1,{"$f":"IF(ISBLANK(BT34),\"\",PRODUCT(AE34,BT34))","v":1},{"$f":"IF(ISBLANK(BT34),\"\",PRODUCT(AE34,BT34,i_systemQTY))","v":1},{"$f":"IFERROR(INDEX(INDIRECT(\"T_NAV_\"&i_Location&\"[\"&i_Location&\"]\"),MATCH(1,--(BC34=INDIRECT(\"T_NAV_\"&i_Location&\"[No.]\"))*--((INDIRECT(\"T_NAV_\"&i_Location&\"[\"&i_Location&\"]\"))<>\"\"),0))/IF(AND(BQ34=\"METRE\",BG34<>\"\",BR34=\"\"),BG34,1),\"\")","v":""},{"$f":"IFERROR(IF(AND(AY34=\"SHOW\",BW34<>\"\"),BW34*BV34*IF(AND(BM34<>\"\",OR(BP34=\"LENGTH\",BP34=\"METRE\",BP34=\"ROLL\")),(BL34/1000),1),\"\"),\"\")","v":""},{"$f":"IF(BX34<>\"\",(INDIRECT(\"i_\"&BS34&\"discount\"))*BX34,\"\")","v":""},{"$f":"IFERROR(IF(BX34<>\"\",BX34-BY34,\"\"),\"\")","v":""}]
[null,null,null,"1.5\"",{"$f":"IFERROR(IF(ISBLANK(D35),\"\",IF(FIND(D35,INDIRECT($D$31))>0,1,0)),0)","v":0},"Short",{"$f":"IFERROR(IF(ISBLANK(F35),\"\",IF(FIND(F35,INDIRECT($F$31))>0,1,0)),0)","v":0},null,{"$f":"IFERROR(IF(ISBLANK(H35),\"\",IF(FIND(H35,INDIRECT($H$31))>0,1,0)),0)","v":""},null,null,null,null,null,null,null,null,null,null,null,null,null,null,null,null,null,null,null,null,null,null,null,null,null,null,null,null,null,null,null,null,null,null,"AU",null,null,null,null,null,null,{"$f":"IF(AND(ISBLANK(BC35),ISBLANK(C35)),\"HIDE\",_xlfn.SWITCH(PRODUCT(C35:Z35,B35),2,\"HEADING\",1,\"SHOW\",0,\"HIDE\"))","v":"HIDE"},null,null,null,"RB12-6102-069038",null,"RB12-6102-069038","Single Stop Limiter | Short 1.5\"",null,"N",null,null,null,{"$f":"IFERROR(IF(BH35=\"Y\",INDIRECT(BK35)-BJ35,\"\"),\"\")","v":""},{"$f":"IFERROR(IF(BH35=\"Y\",BL35,\"\"),\"\")","v":""},{"$f":"IFERROR(IF(BH35=\"Y\",TEXT(BL35/25.4,\"0\"&IF(ABS(BL35/25.4-ROUND(BL35/25.4,0))>1/32,\"-0/\"&CHOOSE(ROUND(MOD(BL35/25.4,1)*16,0),16,8,16,4,16,8,16,2,16,8,16,4,16,8,16),\"\")),\"\"),\"\")","v":""},"Set",{"$f":"IFERROR(IF(ISBLANK(BC35),\"\",INDEX(T_NAV_AU[Base Unit of Measure],MATCH(BC35,T_NAV_AU[No.],0))),\"\")","v":""},null,null,"HW",1,{"$f":"IF(ISBLANK(BT35),\"\",PRODUCT(AE35,BT35))","v":1},{"$f":"IF(ISBLANK(BT35),\"\",PRODUCT(AE35,BT35,i_systemQTY))","v":1},{"$f":"IFERROR(INDEX(INDIRECT(\"T_NAV_\"&i_Location&\"[\"&i_Location&\"]\"),MATCH(1,--(BC35=INDIRECT(\"T_NAV_\"&i_Location&\"[No.]\"))*--((INDIRECT(\"T_NAV_\"&i_Location&\"[\"&i_Location&\"]\"))<>\"\"),0))/IF(AND(BQ35=\"METRE\",BG35<>\"\",BR35=\"\"),BG35,1),\"\")","v":""},{"$f":"IFERROR(IF(AND(AY35=\"SHOW\",BW35<>\"\"),BW35*BV35*IF(AND(BM35<>\"\",OR(BP35=\"LENGTH\",BP35=\"METRE\",BP35=\"ROLL\")),(BL35/1000),1),\"\"),\"\")","v":""},{"$f":"IF(BX35<>\"\",(INDIRECT(\"i_\"&BS35&\"discount\"))*BX35,\"\")","v":""},{"$f":"IFERROR(IF(BX35<>\"\",BX35-BY35,\"\"),\"\")","v":""}]
[null,null,null,"2\"",{"$f":"IFERROR(IF(ISBLANK(D36),\"\",IF(FIND(D36,INDIRECT($D$31))>0,1,0)),0)","v":0},null,"",null,null,null,null,null,null,null,null,null,null,null,null,null,null,null,null,null,null,null,null,null,null,null,null,null,null,null,null,null,null,null,null,null,null,null,null,null,null,null,null,null,null,null,{"$f":"IF(AND(ISBLANK(BC36),ISBLANK(C36)),\"HIDE\",_xlfn.SWITCH(PRODUCT(C36:Z36,B36),2,\"HEADING\",1,\"SHOW\",0,\"HIDE\"))","v":"HIDE"},null,null,null,"RA2",null,"RA2xx","2\" Adapter",null,"N",null,null,null,{"$f":"IFERROR(IF(BH36=\"Y\",INDIRECT(BK36)-BJ36,\"\"),\"\")","v":""},{"$f":"IFERROR(IF(BH36=\"Y\",BL36,\"\"),\"\")","v":""},{"$f":"IFERROR(IF(BH36=\"Y\",TEXT(BL36/25.4,\"0\"&IF(ABS(BL36/25.4-ROUND(BL36/25.4,0))>1/32,\"-0/\"&CHOOSE(ROUND(MOD(BL36/25.4,1)*16,0),16,8,16,4,16,8,16,2,16,8,16,4,16,8,16),\"\")),\"\"),\"\")","v":""},"Set",{"$f":"IFERROR(IF(ISBLANK(BC36),\"\",INDEX(T_NAV_AU[Base Unit of Measure],MATCH(BC36,T_NAV_AU[No.],0))),\"\")","v":""},null,null,"HW",1,{"$f":"IF(ISBLANK(BT36),\"\",PRODUCT(AE36,BT36))","v":1},{"$f":"IF(ISBLANK(BT36),\"\",PRODUCT(AE36,BT36,i_systemQTY))","v":1}]
[null,null,null,null,null,null,null,null,null,null,null,null,null,null,null,null,null,null,null,null,null,null,null,null,null,null,null,null,null,null,null,null,null,null,null,null,null,null,null,null,null,null,null,null,null,null,null,null,null,null,{"$f":"IF(AND(ISBLANK(BC37),ISBLANK(C37)),\"HIDE\",_xlfn.SWITCH(PRODUCT(C37:Z37,B37),2,\"HEADING\",1,\"SHOW\",0,\"HIDE\"))","v":"HIDE"}]
[null,2,{"$f":"C39","v":0},null,null,null,null,null,null,null,null,null,null,null,null,null,null,null,null,null,null,null,null,null,null,null,null,null,null,null,{"$f":"IFERROR(_xlfn.SINGLE(IF(AND(AA38=\"Y\",PRODUCT(AB38:AD38)=0),o_nScreens,IF(PRODUCT(AB38:AD38)=0,\"\",PRODUCT(AB38:AD38)))),\"\")","v":""},null,null,null,null,null,null,null,null,null,null,null,null,null,{"$f":"IF(ISNUMBER(FIND(\"x\",BE38)),IFERROR(INDEX(AI38:AQ38,0,MATCH(AT38,AI38:AQ38,0)),IF(AI38<>\"\",AI38,i_DefaultColour)),\"\")","v":""},null,null,{"$f":"IF(ISNUMBER(FIND(\"x\",BE38)),IFERROR(INDEX(AI38:AQ38,0,MATCH(AT38,AI38:AQ38,0)),AS38),\"\")","v":""},{"$f":"IF(ISNUMBER(FIND(\"x\",BE38)),IFERROR(INDEX(INDIRECT(\"T_FinishColour[ColourCode-\"&IF(ISNUMBER(FIND(\"xxx\",BE38)),\"xxx\",IF(ISNUMBER(FIND(\"xx\",BE38)),\"xx\",\"error\"))&AR38&\"]\"),MATCH(AV38,T_FinishColour[Finish / Colour],0)),\"\"),\"\")","v":""},null,{"$f":"IF(AND(ISBLANK(BC38),ISBLANK(C38)),\"HIDE\",_xlfn.SWITCH(PRODUCT(C38:Z38,B38),2,\"HEADING\",1,\"SHOW\",0,\"HIDE\"))","v":"HIDE"},null,null,null,{"$f":"_xlfn.IFNA(SUBSTITUTE(IF(AR38=\"AU\",SUBSTITUTE(BE38,\"xxx\",AW38),SUBSTITUTE(SUBSTITUTE(BE38,\"xx\",AW38),\"x\",\"\")),\"LLL\",\"580\"),BE38)","v":""},null,null,null,null,{"$f":"IF(ISBLANK(BO38),\"\",IF(OR(BO38=L_Units),\"Y\",\"N\"))","v":""},null,{"$f":"IFERROR(_xlfn.SINGLE(IF(BH38=\"Y\",((INDEX(#REF!,MATCH(BI38,#REF!,0),0))),\"\")),\"\")","v":""},null,{"$f":"IFERROR(IF(BH38=\"Y\",INDIRECT(BK38)-BJ38,\"\"),\"\")","v":""},"","",null,{"$f":"IFERROR(IF(ISBLANK(BC38),\"\",INDEX(T_NAV_AU[Base Unit of Measure],MATCH(BC38,T_NAV_AU[No.],0))),\"\")","v":""},null,null,null,null,"",{"$f":"IF(ISBLANK(BT38),\"\",PRODUCT(AE38,BT38,i_systemQTY))","v":""},{"$f":"IFERROR(INDEX(INDIRECT(\"T_NAV_\"&i_Location&\"[\"&i_Location&\"]\"),MATCH(1,--(BC38=INDIRECT(\"T_NAV_\"&i_Location&\"[No.]\"))*--((INDIRECT(\"T_NAV_\"&i_Location&\"[\"&i_Location&\"]\"))<>\"\"),0))/IF(AND(BQ38=\"METRE\",BG38<>\"\",BR38=\"\"),BG38,1),\"\")","v":""},{"$f":"IFERROR(IF(AND(AY38=\"SHOW\",BW38<>\"\"),BW38*BV38*IF(AND(BM38<>\"\",OR(BP38=\"LENGTH\",BP38=\"METRE\",BP38=\"ROLL\")),(BL38/1000),1),\"\"),\"\")","v":""},{"$f":"IF(BX38<>\"\",(INDIRECT(\"i_\"&BS38&\"discount\"))*BX38,\"\")","v":""},{"$f":"IFERROR(IF(BX38<>\"\",BX38-BY38,\"\"),\"\")","v":""}]
[null,2,{"$f":"IF(COUNTIF(AY40:AY54,\"SHOW\")>0,1,0)","v":0},"i_WeightBar",null,"i_wbSpline",null,"i_wbAccessories",null,"i_wbSplineTape",null,"i_Location",null,null,null,null,null,null,null,null,null,null,null,null,null,null,null,null,null,null,"",null,null,null,null,null,null,null,null,null,null,null,null,null,"",null,null,"",{"$f":"IF(ISNUMBER(FIND(\"x\",BE39)),IFERROR(INDEX(INDIRECT(\"T_FinishColour[ColourCode-\"&IF(ISNUMBER(FIND(\"xxx\",BE39)),\"xxx\",IF(ISNUMBER(FIND(\"xx\",BE39)),\"xx\",\"error\"))&AR39&\"]\"),MATCH(AV39,T_FinishColour[Finish / Colour],0)),\"\"),\"\")","v":""},null,{"$f":"IF(AND(ISBLANK(BC39),ISBLANK(C39)),\"HIDE\",_xlfn.SWITCH(PRODUCT(C39:Z39,B39),2,\"HEADING\",1,\"SHOW\",0,\"HIDE\"))","v":"HIDE"},null,null,null,"WEIGHT BAR",null,{"$f":"IF(i_Location=\"US\",\"HEM BAR\",\"WEIGHT BAR\")","v":"WEIGHT BAR"},null,null,null,null,{"$f":"IFERROR(_xlfn.SINGLE(IF(BH39=\"Y\",((INDEX(#REF!,MATCH(BI39,#REF!,0),0))),\"\")),\"\")","v":""},null,"","","",null,{"$f":"IFERROR(IF(ISBLANK(BC39),\"\",INDEX(T_NAV_AU[Base Unit of Measure],MATCH(BC39,T_NAV_AU[No.],0))),\"\")","v":""},null,null,null,null,"","",{"$f":"IFERROR(INDEX(INDIRECT(\"T_NAV_\"&i_Location&\"[\"&i_Location&\"]\"),MATCH(1,--(BC39=INDIRECT(\"T_NAV_\"&i_Location&\"[No.]\"))*--((INDIRECT(\"T_NAV_\"&i_Location&\"[\"&i_Location&\"]\"))<>\"\"),0))/IF(AND(BQ39=\"METRE\",BG39<>\"\",BR39=\"\"),BG39,1),\"\")","v":""},"","",""]
[null,null,null,"D30",{"$f":"IFERROR(IF(ISBLANK(D40),\"\",IF(FIND(D40,INDIRECT($D$39))>0,1,0)),0)","v":0},null,{"$f":"IFERROR(IF(ISBLANK(F40),\"\",IF(FIND(F40,INDIRECT($F$39))>0,1,0)),0)","v":""},null,{"$f":"IFERROR(IF(ISBLANK(H40),\"\",IF(FIND(H40,INDIRECT($H$39))>0,1,0)),0)","v":""},null,{"$f":"IFERROR(IF(ISBLANK(J40),\"\",IF(FIND(J40,INDIRECT($J$39))>0,1,0)),0)","v":""},null,{"$f":"IFERROR(IF(ISBLANK(L40),\"\",IF(FIND(L40,INDIRECT($L$39))>0,1,0)),0)","v":""},null,null,null,null,null,null,null,null,null,null,null,null,null,null,null,null,null,"",null,null,null,"White","Mill","Anodised",null,null,null,null,null,null,"AU","White",{"$f":"i_Finish","v":0},null,"White",{"$f":"IF(ISNUMBER(FIND(\"x\",BE40)),IFERROR(INDEX(INDIRECT(\"T_FinishColour[ColourCode-\"&IF(ISNUMBER(FIND(\"xxx\",BE40)),\"xxx\",IF(ISNUMBER(FIND(\"xx\",BE40)),\"xx\",\"error\"))&AR40&\"]\"),MATCH(AV40,T_FinishColour[Finish / Colour],0)),\"\"),\"\")","v":"069"},null,{"$f":"IF(AND(ISBLANK(BC40),ISBLANK(C40)),\"HIDE\",_xlfn.SWITCH(PRODUCT(C40:Z40,B40),2,\"HEADING\",1,\"SHOW\",0,\"HIDE\"))","v":"HIDE"},null,null,null,"RE15-0101-069580",null,{"$f":"\"RE15-0101-xxxLLL\"&IF(i_Finish=\"Powdercoat\",\"-PF\",\"\")","v":"RE15-0101-xxxLLL"},"D30 Medium Bottom Rail",5.8,{"$f":"IF(ISBLANK(BO40),\"\",IF(OR(BO40=L_Units),\"Y\",\"N\"))","v":{"$error":"#N/A"}},"wb",{"$f":"IFERROR(IF(BH40=\"Y\",((INDEX(T_Deduc18[Deduction],MATCH(BI40,T_Deduc18[Type],0),0))),\"\"),\"\")","v":""},"o_widthmm",{"$f":"IFERROR(IF(BH40=\"Y\",INDIRECT(BK40)-BJ40,\"\"),\"\")","v":""},"",{"$f":"IFERROR(IF(BH40=\"Y\",TEXT(BL40/25.4,\"0\"&IF(ABS(BL40/25.4-ROUND(BL40/25.4,0))>1/32,\"-0/\"&CHOOSE(ROUND(MOD(BL40/25.4,1)*16,0),16,8,16,4,16,8,16,2,16,8,16,4,16,8,16),\"\")),\"\"),\"\")","v":""},{"$f":"INDEX(T_UnitSelection[Units],MATCH(i_Units,T_UnitSelection[UnitSelection],0))","v":{"$error":"#N/A"}},{"$f":"IFERROR(IF(ISBLANK(BC40),\"\",INDEX(T_NAV_AU[Base Unit of Measure],MATCH(BC40,T_NAV_AU[No.],0))),\"\")","v":""},"METRE",null,"HW",1,1,1,{"$f":"IFERROR(INDEX(INDIRECT(\"T_NAV_\"&i_Location&\"[\"&i_Location&\"]\"),MATCH(1,--(BC40=INDIRECT(\"T_NAV_\"&i_Location&\"[No.]\"))*--((INDIRECT(\"T_NAV_\"&i_Location&\"[\"&i_Location&\"]\"))<>\"\"),0))/IF(AND(BQ40=\"METRE\",BG40<>\"\",BR40=\"\"),BG40,1),\"\")","v":""},"","",""]
[null,null,null,"D30",0,null,{"$f":"IFERROR(IF(ISBLANK(F41),\"\",IF(FIND(F41,INDIRECT($F$39))>0,1,0)),0)","v":""},null,{"$f":"IFERROR(IF(ISBLANK(H41),\"\",IF(FIND(H41,INDIRECT($H$39))>0,1,0)),0)","v":""},null,"",null,"",null,null,null,null,null,null,null,null,null,null,null,null,null,null,null,null,null,"",null,null,null,null,null,null,null,null,null,null,null,null,"AU","Black",0,null,"Black",{"$f":"IF(ISNUMBER(FIND(\"x\",BE41)),IFERROR(INDEX(INDIRECT(\"T_FinishColour[ColourCode-\"&IF(ISNUMBER(FIND(\"xxx\",BE41)),\"xxx\",IF(ISNUMBER(FIND(\"xx\",BE41)),\"xx\",\"error\"))&AR41&\"]\"),MATCH(AV41,T_FinishColour[Finish / Colour],0)),\"\"),\"\")","v":"050"},null,{"$f":"IF(AND(ISBLANK(BC41),ISBLANK(C41)),\"HIDE\",_xlfn.SWITCH(PRODUCT(C41:Z41,B41),2,\"HEADING\",1,\"SHOW\",0,\"HIDE\"))","v":"HIDE"},null,null,null,"RE15-0501-050000",null,"RE15-0501-xxx000","D30 Medium Bottom Rail End Caps LH & RH",null,{"$f":"IF(ISBLANK(BO41),\"\",IF(OR(BO41=L_Units),\"Y\",\"N\"))","v":"N"},null,{"$f":"IFERROR(_xlfn.SINGLE(IF(BH41=\"Y\",((INDEX(#REF!,MATCH(BI41,#REF!,0),0))),\"\")),\"\")","v":""},null,"","","","Set",{"$f":"IFERROR(IF(ISBLANK(BC41),\"\",INDEX(T_NAV_AU[Base Unit of Measure],MATCH(BC41,T_NAV_AU[No.],0))),\"\")","v":"SET"},null,null,"HW",1,1,1,{"$f":"IFERROR(INDEX(INDIRECT(\"T_NAV_\"&i_Location&\"[\"&i_Location&\"]\"),MATCH(1,--(BC41=INDIRECT(\"T_NAV_\"&i_Location&\"[No.]\"))*--((INDIRECT(\"T_NAV_\"&i_Location&\"[\"&i_Location&\"]\"))<>\"\"),0))/IF(AND(BQ41=\"METRE\",BG41<>\"\",BR41=\"\"),BG41,1),\"\")","v":""},"","",""]
[null,null,null,"D30",0,"NO",{"$f":"IFERROR(IF(ISBLANK(F42),\"\",IF(FIND(F42,INDIRECT($F$39))>0,1,0)),0)","v":0},null,{"$f":"IFERROR(IF(ISBLANK(H42),\"\",IF(FIND(H42,INDIRECT($H$39))>0,1,0)),0)","v":""},null,"",null,"",null,{"$f":"IFERROR(IF(ISBLANK(N42),\"\",IF(FIND(N42,INDIRECT($N$31))>0,1,0)),0)","v":""},null,{"$f":"IFERROR(IF(ISBLANK(P42),\"\",IF(FIND(P42,INDIRECT($P$31))>0,1,0)),0)","v":""},null,{"$f":"IFERROR(IF(ISBLANK(R42),\"\",IF(FIND(R42,INDIRECT($R$31))>0,1,0)),0)","v":""},null,{"$f":"IFERROR(IF(ISBLANK(T42),\"\",IF(FIND(T42,INDIRECT($T$31))>0,1,0)),0)","v":""},null,{"$f":"IFERROR(IF(ISBLANK(V42),\"\",IF(FIND(V42,INDIRECT($V$31))>0,1,0)),0)","v":""},null,null,null,null,null,null,null,"",null,null,null,"White",null,null,null,null,null,null,null,null,"AU","White",0,null,"White",{"$f":"IF(ISNUMBER(FIND(\"x\",BE42)),IFERROR(INDEX(INDIRECT(\"T_FinishColour[ColourCode-\"&IF(ISNUMBER(FIND(\"xxx\",BE42)),\"xxx\",IF(ISNUMBER(FIND(\"xx\",BE42)),\"xx\",\"error\"))&AR42&\"]\"),MATCH(AV42,T_FinishColour[Finish / Colour],0)),\"\"),\"\")","v":"069"},null,{"$f":"IF(AND(ISBLANK(BC42),ISBLANK(C42)),\"HIDE\",_xlfn.SWITCH(PRODUCT(C42:Z42,B42),2,\"HEADING\",1,\"SHOW\",0,\"HIDE\"))","v":"HIDE"},null,null,null,"RE15-0601-069001",null,"RE15-0601-xxx001","15mm Flat Spline",null,{"$f":"IF(ISBLANK(BO42),\"\",IF(OR(BO42=L_Units),\"Y\",\"N\"))","v":{"$error":"#N/A"}},"wbSeal",{"$f":"IFERROR(IF(BH42=\"Y\",((INDEX(T_Deduc18[Deduction],MATCH(BI42,T_Deduc18[Type],0),0))),\"\"),\"\")","v":""},"o_widthmm",{"$f":"IFERROR(IF(BH42=\"Y\",INDIRECT(BK42)-BJ42,\"\"),\"\")","v":""},"","",{"$f":"INDEX(T_UnitSelection[Units],MATCH(i_Units,T_UnitSelection[UnitSelection],0))","v":{"$error":"#N/A"}},{"$f":"IFERROR(IF(ISBLANK(BC42),\"\",INDEX(T_NAV_AU[Base Unit of Measure],MATCH(BC42,T_NAV_AU[No.],0))),\"\")","v":"SET"},"METRE",null,"HW",1,1,{"$f":"IF(ISBLANK(BT42),\"\",PRODUCT(AE42,BT42,i_systemQTY))","v":1},{"$f":"IFERROR(INDEX(INDIRECT(\"T_NAV_\"&i_Location&\"[\"&i_Location&\"]\"),MATCH(1,--(BC42=INDIRECT(\"T_NAV_\"&i_Location&\"[No.]\"))*--((INDIRECT(\"T_NAV_\"&i_Location&\"[\"&i_Location&\"]\"))<>\"\"),0))/IF(AND(BQ42=\"METRE\",BG42<>\"\",BR42=\"\"),BG42,1),\"\")","v":""},"","",""]
[null,null,null,"D30",0,"MP",{"$f":"(IFERROR(IF(ISBLANK(F43),\"\",IF(FIND(F43,INDIRECT($F$39))>0,1,0)),0)+IF(G44=1,-1,0))","v":0},null,{"$f":"IFERROR(IF(ISBLANK(H43),\"\",IF(FIND(H43,INDIRECT($H$39))>0,1,0)),0)","v":""},null,"",null,"",null,null,null,null,null,null,null,null,null,null,null,null,null,null,null,null,null,"",null,null,null,null,null,null,null,null,null,null,null,null,"AU","",0,null,"",{"$f":"IF(ISNUMBER(FIND(\"x\",BE43)),IFERROR(INDEX(INDIRECT(\"T_FinishColour[ColourCode-\"&IF(ISNUMBER(FIND(\"xxx\",BE43)),\"xxx\",IF(ISNUMBER(FIND(\"xx\",BE43)),\"xx\",\"error\"))&AR43&\"]\"),MATCH(AV43,T_FinishColour[Finish / Colour],0)),\"\"),\"\")","v":""},null,{"$f":"IF(AND(ISBLANK(BC43),ISBLANK(C43)),\"HIDE\",_xlfn.SWITCH(PRODUCT(C43:Z43,B43),2,\"HEADING\",1,\"SHOW\",0,\"HIDE\"))","v":"HIDE"},null,null,null,"RE91-2001-050000",null,"RE91-2001-050000","15mm Flat Spline - D/S MP-HR TAPE",null,{"$f":"IF(ISBLANK(BO43),\"\",IF(OR(BO43=L_Units),\"Y\",\"N\"))","v":{"$error":"#N/A"}},"wbSeal",{"$f":"IFERROR(IF(BH43=\"Y\",((INDEX(T_Deduc18[Deduction],MATCH(BI43,T_Deduc18[Type],0),0))),\"\"),\"\")","v":""},"o_widthmm","","","",{"$f":"INDEX(T_UnitSelection[Units],MATCH(i_Units,T_UnitSelection[UnitSelection],0))","v":{"$error":"#N/A"}},{"$f":"IFERROR(IF(ISBLANK(BC43),\"\",INDEX(T_NAV_AU[Base Unit of Measure],MATCH(BC43,T_NAV_AU[No.],0))),\"\")","v":"SET"},"METRE",null,"HW",1,1,1,{"$f":"IFERROR(INDEX(INDIRECT(\"T_NAV_\"&i_Location&\"[\"&i_Location&\"]\"),MATCH(1,--(BC43=INDIRECT(\"T_NAV_\"&i_Location&\"[No.]\"))*--((INDIRECT(\"T_NAV_\"&i_Location&\"[\"&i_Location&\"]\"))<>\"\"),0))/IF(AND(BQ43=\"METRE\",BG43<>\"\",BR43=\"\"),BG43,1),\"\")","v":""},"","",""]
[null,null,null,"D30",0,"B/SIDES",{"$f":"IFERROR(IF(ISBLANK(F44),\"\",IF(FIND(F44,INDIRECT($F$39))>0,1,0)),0)","v":0},null,{"$f":"IFERROR(IF(ISBLANK(H44),\"\",IF(FIND(H44,INDIRECT($H$39))>0,1,0)),0)","v":""},null,"",null,"",null,null,null,null,null,null,null,null,null,null,null,null,null,null,null,null,null,"",null,null,null,"White","Black",null,null,null,null,null,null,null,"AU","White",0,null,"White",{"$f":"IF(ISNUMBER(FIND(\"x\",BE44)),IFERROR(INDEX(INDIRECT(\"T_FinishColour[ColourCode-\"&IF(ISNUMBER(FIND(\"xxx\",BE44)),\"xxx\",IF(ISNUMBER(FIND(\"xx\",BE44)),\"xx\",\"error\"))&AR44&\"]\"),MATCH(AV44,T_FinishColour[Finish / Colour],0)),\"\"),\"\")","v":"069"},null,{"$f":"IF(AND(ISBLANK(BC44),ISBLANK(C44)),\"HIDE\",_xlfn.SWITCH(PRODUCT(C44:Z44,B44),2,\"HEADING\",1,\"SHOW\",0,\"HIDE\"))","v":"HIDE"},null,null,null,"RE20-0303-069002",null,"RE20-0303-xxx002","15mm Flat Spline - D/S MP-HR TAPE B/SIDES",null,{"$f":"IF(ISBLANK(BO44),\"\",IF(OR(BO44=L_Units),\"Y\",\"N\"))","v":{"$error":"#N/A"}},"wbSeal",{"$f":"IFERROR(IF(BH44=\"Y\",((INDEX(T_Deduc18[Deduction],MATCH(BI44,T_Deduc18[Type],0),0))),\"\"),\"\")","v":""},"o_widthmm",{"$f":"IFERROR(IF(BH44=\"Y\",INDIRECT(BK44)-BJ44,\"\"),\"\")","v":""},"","",{"$f":"INDEX(T_UnitSelection[Units],MATCH(i_Units,T_UnitSelection[UnitSelection],0))","v":{"$error":"#N/A"}},{"$f":"IFERROR(IF(ISBLANK(BC44),\"\",INDEX(T_NAV_AU[Base Unit of Measure],MATCH(BC44,T_NAV_AU[No.],0))),\"\")","v":"SET"},"METRE",null,"HW",1,1,{"$f":"IF(ISBLANK(BT44),\"\",PRODUCT(AE44,BT44,i_systemQTY))","v":1},{"$f":"IFERROR(INDEX(INDIRECT(\"T_NAV_\"&i_Location&\"[\"&i_Location&\"]\"),MATCH(1,--(BC44=INDIRECT(\"T_NAV_\"&i_Location&\"[No.]\"))*--((INDIRECT(\"T_NAV_\"&i_Location&\"[\"&i_Location&\"]\"))<>\"\"),0))/IF(AND(BQ44=\"METRE\",BG44<>\"\",BR44=\"\"),BG44,1),\"\")","v":""},"","",""]
[null,null,null,"Fabric Wrap",0,null,{"$f":"IFERROR(IF(ISBLANK(F45),\"\",IF(FIND(F45,INDIRECT($F$39))>0,1,0)),0)","v":""},null,null,null,null,null,null,null,null,null,null,null,null,null,null,null,null,null,null,null,null,null,null,null,null,null,null,null,null,null,null,null,null,null,null,null,null,null,null,null,null,null,null,null,{"$f":"IF(AND(ISBLANK(BC45),ISBLANK(C45)),\"HIDE\",_xlfn.SWITCH(PRODUCT(C45:Z45,B45),2,\"HEADING\",1,\"SHOW\",0,\"HIDE\"))","v":"HIDE"},null,null,null,"RB91-1236-490",null,"RB91-1236-xxx490","Fabric Wrap Hem Bar 16'",4.9000000000000004,"Y","wb",{"$f":"IFERROR(IF(BH45=\"Y\",((INDEX(T_Deduc18[Deduction],MATCH(BI45,T_Deduc18[Type],0),0))),\"\"),\"\")","v":24},"o_widthmm",{"$f":"IFERROR(IF(BH45=\"Y\",INDIRECT(BK45)-BJ45,\"\"),\"\")","v":-24},{"$f":"IFERROR(IF(BH45=\"Y\",BL45,\"\"),\"\")","v":-24},{"$f":"IFERROR(IF(BH45=\"Y\",TEXT(BL45/25.4,\"0\"&IF(ABS(BL45/25.4-ROUND(BL45/25.4,0))>1/32,\"-0/\"&CHOOSE(ROUND(MOD(BL45/25.4,1)*16,0),16,8,16,4,16,8,16,2,16,8,16,4,16,8,16),\"\")),\"\"),\"\")","v":"-0-15/16"},{"$f":"INDEX(T_UnitSelection[Units],MATCH(i_Units,T_UnitSelection[UnitSelection],0))","v":{"$error":"#N/A"}},"LENGTH","METRE",null,"HW",1,{"$f":"IF(ISBLANK(BT45),\"\",PRODUCT(AE45,BT45,ShadeQuantity))","v":1},1]
[null,null,null,"Fabric Wrap",0,null,"",null,null,null,null,null,null,null,null,null,null,null,null,null,null,null,null,null,null,null,null,null,null,null,null,null,null,null,null,null,null,null,null,null,null,null,null,null,null,null,null,null,null,null,{"$f":"IF(AND(ISBLANK(BC46),ISBLANK(C46)),\"HIDE\",_xlfn.SWITCH(PRODUCT(C46:Z46,B46),2,\"HEADING\",1,\"SHOW\",0,\"HIDE\"))","v":"HIDE"},null,null,null,{"$f":"_xlfn.IFNA(SUBSTITUTE(IF(AR46=\"AU\",SUBSTITUTE(BE46,\"xxx\",AW46),SUBSTITUTE(SUBSTITUTE(BE46,\"xx\",AW46),\"x\",\"\")),\"LLL\",\"580\"),BE46)","v":"RB91-2136-001"},null,"RB91-2136-xxx001","Fabric Wrap Hem Bar End Cap",null,{"$f":"IF(ISBLANK(BO46),\"\",IF(OR(BO46=L_Units),\"Y\",\"N\"))","v":"N"},null,{"$f":"IFERROR(IF(BH46=\"Y\",((INDEX(T_Deduc18[Deduction],MATCH(BI46,T_Deduc18[Type],0),0))),\"\"),\"\")","v":""},null,{"$f":"IFERROR(IF(BH46=\"Y\",(INDIRECT(BK46)-BJ46)/IF(AA46=\"\",1,o_nScreens),\"\"),\"\")","v":""},null,null,"Piece",{"$f":"IFERROR(IF(ISBLANK(BC46),\"\",INDEX([1]!T_NAV[Base Unit of Measure],MATCH(BC46,[1]!T_NAV[No.],0))),\"\")","v":""},null,null,"HW",2,{"$f":"IF(ISBLANK(BT46),\"\",PRODUCT(AE46,BT46,ShadeQuantity))","v":2},2]
[null,null,null,"Fabric Wrap",0,null,"","Handle",{"$f":"IFERROR(IF(ISBLANK(H47),\"\",IF(FIND(H47,INDIRECT($H$39))>0,1,0)),0)","v":0},null,null,null,null,null,null,null,null,null,null,null,null,null,null,null,null,null,null,null,null,null,null,null,null,null,null,null,null,null,null,null,null,null,null,null,null,null,null,null,null,null,{"$f":"IF(AND(ISBLANK(BC47),ISBLANK(C47)),\"HIDE\",_xlfn.SWITCH(PRODUCT(C47:Z47,B47),2,\"HEADING\",1,\"SHOW\",0,\"HIDE\"))","v":"HIDE"},null,null,null,{"$f":"_xlfn.IFNA(SUBSTITUTE(IF(AR47=\"AU\",SUBSTITUTE(BE47,\"xxx\",AW47),SUBSTITUTE(SUBSTITUTE(BE47,\"xx\",AW47),\"x\",\"\")),\"LLL\",\"580\"),BE47)","v":"RB91-2336-001000"},null,"RB91-2336-001000","Fabric Wrap Hem Bar Handle",null,{"$f":"IF(ISBLANK(BO47),\"\",IF(OR(BO47=L_Units),\"Y\",\"N\"))","v":"N"},null,{"$f":"IFERROR(IF(BH47=\"Y\",((INDEX(T_Deduc18[Deduction],MATCH(BI47,T_Deduc18[Type],0),0))),\"\"),\"\")","v":""},null,{"$f":"IFERROR(IF(BH47=\"Y\",(INDIRECT(BK47)-BJ47)/IF(AA47=\"\",1,o_nScreens),\"\"),\"\")","v":""},null,null,"Set",{"$f":"IFERROR(IF(ISBLANK(BC47),\"\",INDEX([1]!T_NAV[Base Unit of Measure],MATCH(BC47,[1]!T_NAV[No.],0))),\"\")","v":""},null,null,"HW",1,{"$f":"IF(ISBLANK(BT47),\"\",PRODUCT(AE47,BT47,ShadeQuantity))","v":1},1]
[null,null,null,"Fabric Wrap",0,null,"","Pull",{"$f":"IFERROR(IF(ISBLANK(H48),\"\",IF(FIND(H48,INDIRECT($H$39))>0,1,0)),0)","v":0},null,null,null,null,null,null,null,null,null,null,null,null,null,null,null,null,null,null,null,null,null,null,null,null,null,null,null,null,null,null,null,null,null,null,null,null,null,null,null,null,null,{"$f":"IF(AND(ISBLANK(BC48),ISBLANK(C48)),\"HIDE\",_xlfn.SWITCH(PRODUCT(C48:Z48,B48),2,\"HEADING\",1,\"SHOW\",0,\"HIDE\"))","v":"HIDE"},null,null,null,{"$f":"_xlfn.IFNA(SUBSTITUTE(IF(AR48=\"AU\",SUBSTITUTE(BE48,\"xxx\",AW48),SUBSTITUTE(SUBSTITUTE(BE48,\"xx\",AW48),\"x\",\"\")),\"LLL\",\"580\"),BE48)","v":"RB91-2536-069000"},null,"RB91-2536-069000","Hem Bar Pull Hook 2ft/4ft Extn",null,{"$f":"IF(ISBLANK(BO48),\"\",IF(OR(BO48=L_Units),\"Y\",\"N\"))","v":"N"},null,{"$f":"IFERROR(IF(BH48=\"Y\",((INDEX(T_Deduc18[Deduction],MATCH(BI48,T_Deduc18[Type],0),0))),\"\"),\"\")","v":""},null,{"$f":"IFERROR(IF(BH48=\"Y\",(INDIRECT(BK48)-BJ48)/IF(AA48=\"\",1,o_nScreens),\"\"),\"\")","v":""},null,null,"Set",{"$f":"IFERROR(IF(ISBLANK(BC48),\"\",INDEX([1]!T_NAV[Base Unit of Measure],MATCH(BC48,[1]!T_NAV[No.],0))),\"\")","v":""},null,null,"HW",1,{"$f":"IF(ISBLANK(BT48),\"\",PRODUCT(AE48,BT48,ShadeQuantity))","v":1},1]
[null,null,null,"Fabric Wrap",0,"Wrap",0,null,"",null,null,null,null,null,null,null,null,null,null,null,null,null,null,null,null,null,"i_wbSpline",null,"No Wrap",null,{"$f":"IFERROR(IF(ISBLANK(AC49),1,IF(FIND(AC49,INDIRECT($AA$49))>0,2,1)),1)","v":1},null,null,null,null,null,null,null,null,null,null,null,null,null,null,null,null,null,null,null,{"$f":"IF(AND(ISBLANK(BC49),ISBLANK(C49)),\"HIDE\",_xlfn.SWITCH(PRODUCT(C49:Z49,B49),2,\"HEADING\",1,\"SHOW\",0,\"HIDE\"))","v":"HIDE"},null,null,null,"SS91-5350-069000",null,"SS91-5350-069000","Smooth Round Spline | 5.0mm x 820ft Roll",null,"Y","wb",{"$f":"IFERROR(IF(BH49=\"Y\",((INDEX(T_Deduc18[Deduction],MATCH(BI49,T_Deduc18[Type],0),0))),\"\"),\"\")","v":24},"o_widthmm",{"$f":"IFERROR(IF(BH49=\"Y\",INDIRECT(BK49)-BJ49,\"\"),\"\")","v":-24},{"$f":"IFERROR(IF(BH49=\"Y\",BL49,\"\"),\"\")","v":-24},{"$f":"IFERROR(IF(BH49=\"Y\",TEXT(BL49/25.4,\"0\"&IF(ABS(BL49/25.4-ROUND(BL49/25.4,0))>1/32,\"-0/\"&CHOOSE(ROUND(MOD(BL49/25.4,1)*16,0),16,8,16,4,16,8,16,2,16,8,16,4,16,8,16),\"\")),\"\"),\"\")","v":"-0-15/16"},{"$f":"INDEX(T_UnitSelection[Units],MATCH(i_Units,T_UnitSelection[UnitSelection],0))","v":{"$error":"#N/A"}},"ROLL",null,null,"HW",1,{"$f":"IF(ISBLANK(BT49),\"\",PRODUCT(AE49,BT49,ShadeQuantity))","v":1},{"$f":"IF(ISBLANK(BT49),\"\",PRODUCT(AE49,BT49,i_systemQTY))","v":1}]
[null,null,null,null,1,null,"","Ballast",0,null,null,"US",{"$f":"IFERROR(IF(ISBLANK(L50),\"\",IF(FIND(L50,INDIRECT($L$39))>0,1,0)),0)","v":0},null,null,null,null,null,null,null,null,null,null,null,null,null,null,null,null,null,null,null,null,null,null,null,null,null,null,null,null,null,null,null,null,null,null,null,null,null,{"$f":"IF(AND(ISBLANK(BC50),ISBLANK(C50)),\"HIDE\",_xlfn.SWITCH(PRODUCT(C50:Z50,B50),2,\"HEADING\",1,\"SHOW\",0,\"HIDE\"))","v":"HIDE"},null,null,null,"VB05-0301-025000",null,"VB05-0301-025000","Oval Ballast 0.2\" x 0.3\" x 10ft Length",null,"Y","Ballast",{"$f":"IFERROR(IF(BH50=\"Y\",((INDEX(T_Deduc18[Deduction],MATCH(BI50,T_Deduc18[Type],0),0))),\"\"),\"\")","v":0},"o_widthmm",0,0,"0",{"$f":"INDEX(T_UnitSelection[Units],MATCH(i_Units,T_UnitSelection[UnitSelection],0))","v":{"$error":"#N/A"}},"LENGTH",null,null,"HW",1,1,1]
[null,null,null,"Fabric Wrap",0,"One Side",0,null,null,null,null,null,null,null,null,null,null,null,null,null,null,null,null,null,null,null,null,null,null,null,null,null,null,null,null,null,null,null,null,null,null,null,null,null,null,null,null,null,null,null,{"$f":"IF(AND(ISBLANK(BC51),ISBLANK(C51)),\"HIDE\",_xlfn.SWITCH(PRODUCT(C51:Z51,B51),2,\"HEADING\",1,\"SHOW\",0,\"HIDE\"))","v":"HIDE"},null,null,null,"RB92-0901-001100",null,"RB92-0901-001100","9mm ACM Flat Spline - No Tape",100,"Y","wb",40,"o_widthmm",-40,-40,"-1-9/16",{"$f":"INDEX(T_UnitSelection[Units],MATCH(i_Units,T_UnitSelection[UnitSelection],0))","v":{"$error":"#N/A"}},"ROLL",null,null,"HW",1,1,1]
[null,null,null,"Fabric Wrap",0,"NO",{"$f":"IFERROR(IF(ISBLANK(F52),\"\",IF(FIND(F52,INDIRECT($F$39))>0,1,0)),0)","v":0},null,{"$f":"IFERROR(IF(ISBLANK(H52),\"\",IF(FIND(H52,INDIRECT($H$39))>0,1,0)),0)","v":""},null,"",null,null,null,null,null,null,null,null,null,null,null,null,null,null,null,null,null,null,null,{"$f":"IFERROR(_xlfn.SINGLE(IF(AND(AA52=\"Y\",PRODUCT(AB52:AD52)=0),o_nScreens,IF(PRODUCT(AB52:AD52)=0,\"\",PRODUCT(AB52:AD52)))),\"\")","v":""},null,null,null,null,null,null,null,null,null,null,null,null,"AU",{"$f":"IF(ISNUMBER(FIND(\"x\",BE52)),IFERROR(INDEX(AI52:AQ52,0,MATCH(AT52,AI52:AQ52,0)),IF(AI52<>\"\",AI52,i_DefaultColour)),\"\")","v":""},0,null,{"$f":"IF(ISNUMBER(FIND(\"x\",BE52)),IFERROR(INDEX(AI52:AQ52,0,MATCH(AT52,AI52:AQ52,0)),AS52),\"\")","v":""},{"$f":"IF(ISNUMBER(FIND(\"x\",BE52)),IFERROR(INDEX(INDIRECT(\"T_FinishColour[ColourCode-\"&IF(ISNUMBER(FIND(\"xxx\",BE52)),\"xxx\",IF(ISNUMBER(FIND(\"xx\",BE52)),\"xx\",\"error\"))&AR52&\"]\"),MATCH(AV52,T_FinishColour[Finish / Colour],0)),\"\"),\"\")","v":""},null,{"$f":"IF(AND(ISBLANK(BC52),ISBLANK(C52)),\"HIDE\",_xlfn.SWITCH(PRODUCT(C52:Z52,B52),2,\"HEADING\",1,\"SHOW\",0,\"HIDE\"))","v":"HIDE"},null,null,null,"SB91-0018-050040",null,"SB91-0018-050040","9mm Flat Spline",1,{"$f":"IF(ISBLANK(BO52),\"\",IF(OR(BO52=L_Units),\"Y\",\"N\"))","v":{"$error":"#N/A"}},"wbSeal",{"$f":"IFERROR(IF(BH52=\"Y\",((INDEX(T_Deduc18[Deduction],MATCH(BI52,T_Deduc18[Type],0),0))),\"\"),\"\")","v":""},"o_widthmm",{"$f":"IFERROR(IF(BH52=\"Y\",INDIRECT(BK52)-BJ52,\"\"),\"\")","v":""},{"$f":"IFERROR(IF(BH52=\"Y\",BL52,\"\"),\"\")","v":""},{"$f":"IFERROR(IF(BH52=\"Y\",TEXT(BL52/25.4,\"0\"&IF(ABS(BL52/25.4-ROUND(BL52/25.4,0))>1/32,\"-0/\"&CHOOSE(ROUND(MOD(BL52/25.4,1)*16,0),16,8,16,4,16,8,16,2,16,8,16,4,16,8,16),\"\")),\"\"),\"\")","v":""},{"$f":"INDEX(T_UnitSelection[Units],MATCH(i_Units,T_UnitSelection[UnitSelection],0))","v":{"$error":"#N/A"}},{"$f":"IFERROR(IF(ISBLANK(BC52),\"\",INDEX(T_NAV_AU[Base Unit of Measure],MATCH(BC52,T_NAV_AU[No.],0))),\"\")","v":"METRE"},"METRE",null,"HW",1,{"$f":"IF(ISBLANK(BT52),\"\",PRODUCT(AE52,BT52))","v":1},1,{"$f":"IFERROR(INDEX(INDIRECT(\"T_NAV_\"&i_Location&\"[\"&i_Location&\"]\"),MATCH(1,--(BC52=INDIRECT(\"T_NAV_\"&i_Location&\"[No.]\"))*--((INDIRECT(\"T_NAV_\"&i_Location&\"[\"&i_Location&\"]\"))<>\"\"),0))/IF(AND(BQ52=\"METRE\",BG52<>\"\",BR52=\"\"),BG52,1),\"\")","v":""},{"$f":"IFERROR(IF(AND(AY52=\"SHOW\",BW52<>\"\"),BW52*BV52*IF(AND(BM52<>\"\",OR(BP52=\"LENGTH\",BP52=\"METRE\",BP52=\"ROLL\")),(BL52/1000),1),\"\"),\"\")","v":""},"",""]
[null,null,null,"Fabric Wrap",0,"MP",{"$f":"(IFERROR(IF(ISBLANK(F53),\"\",IF(FIND(F53,INDIRECT($F$39))>0,1,0)),0)+IF(G54=1,-1,0))","v":0},null,"",null,"",null,null,null,null,null,null,null,null,null,null,null,null,null,null,null,null,null,null,null,{"$f":"IFERROR(_xlfn.SINGLE(IF(AND(AA53=\"Y\",PRODUCT(AB53:AD53)=0),o_nScreens,IF(PRODUCT(AB53:AD53)=0,\"\",PRODUCT(AB53:AD53)))),\"\")","v":""},null,null,null,null,null,null,null,null,null,null,null,null,"AU",{"$f":"IF(ISNUMBER(FIND(\"x\",BE53)),IFERROR(INDEX(AI53:AQ53,0,MATCH(AT53,AI53:AQ53,0)),IF(AI53<>\"\",AI53,i_DefaultColour)),\"\")","v":""},0,null,{"$f":"IF(ISNUMBER(FIND(\"x\",BE53)),IFERROR(INDEX(AI53:AQ53,0,MATCH(AT53,AI53:AQ53,0)),AS53),\"\")","v":""},{"$f":"IF(ISNUMBER(FIND(\"x\",BE53)),IFERROR(INDEX(INDIRECT(\"T_FinishColour[ColourCode-\"&IF(ISNUMBER(FIND(\"xxx\",BE53)),\"xxx\",IF(ISNUMBER(FIND(\"xx\",BE53)),\"xx\",\"error\"))&AR53&\"]\"),MATCH(AV53,T_FinishColour[Finish / Colour],0)),\"\"),\"\")","v":""},null,{"$f":"IF(AND(ISBLANK(BC53),ISBLANK(C53)),\"HIDE\",_xlfn.SWITCH(PRODUCT(C53:Z53,B53),2,\"HEADING\",1,\"SHOW\",0,\"HIDE\"))","v":"HIDE"},null,null,null,"SB91-0019-050580",null,"SB91-0019-050580","9mm Flat Spline - D/S MP-HR TAPE",5.8,{"$f":"IF(ISBLANK(BO53),\"\",IF(OR(BO53=L_Units),\"Y\",\"N\"))","v":{"$error":"#N/A"}},"wbSeal",{"$f":"IFERROR(IF(BH53=\"Y\",((INDEX(T_Deduc18[Deduction],MATCH(BI53,T_Deduc18[Type],0),0))),\"\"),\"\")","v":""},"o_widthmm","","","",{"$f":"INDEX(T_UnitSelection[Units],MATCH(i_Units,T_UnitSelection[UnitSelection],0))","v":{"$error":"#N/A"}},{"$f":"IFERROR(IF(ISBLANK(BC53),\"\",INDEX(T_NAV_AU[Base Unit of Measure],MATCH(BC53,T_NAV_AU[No.],0))),\"\")","v":"LENGTH"},"METRE",null,"HW",1,1,1,{"$f":"IFERROR(INDEX(INDIRECT(\"T_NAV_\"&i_Location&\"[\"&i_Location&\"]\"),MATCH(1,--(BC53=INDIRECT(\"T_NAV_\"&i_Location&\"[No.]\"))*--((INDIRECT(\"T_NAV_\"&i_Location&\"[\"&i_Location&\"]\"))<>\"\"),0))/IF(AND(BQ53=\"METRE\",BG53<>\"\",BR53=\"\"),BG53,1),\"\")","v":""},"","",""]
[null,null,null,"Fabric Wrap",0,"B/SIDES",{"$f":"IFERROR(IF(ISBLANK(F54),\"\",IF(FIND(F54,INDIRECT($F$39))>0,1,0)),0)","v":0},null,"",null,"",null,null,null,{"$f":"IFERROR(IF(ISBLANK(N54),\"\",IF(FIND(N54,INDIRECT($N$39))>0,1,0)),0)","v":""},null,null,null,null,null,null,null,null,null,null,null,null,null,null,null,{"$f":"IFERROR(MID(i_wbHandle,10,1)*1,\"\")","v":""},null,null,null,null,null,null,null,null,null,null,null,null,null,"",0,null,"",{"$f":"IF(ISNUMBER(FIND(\"x\",BE54)),IFERROR(INDEX(INDIRECT(\"T_FinishColour[ColourCode-\"&IF(ISNUMBER(FIND(\"xxx\",BE54)),\"xxx\",IF(ISNUMBER(FIND(\"xx\",BE54)),\"xx\",\"error\"))&AR54&\"]\"),MATCH(AV54,T_FinishColour[Finish / Colour],0)),\"\"),\"\")","v":""},null,{"$f":"IF(AND(ISBLANK(BC54),ISBLANK(C54)),\"HIDE\",_xlfn.SWITCH(PRODUCT(C54:Z54,B54),2,\"HEADING\",1,\"SHOW\",0,\"HIDE\"))","v":"HIDE"},null,null,null,{"$f":"_xlfn.IFNA(SUBSTITUTE(IF(AR54=\"AU\",SUBSTITUTE(BE54,\"xxx\",AW54),SUBSTITUTE(SUBSTITUTE(BE54,\"xx\",AW54),\"x\",\"\")),\"LLL\",\"580\"),BE54)","v":"SB07-2201-022001"},null,"SB07-2201-022001","9mm Flat Spline - D/S MP-HR TAPE B/SIDES",5.8,{"$f":"IF(ISBLANK(BO54),\"\",IF(OR(BO54=L_Units),\"Y\",\"N\"))","v":{"$error":"#N/A"}},"wbSeal",{"$f":"IFERROR(IF(BH54=\"Y\",((INDEX(T_Deduc18[Deduction],MATCH(BI54,T_Deduc18[Type],0),0))),\"\"),\"\")","v":""},"o_widthmm","","","",{"$f":"INDEX(T_UnitSelection[Units],MATCH(i_Units,T_UnitSelection[UnitSelection],0))","v":{"$error":"#N/A"}},{"$f":"IFERROR(IF(ISBLANK(BC54),\"\",INDEX(T_NAV_AU[Base Unit of Measure],MATCH(BC54,T_NAV_AU[No.],0))),\"\")","v":"SET"},"METRE",null,"HW",1,1,1,{"$f":"IFERROR(INDEX(INDIRECT(\"T_NAV_\"&i_Location&\"[\"&i_Location&\"]\"),MATCH(1,--(BC54=INDIRECT(\"T_NAV_\"&i_Location&\"[No.]\"))*--((INDIRECT(\"T_NAV_\"&i_Location&\"[\"&i_Location&\"]\"))<>\"\"),0))/IF(AND(BQ54=\"METRE\",BG54<>\"\",BR54=\"\"),BG54,1),\"\")","v":""},"","",""]
[null,null,null,"Fabric Wrap",0,"5mm",{"$f":"IFERROR(IF(ISBLANK(F55),\"\",IF(FIND(F55,INDIRECT($F$39))>0,1,0)),0)","v":0},null,"",null,"",null,null,null,null,null,null,null,null,null,null,null,null,null,null,null,null,null,null,null,{"$f":"IFERROR(_xlfn.SINGLE(IF(AND(AA55=\"Y\",PRODUCT(AB55:AD55)=0),o_nScreens,IF(PRODUCT(AB55:AD55)=0,\"\",PRODUCT(AB55:AD55)))),\"\")","v":""},null,null,null,null,null,null,null,null,null,null,null,null,"AU","",0,null,"",{"$f":"IF(ISNUMBER(FIND(\"x\",BE55)),IFERROR(INDEX(INDIRECT(\"T_FinishColour[ColourCode-\"&IF(ISNUMBER(FIND(\"xxx\",BE55)),\"xxx\",IF(ISNUMBER(FIND(\"xx\",BE55)),\"xx\",\"error\"))&AR55&\"]\"),MATCH(AV55,T_FinishColour[Finish / Colour],0)),\"\"),\"\")","v":""},null,{"$f":"IF(AND(ISBLANK(BC55),ISBLANK(C55)),\"HIDE\",_xlfn.SWITCH(PRODUCT(C55:Z55,B55),2,\"HEADING\",1,\"SHOW\",0,\"HIDE\"))","v":"HIDE"},null,null,null,{"$f":"_xlfn.IFNA(SUBSTITUTE(IF(AR55=\"AU\",SUBSTITUTE(BE55,\"xxx\",AW55),SUBSTITUTE(SUBSTITUTE(BE55,\"xx\",AW55),\"x\",\"\")),\"LLL\",\"580\"),BE55)","v":"SB91-0018-050040"},null,"SB91-0018-050040","5mm Round Spline",1,{"$f":"IF(ISBLANK(BO55),\"\",IF(OR(BO55=L_Units),\"Y\",\"N\"))","v":{"$error":"#N/A"}},"wbSeal",{"$f":"IFERROR(IF(BH55=\"Y\",((INDEX(T_Deduc18[Deduction],MATCH(BI55,T_Deduc18[Type],0),0))),\"\"),\"\")","v":""},"o_widthmm","","","",{"$f":"INDEX(T_UnitSelection[Units],MATCH(i_Units,T_UnitSelection[UnitSelection],0))","v":{"$error":"#N/A"}},{"$f":"IFERROR(IF(ISBLANK(BC55),\"\",INDEX(T_NAV_AU[Base Unit of Measure],MATCH(BC55,T_NAV_AU[No.],0))),\"\")","v":"METRE"},"METRE",null,"HW",1,1,1,{"$f":"IFERROR(INDEX(INDIRECT(\"T_NAV_\"&i_Location&\"[\"&i_Location&\"]\"),MATCH(1,--(BC55=INDIRECT(\"T_NAV_\"&i_Location&\"[No.]\"))*--((INDIRECT(\"T_NAV_\"&i_Location&\"[\"&i_Location&\"]\"))<>\"\"),0))/IF(AND(BQ55=\"METRE\",BG55<>\"\",BR55=\"\"),BG55,1),\"\")","v":""},"",{"$f":"IF(BX55<>\"\",(INDIRECT(\"i_\"&BS55&\"discount\"))*BX55,\"\")","v":""},{"$f":"IFERROR(IF(BX55<>\"\",BX55-BY55,\"\"),\"\")","v":""}]
[null,null,null,null,1,null,{"$f":"IFERROR(IF(ISBLANK(F56),\"\",IF(FIND(F56,INDIRECT($F$39))>0,1,0)),0)","v":""},"Ballast",0,null,"","AU",{"$f":"IFERROR(IF(ISBLANK(L56),\"\",IF(FIND(L56,INDIRECT($L$39))>0,1,0)),0)","v":0},null,null,null,null,null,null,null,null,null,null,null,null,null,null,null,null,null,"",null,null,null,null,null,null,null,null,null,null,null,null,"AU",{"$f":"IF(ISNUMBER(FIND(\"x\",BE56)),IFERROR(INDEX(AI56:AQ56,0,MATCH(AT56,AI56:AQ56,0)),IF(AI56<>\"\",AI56,i_DefaultColour)),\"\")","v":"Black"},0,null,{"$f":"IF(ISNUMBER(FIND(\"x\",BE56)),IFERROR(INDEX(AI56:AQ56,0,MATCH(AT56,AI56:AQ56,0)),AS56),\"\")","v":"Black"},{"$f":"IF(ISNUMBER(FIND(\"x\",BE56)),IFERROR(INDEX(INDIRECT(\"T_FinishColour[ColourCode-\"&IF(ISNUMBER(FIND(\"xxx\",BE56)),\"xxx\",IF(ISNUMBER(FIND(\"xx\",BE56)),\"xx\",\"error\"))&AR56&\"]\"),MATCH(AV56,T_FinishColour[Finish / Colour],0)),\"\"),\"\")","v":"050"},null,{"$f":"IF(AND(ISBLANK(BC56),ISBLANK(C56)),\"HIDE\",_xlfn.SWITCH(PRODUCT(C56:Z56,B56),2,\"HEADING\",1,\"SHOW\",0,\"HIDE\"))","v":"HIDE"},null,null,null,{"$f":"_xlfn.IFNA(SUBSTITUTE(IF(AR56=\"AU\",SUBSTITUTE(BE56,\"xxx\",AW56),SUBSTITUTE(SUBSTITUTE(BE56,\"xx\",AW56),\"x\",\"\")),\"LLL\",\"580\"),BE56)","v":"VB05-0301-050580"},null,"VB05-0301-xxxLLL","Base Rail Weight Rod",1,{"$f":"IF(ISBLANK(BO56),\"\",IF(OR(BO56=L_Units),\"Y\",\"N\"))","v":{"$error":"#N/A"}},"Ballast",{"$f":"IFERROR(IF(BH56=\"Y\",((INDEX(T_Deduc18[Deduction],MATCH(BI56,T_Deduc18[Type],0),0))),\"\"),\"\")","v":""},"o_widthmm","","","",{"$f":"INDEX(T_UnitSelection[Units],MATCH(i_Units,T_UnitSelection[UnitSelection],0))","v":{"$error":"#N/A"}},{"$f":"IFERROR(IF(ISBLANK(BC56),\"\",INDEX(T_NAV_AU[Base Unit of Measure],MATCH(BC56,T_NAV_AU[No.],0))),\"\")","v":""},"METRE",null,"HW",1,1,1,{"$f":"IFERROR(INDEX(INDIRECT(\"T_NAV_\"&i_Location&\"[\"&i_Location&\"]\"),MATCH(1,--(BC56=INDIRECT(\"T_NAV_\"&i_Location&\"[No.]\"))*--((INDIRECT(\"T_NAV_\"&i_Location&\"[\"&i_Location&\"]\"))<>\"\"),0))/IF(AND(BQ56=\"METRE\",BG56<>\"\",BR56=\"\"),BG56,1),\"\")","v":""},"",{"$f":"IF(BX56<>\"\",(INDIRECT(\"i_\"&BS56&\"discount\"))*BX56,\"\")","v":""},{"$f":"IFERROR(IF(BX56<>\"\",BX56-BY56,\"\"),\"\")","v":""}]
[null,2,1,null,null,null,null,null,null,null,null,null,null,null,null,null,null,null,null,null,null,null,null,null,null,null,null,null,null,null,"",null,null,null,null,null,null,null,null,null,null,null,null,null,"",null,null,"",{"$f":"IF(ISNUMBER(FIND(\"x\",BE57)),IFERROR(INDEX(INDIRECT(\"T_FinishColour[ColourCode-\"&IF(ISNUMBER(FIND(\"xxx\",BE57)),\"xxx\",IF(ISNUMBER(FIND(\"xx\",BE57)),\"xx\",\"error\"))&AR57&\"]\"),MATCH(AV57,T_FinishColour[Finish / Colour],0)),\"\"),\"\")","v":""},null,{"$f":"IF(AND(ISBLANK(BC57),ISBLANK(C57)),\"HIDE\",_xlfn.SWITCH(PRODUCT(C57:Z57,B57),2,\"HEADING\",1,\"SHOW\",0,\"HIDE\"))","v":"HEADING"},null,null,null,{"$f":"_xlfn.IFNA(SUBSTITUTE(IF(AR57=\"AU\",SUBSTITUTE(BE57,\"xxx\",AW57),SUBSTITUTE(SUBSTITUTE(BE57,\"xx\",AW57),\"x\",\"\")),\"LLL\",\"580\"),BE57)","v":""},null,null,null,null,{"$f":"IF(ISBLANK(BO57),\"\",IF(OR(BO57=L_Units),\"Y\",\"N\"))","v":""},null,{"$f":"IFERROR(_xlfn.SINGLE(IF(BH57=\"Y\",((INDEX(#REF!,MATCH(BI57,#REF!,0),0))),\"\")),\"\")","v":""},null,"",{"$f":"IFERROR(IF(BH57=\"Y\",BL57,\"\"),\"\")","v":""},"",null,{"$f":"IFERROR(IF(ISBLANK(BC57),\"\",INDEX(T_NAV_AU[Base Unit of Measure],MATCH(BC57,T_NAV_AU[No.],0))),\"\")","v":""},null,null,null,null,"","",{"$f":"IFERROR(INDEX(INDIRECT(\"T_NAV_\"&i_Location&\"[\"&i_Location&\"]\"),MATCH(1,--(BC57=INDIRECT(\"T_NAV_\"&i_Location&\"[No.]\"))*--((INDIRECT(\"T_NAV_\"&i_Location&\"[\"&i_Location&\"]\"))<>\"\"),0))/IF(AND(BQ57=\"METRE\",BG57<>\"\",BR57=\"\"),BG57,1),\"\")","v":""},"","",{"$f":"IFERROR(IF(BX57<>\"\",BX57-BY57,\"\"),\"\")","v":""}]
[null,2,1,"i_Tube",null,"i_SystemType",null,"i_TubeExtras",null,"i_ControlType",null,"i_Location",null,null,null,null,null,null,null,null,null,null,null,null,null,null,null,null,null,null,"",null,null,null,null,null,null,null,null,null,null,null,null,null,"",null,null,"",{"$f":"IF(ISNUMBER(FIND(\"x\",BE58)),IFERROR(INDEX(INDIRECT(\"T_FinishColour[ColourCode-\"&IF(ISNUMBER(FIND(\"xxx\",BE58)),\"xxx\",IF(ISNUMBER(FIND(\"xx\",BE58)),\"xx\",\"error\"))&AR58&\"]\"),MATCH(AV58,T_FinishColour[Finish / Colour],0)),\"\"),\"\")","v":""},null,{"$f":"IF(AND(ISBLANK(BC58),ISBLANK(C58)),\"HIDE\",_xlfn.SWITCH(PRODUCT(C58:Z58,B58),2,\"HEADING\",1,\"SHOW\",0,\"HIDE\"))","v":"HEADING"},null,null,null,"TUBE",null,"TUBE",null,null,null,null,{"$f":"IFERROR(_xlfn.SINGLE(IF(BH58=\"Y\",((INDEX(#REF!,MATCH(BI58,#REF!,0),0))),\"\")),\"\")","v":""},null,"","","",null,{"$f":"IFERROR(IF(ISBLANK(BC58),\"\",INDEX(T_NAV_AU[Base Unit of Measure],MATCH(BC58,T_NAV_AU[No.],0))),\"\")","v":""},null,null,null,null,"","",{"$f":"IFERROR(INDEX(INDIRECT(\"T_NAV_\"&i_Location&\"[\"&i_Location&\"]\"),MATCH(1,--(BC58=INDIRECT(\"T_NAV_\"&i_Location&\"[No.]\"))*--((INDIRECT(\"T_NAV_\"&i_Location&\"[\"&i_Location&\"]\"))<>\"\"),0))/IF(AND(BQ58=\"METRE\",BG58<>\"\",BR58=\"\"),BG58,1),\"\")","v":""},"","",""]
[null,null,null,"1.5\"",{"$f":"IFERROR(IF(ISBLANK(D59),\"\",IF(FIND(D59,INDIRECT($D$58))>0,1,0)),0)","v":0},null,{"$f":"IFERROR(IF(ISBLANK(F59),\"\",IF(FIND(F59,INDIRECT($F$58))>0,1,0)),0)","v":""},null,{"$f":"IFERROR(IF(ISBLANK(H59),\"\",IF(FIND(H59,INDIRECT($H$58))>0,1,0)),0)","v":""},null,{"$f":"IFERROR(IF(ISBLANK(J59),\"\",IF(FIND(J59,INDIRECT($J$58))>0,1,0)),0)","v":""},null,null,null,null,null,null,null,null,null,null,null,null,null,null,null,null,null,null,null,"",null,null,null,null,null,null,null,null,null,null,null,null,null,{"$f":"IF(ISNUMBER(FIND(\"x\",BE59)),IFERROR(INDEX(AI59:AQ59,0,MATCH(AT59,AI59:AQ59,0)),IF(AI59<>\"\",AI59,i_DefaultColour)),\"\")","v":""},null,null,{"$f":"IF(ISNUMBER(FIND(\"x\",BE59)),IFERROR(INDEX(AI59:AQ59,0,MATCH(AT59,AI59:AQ59,0)),AS59),\"\")","v":""},{"$f":"IF(ISNUMBER(FIND(\"x\",BE59)),IFERROR(INDEX(INDIRECT(\"T_FinishColour[ColourCode-\"&IF(ISNUMBER(FIND(\"xxx\",BE59)),\"xxx\",IF(ISNUMBER(FIND(\"xx\",BE59)),\"xx\",\"error\"))&AR59&\"]\"),MATCH(AV59,T_FinishColour[Finish / Colour],0)),\"\"),\"\")","v":""},null,{"$f":"IF(AND(ISBLANK(BC59),ISBLANK(C59)),\"HIDE\",_xlfn.SWITCH(PRODUCT(C59:Z59,B59),2,\"HEADING\",1,\"SHOW\",0,\"HIDE\"))","v":"HIDE"},null,null,null,{"$f":"_xlfn.IFNA(SUBSTITUTE(IF(AR59=\"AU\",SUBSTITUTE(BE59,\"xxx\",AW59),SUBSTITUTE(SUBSTITUTE(BE59,\"xx\",AW59),\"x\",\"\")),\"LLL\",\"015\"),BE59)","v":"RTEA4T16"},null,"RTEA4T16","Aluminum Tube 1.5\" Taped",100,{"$f":"IF(ISBLANK(BO59),\"\",IF(OR(BO59=L_Units),\"Y\",\"N\"))","v":{"$error":"#N/A"}},"Tube",{"$f":"IFERROR(IF(BH59=\"Y\",((INDEX(T_Deduc18[Deduction],MATCH(BI59,T_Deduc18[Type],0),0))),\"\"),\"\")","v":""},"o_widthmm",{"$f":"IFERROR(IF(BH59=\"Y\",INDIRECT(BK59)-BJ59,\"\"),\"\")","v":""},"","",{"$f":"INDEX(T_UnitSelection[Units],MATCH(i_Units,T_UnitSelection[UnitSelection],0))","v":{"$error":"#N/A"}},{"$f":"IFERROR(IF(ISBLANK(BC59),\"\",INDEX(T_NAV_AU[Base Unit of Measure],MATCH(BC59,T_NAV_AU[No.],0))),\"\")","v":""},"METRE",null,"HW",1,1,1,{"$f":"IFERROR(INDEX(INDIRECT(\"T_NAV_\"&i_Location&\"[\"&i_Location&\"]\"),MATCH(1,--(BC59=INDIRECT(\"T_NAV_\"&i_Location&\"[No.]\"))*--((INDIRECT(\"T_NAV_\"&i_Location&\"[\"&i_Location&\"]\"))<>\"\"),0))/IF(AND(BQ59=\"METRE\",BG59<>\"\",BR59=\"\"),BG59,1),\"\")","v":""},"","",""]
[null,null,null,"2\"",{"$f":"IFERROR(IF(ISBLANK(D60),\"\",IF(FIND(D60,INDIRECT($D$58))>0,1,0)),0)","v":0},null,null,null,null,null,null,null,null,null,null,null,null,null,null,null,null,null,null,null,null,null,null,null,null,null,null,null,null,null,null,null,null,null,null,null,null,null,null,null,null,null,null,null,null,null,{"$f":"IF(AND(ISBLANK(BC60),ISBLANK(C60)),\"HIDE\",_xlfn.SWITCH(PRODUCT(C60:Z60,B60),2,\"HEADING\",1,\"SHOW\",0,\"HIDE\"))","v":"HIDE"},null,null,null,"RTEA5T16",null,"RTEA5T16","Aluminum Tube 2\" Taped",100,{"$f":"IF(ISBLANK(BO60),\"\",IF(OR(BO60=L_Units),\"Y\",\"N\"))","v":{"$error":"#N/A"}},"Tube",{"$f":"IFERROR(IF(BH60=\"Y\",((INDEX(T_Deduc18[Deduction],MATCH(BI60,T_Deduc18[Type],0),0))),\"\"),\"\")","v":""},"o_widthmm",{"$f":"IFERROR(IF(BH60=\"Y\",INDIRECT(BK60)-BJ60,\"\"),\"\")","v":""},{"$f":"IFERROR(IF(BH60=\"Y\",BL60,\"\"),\"\")","v":""},{"$f":"IFERROR(IF(BH60=\"Y\",TEXT(BL60/25.4,\"0\"&IF(ABS(BL60/25.4-ROUND(BL60/25.4,0))>1/32,\"-0/\"&CHOOSE(ROUND(MOD(BL60/25.4,1)*16,0),16,8,16,4,16,8,16,2,16,8,16,4,16,8,16),\"\")),\"\"),\"\")","v":""},{"$f":"INDEX(T_UnitSelection[Units],MATCH(i_Units,T_UnitSelection[UnitSelection],0))","v":{"$error":"#N/A"}},{"$f":"IFERROR(IF(ISBLANK(BC60),\"\",INDEX(T_NAV_AU[Base Unit of Measure],MATCH(BC60,T_NAV_AU[No.],0))),\"\")","v":""},"METRE",null,"HW",1,{"$f":"IF(ISBLANK(BT60),\"\",PRODUCT(AE60,BT60))","v":1},{"$f":"IF(ISBLANK(BT60),\"\",PRODUCT(AE60,BT60,i_systemQTY))","v":1}]
[null,2,{"$f":"C62","v":0},null,null,null,null,null,null,null,null,null,null,null,null,null,null,null,null,null,null,null,null,null,null,null,null,null,null,null,"",null,null,null,null,null,null,null,null,null,null,null,null,null,{"$f":"IF(ISNUMBER(FIND(\"x\",BE61)),IFERROR(INDEX(AI61:AQ61,0,MATCH(AT61,AI61:AQ61,0)),IF(AI61<>\"\",AI61,i_DefaultColour)),\"\")","v":""},null,null,{"$f":"IF(ISNUMBER(FIND(\"x\",BE61)),IFERROR(INDEX(AI61:AQ61,0,MATCH(AT61,AI61:AQ61,0)),AS61),\"\")","v":""},{"$f":"IF(ISNUMBER(FIND(\"x\",BE61)),IFERROR(INDEX(INDIRECT(\"T_FinishColour[ColourCode-\"&IF(ISNUMBER(FIND(\"xxx\",BE61)),\"xxx\",IF(ISNUMBER(FIND(\"xx\",BE61)),\"xx\",\"error\"))&AR61&\"]\"),MATCH(AV61,T_FinishColour[Finish / Colour],0)),\"\"),\"\")","v":""},null,{"$f":"IF(AND(ISBLANK(BC61),ISBLANK(C61)),\"HIDE\",_xlfn.SWITCH(PRODUCT(C61:Z61,B61),2,\"HEADING\",1,\"SHOW\",0,\"HIDE\"))","v":"HIDE"},null,null,null,{"$f":"_xlfn.IFNA(SUBSTITUTE(IF(AR61=\"AU\",SUBSTITUTE(BE61,\"xxx\",AW61),SUBSTITUTE(SUBSTITUTE(BE61,\"xx\",AW61),\"x\",\"\")),\"LLL\",\"580\"),BE61)","v":""},null,null,null,null,{"$f":"IF(ISBLANK(BO61),\"\",IF(OR(BO61=L_Units),\"Y\",\"N\"))","v":""},null,{"$f":"IFERROR(_xlfn.SINGLE(IF(BH61=\"Y\",((INDEX(#REF!,MATCH(BI61,#REF!,0),0))),\"\")),\"\")","v":""},null,"","","",null,{"$f":"IFERROR(IF(ISBLANK(BC61),\"\",INDEX(T_NAV_AU[Base Unit of Measure],MATCH(BC61,T_NAV_AU[No.],0))),\"\")","v":""},null,null,null,null,"","",{"$f":"IFERROR(INDEX(INDIRECT(\"T_NAV_\"&i_Location&\"[\"&i_Location&\"]\"),MATCH(1,--(BC61=INDIRECT(\"T_NAV_\"&i_Location&\"[No.]\"))*--((INDIRECT(\"T_NAV_\"&i_Location&\"[\"&i_Location&\"]\"))<>\"\"),0))/IF(AND(BQ61=\"METRE\",BG61<>\"\",BR61=\"\"),BG61,1),\"\")","v":""},"",{"$f":"IF(BX61<>\"\",(INDIRECT(\"i_\"&BS61&\"discount\"))*BX61,\"\")","v":""},{"$f":"IFERROR(IF(BX61<>\"\",BX61-BY61,\"\"),\"\")","v":""}]
[null,2,{"$f":"IF(COUNTIF(AY63:AY65,\"SHOW\")>0,1,0)","v":0},"i_TensionTool",null,null,null,null,null,null,null,null,null,null,null,null,null,null,null,null,null,null,null,null,null,null,null,null,null,null,"",null,null,null,null,null,null,null,null,null,null,null,null,null,"",null,null,"",{"$f":"IF(ISNUMBER(FIND(\"x\",BE62)),IFERROR(INDEX(INDIRECT(\"T_FinishColour[ColourCode-\"&IF(ISNUMBER(FIND(\"xxx\",BE62)),\"xxx\",IF(ISNUMBER(FIND(\"xx\",BE62)),\"xx\",\"error\"))&AR62&\"]\"),MATCH(AV62,T_FinishColour[Finish / Colour],0)),\"\"),\"\")","v":""},null,{"$f":"IF(AND(ISBLANK(BC62),ISBLANK(C62)),\"HIDE\",_xlfn.SWITCH(PRODUCT(C62:Z62,B62),2,\"HEADING\",1,\"SHOW\",0,\"HIDE\"))","v":"HIDE"},null,null,null,{"$f":"_xlfn.IFNA(SUBSTITUTE(IF(AR62=\"AU\",SUBSTITUTE(BE62,\"xxx\",AW62),SUBSTITUTE(SUBSTITUTE(BE62,\"xx\",AW62),\"x\",\"\")),\"LLL\",\"580\"),BE62)","v":"TENSION TOOL"},null,"TENSION TOOL",null,null,null,null,{"$f":"IFERROR(_xlfn.SINGLE(IF(BH62=\"Y\",((INDEX(#REF!,MATCH(BI62,#REF!,0),0))),\"\")),\"\")","v":""},null,"","","",null,{"$f":"IFERROR(IF(ISBLANK(BC62),\"\",INDEX(T_NAV_AU[Base Unit of Measure],MATCH(BC62,T_NAV_AU[No.],0))),\"\")","v":""},null,null,null,null,"","",{"$f":"IFERROR(INDEX(INDIRECT(\"T_NAV_\"&i_Location&\"[\"&i_Location&\"]\"),MATCH(1,--(BC62=INDIRECT(\"T_NAV_\"&i_Location&\"[No.]\"))*--((INDIRECT(\"T_NAV_\"&i_Location&\"[\"&i_Location&\"]\"))<>\"\"),0))/IF(AND(BQ62=\"METRE\",BG62<>\"\",BR62=\"\"),BG62,1),\"\")","v":""},"",{"$f":"IF(BX62<>\"\",(INDIRECT(\"i_\"&BS62&\"discount\"))*BX62,\"\")","v":""},{"$f":"IFERROR(IF(BX62<>\"\",BX62-BY62,\"\"),\"\")","v":""}]
[null,null,null,"Lock",{"$f":"IFERROR(IF(ISBLANK(D63),\"\",IF(FIND(D63,INDIRECT($D$62))>0,1,0)),0)","v":0},null,null,null,null,null,null,null,null,null,null,null,null,null,null,null,null,null,null,null,null,null,null,null,null,null,"",null,null,null,null,null,null,null,null,null,null,null,null,"AU","",{"$f":"i_Finish","v":0},null,"",{"$f":"IF(ISNUMBER(FIND(\"x\",BE63)),IFERROR(INDEX(INDIRECT(\"T_FinishColour[ColourCode-\"&IF(ISNUMBER(FIND(\"xxx\",BE63)),\"xxx\",IF(ISNUMBER(FIND(\"xx\",BE63)),\"xx\",\"error\"))&AR63&\"]\"),MATCH(AV63,T_FinishColour[Finish / Colour],0)),\"\"),\"\")","v":""},null,{"$f":"IF(AND(ISBLANK(BC63),ISBLANK(C63)),\"HIDE\",_xlfn.SWITCH(PRODUCT(C63:Z63,B63),2,\"HEADING\",1,\"SHOW\",0,\"HIDE\"))","v":"HIDE"},null,null,null,{"$f":"_xlfn.IFNA(SUBSTITUTE(IF(AR63=\"AU\",SUBSTITUTE(BE63,\"xxx\",AW63),SUBSTITUTE(SUBSTITUTE(BE63,\"xx\",AW63),\"x\",\"\")),\"LLL\",BG63*100),BE63)","v":"RB12-3835-503038"},null,"RB12-3835-503038","Easy Spring Air Tension Lock ",null,{"$f":"IF(ISBLANK(BO63),\"\",IF(OR(BO63=L_Units),\"Y\",\"N\"))","v":"N"},null,{"$f":"IFERROR(_xlfn.SINGLE(IF(BH63=\"Y\",((INDEX(#REF!,MATCH(BI63,#REF!,0),0))),\"\")),\"\")","v":""},null,"","","","Piece",{"$f":"IFERROR(IF(ISBLANK(BC63),\"\",INDEX(T_NAV_AU[Base Unit of Measure],MATCH(BC63,T_NAV_AU[No.],0))),\"\")","v":""},null,null,"HW",1,1,1,{"$f":"IFERROR(INDEX(INDIRECT(\"T_NAV_\"&i_Location&\"[\"&i_Location&\"]\"),MATCH(1,--(BC63=INDIRECT(\"T_NAV_\"&i_Location&\"[No.]\"))*--((INDIRECT(\"T_NAV_\"&i_Location&\"[\"&i_Location&\"]\"))<>\"\"),0))/IF(AND(BQ63=\"METRE\",BG63<>\"\",BR63=\"\"),BG63,1),\"\")","v":""},"",{"$f":"IF(BX63<>\"\",(INDIRECT(\"i_\"&BS63&\"discount\"))*BX63,\"\")","v":""},{"$f":"IFERROR(IF(BX63<>\"\",BX63-BY63,\"\"),\"\")","v":""}]
[null,null,null,"Pre",{"$f":"IFERROR(IF(ISBLANK(D64),\"\",IF(FIND(D64,INDIRECT($D$62))>0,1,0)),0)","v":0},null,null,null,null,null,null,null,null,null,null,null,null,null,null,null,null,null,null,null,null,null,null,null,null,null,"",null,null,null,null,null,null,null,null,null,null,null,null,"AU","",null,null,"",{"$f":"IF(ISNUMBER(FIND(\"x\",BE64)),IFERROR(INDEX(INDIRECT(\"T_FinishColour[ColourCode-\"&IF(ISNUMBER(FIND(\"xxx\",BE64)),\"xxx\",IF(ISNUMBER(FIND(\"xx\",BE64)),\"xx\",\"error\"))&AR64&\"]\"),MATCH(AV64,T_FinishColour[Finish / Colour],0)),\"\"),\"\")","v":""},null,{"$f":"IF(AND(ISBLANK(BC64),ISBLANK(C64)),\"HIDE\",_xlfn.SWITCH(PRODUCT(C64:Z64,B64),2,\"HEADING\",1,\"SHOW\",0,\"HIDE\"))","v":"HIDE"},null,null,null,{"$f":"_xlfn.IFNA(SUBSTITUTE(IF(AR64=\"AU\",SUBSTITUTE(BE64,\"xxx\",AW64),SUBSTITUTE(SUBSTITUTE(BE64,\"xx\",AW64),\"x\",\"\")),\"LLL\",\"580\"),BE64)","v":"RB12-3836-025000"},null,"RB12-3836-025000","Easy Spring Air - PreTension Tool",null,{"$f":"IF(ISBLANK(BO64),\"\",IF(OR(BO64=L_Units),\"Y\",\"N\"))","v":"N"},null,{"$f":"IFERROR(_xlfn.SINGLE(IF(BH64=\"Y\",((INDEX(#REF!,MATCH(BI64,#REF!,0),0))),\"\")),\"\")","v":""},null,"","","","Piece",{"$f":"IFERROR(IF(ISBLANK(BC64),\"\",INDEX(T_NAV_AU[Base Unit of Measure],MATCH(BC64,T_NAV_AU[No.],0))),\"\")","v":""},null,null,"HW",1,1,1,{"$f":"IFERROR(INDEX(INDIRECT(\"T_NAV_\"&i_Location&\"[\"&i_Location&\"]\"),MATCH(1,--(BC64=INDIRECT(\"T_NAV_\"&i_Location&\"[No.]\"))*--((INDIRECT(\"T_NAV_\"&i_Location&\"[\"&i_Location&\"]\"))<>\"\"),0))/IF(AND(BQ64=\"METRE\",BG64<>\"\",BR64=\"\"),BG64,1),\"\")","v":""},"",{"$f":"IF(BX64<>\"\",(INDIRECT(\"i_\"&BS64&\"discount\"))*BX64,\"\")","v":""},{"$f":"IFERROR(IF(BX64<>\"\",BX64-BY64,\"\"),\"\")","v":""}]
[null,null,null,"Spanner",{"$f":"IFERROR(IF(ISBLANK(D65),\"\",IF(FIND(D65,INDIRECT($D$62))>0,1,0)),0)","v":0},null,null,null,null,null,null,null,null,null,null,null,null,null,null,null,null,null,null,null,null,null,null,null,null,null,"",null,null,null,null,null,null,null,null,null,null,null,null,"AU","",null,null,"",{"$f":"IF(ISNUMBER(FIND(\"x\",BE65)),IFERROR(INDEX(INDIRECT(\"T_FinishColour[ColourCode-\"&IF(ISNUMBER(FIND(\"xxx\",BE65)),\"xxx\",IF(ISNUMBER(FIND(\"xx\",BE65)),\"xx\",\"error\"))&AR65&\"]\"),MATCH(AV65,T_FinishColour[Finish / Colour],0)),\"\"),\"\")","v":""},null,{"$f":"IF(AND(ISBLANK(BC65),ISBLANK(C65)),\"HIDE\",_xlfn.SWITCH(PRODUCT(C65:Z65,B65),2,\"HEADING\",1,\"SHOW\",0,\"HIDE\"))","v":"HIDE"},null,null,null,{"$f":"_xlfn.IFNA(SUBSTITUTE(IF(AR65=\"AU\",SUBSTITUTE(BE65,\"xxx\",AW65),SUBSTITUTE(SUBSTITUTE(BE65,\"xx\",AW65),\"x\",\"\")),\"LLL\",\"580\"),BE65)","v":"RB12-3837-025000"},null,"RB12-3837-025000","Easy Spring Air - Spanner Tool",null,{"$f":"IF(ISBLANK(BO65),\"\",IF(OR(BO65=L_Units),\"Y\",\"N\"))","v":"N"},null,{"$f":"IFERROR(_xlfn.SINGLE(IF(BH65=\"Y\",((INDEX(#REF!,MATCH(BI65,#REF!,0),0))),\"\")),\"\")","v":""},null,"","","","Piece",{"$f":"IFERROR(IF(ISBLANK(BC65),\"\",INDEX(T_NAV_AU[Base Unit of Measure],MATCH(BC65,T_NAV_AU[No.],0))),\"\")","v":""},null,null,"HW",1,1,1,{"$f":"IFERROR(INDEX(INDIRECT(\"T_NAV_\"&i_Location&\"[\"&i_Location&\"]\"),MATCH(1,--(BC65=INDIRECT(\"T_NAV_\"&i_Location&\"[No.]\"))*--((INDIRECT(\"T_NAV_\"&i_Location&\"[\"&i_Location&\"]\"))<>\"\"),0))/IF(AND(BQ65=\"METRE\",BG65<>\"\",BR65=\"\"),BG65,1),\"\")","v":""},"",{"$f":"IF(BX65<>\"\",(INDIRECT(\"i_\"&BS65&\"discount\"))*BX65,\"\")","v":""},{"$f":"IFERROR(IF(BX65<>\"\",BX65-BY65,\"\"),\"\")","v":""}]
[null,2,1,null,null,null,null,null,null,null,{"$f":"IFERROR(IF(ISBLANK(J66),\"\",IF(FIND(J66,INDIRECT($J$58))>0,1,0)),0)","v":""},null,null,null,null,null,null,null,null,null,null,null,null,null,null,null,null,null,null,null,"",null,null,null,null,null,null,null,null,null,null,null,null,null,"",null,null,"",{"$f":"IF(ISNUMBER(FIND(\"x\",BE66)),IFERROR(INDEX(INDIRECT(\"T_FinishColour[ColourCode-\"&IF(ISNUMBER(FIND(\"xxx\",BE66)),\"xxx\",IF(ISNUMBER(FIND(\"xx\",BE66)),\"xx\",\"error\"))&AR66&\"]\"),MATCH(AV66,T_FinishColour[Finish / Colour],0)),\"\"),\"\")","v":""},null,{"$f":"IF(AND(ISBLANK(BC66),ISBLANK(C66)),\"HIDE\",_xlfn.SWITCH(PRODUCT(C66:Z66,B66),2,\"HEADING\",1,\"SHOW\",0,\"HIDE\"))","v":"HEADING"},null,null,null,{"$f":"_xlfn.IFNA(SUBSTITUTE(IF(AR66=\"AU\",SUBSTITUTE(BE66,\"xxx\",AW66),SUBSTITUTE(SUBSTITUTE(BE66,\"xx\",AW66),\"x\",\"\")),\"LLL\",\"580\"),BE66)","v":""},null,null,null,null,{"$f":"IF(ISBLANK(BO66),\"\",IF(OR(BO66=L_Units),\"Y\",\"N\"))","v":""},null,{"$f":"IFERROR(_xlfn.SINGLE(IF(BH66=\"Y\",((INDEX(#REF!,MATCH(BI66,#REF!,0),0))),\"\")),\"\")","v":""},null,"","","",null,{"$f":"IFERROR(IF(ISBLANK(BC66),\"\",INDEX(T_NAV_AU[Base Unit of Measure],MATCH(BC66,T_NAV_AU[No.],0))),\"\")","v":""},null,null,null,null,"",{"$f":"IF(ISBLANK(BT66),\"\",PRODUCT(AE31,BT66))","v":""},{"$f":"IFERROR(INDEX(INDIRECT(\"T_NAV_\"&i_Location&\"[\"&i_Location&\"]\"),MATCH(1,--(BC66=INDIRECT(\"T_NAV_\"&i_Location&\"[No.]\"))*--((INDIRECT(\"T_NAV_\"&i_Location&\"[\"&i_Location&\"]\"))<>\"\"),0))/IF(AND(BQ66=\"METRE\",BG66<>\"\",BR66=\"\"),BG66,1),\"\")","v":""},"",{"$f":"IF(BX66<>\"\",(INDIRECT(\"i_\"&BS66&\"discount\"))*BX66,\"\")","v":""}]
[null,2,1,null,null,null,null,null,null,null,"",null,null,null,null,null,null,null,null,null,null,null,null,null,null,null,null,null,null,null,"",null,null,null,null,null,null,null,null,null,null,null,null,null,"",null,null,"",{"$f":"IF(ISNUMBER(FIND(\"x\",BE67)),IFERROR(INDEX(INDIRECT(\"T_FinishColour[ColourCode-\"&IF(ISNUMBER(FIND(\"xxx\",BE67)),\"xxx\",IF(ISNUMBER(FIND(\"xx\",BE67)),\"xx\",\"error\"))&AR67&\"]\"),MATCH(AV67,T_FinishColour[Finish / Colour],0)),\"\"),\"\")","v":""},null,{"$f":"IF(AND(ISBLANK(BC67),ISBLANK(C67)),\"HIDE\",_xlfn.SWITCH(PRODUCT(C67:Z67,B67),2,\"HEADING\",1,\"SHOW\",0,\"HIDE\"))","v":"HEADING"},null,null,null,"FABRIC",null,"FABRIC",null,null,null,null,{"$f":"IFERROR(_xlfn.SINGLE(IF(BH67=\"Y\",((INDEX(#REF!,MATCH(BI67,#REF!,0),0))),\"\")),\"\")","v":""},null,"","","",null,{"$f":"IFERROR(IF(ISBLANK(BC67),\"\",INDEX(T_NAV_AU[Base Unit of Measure],MATCH(BC67,T_NAV_AU[No.],0))),\"\")","v":""},null,null,null,null,"",null,{"$f":"IFERROR(INDEX(INDIRECT(\"T_NAV_\"&i_Location&\"[\"&i_Location&\"]\"),MATCH(1,--(BC67=INDIRECT(\"T_NAV_\"&i_Location&\"[No.]\"))*--((INDIRECT(\"T_NAV_\"&i_Location&\"[\"&i_Location&\"]\"))<>\"\"),0))/IF(AND(BQ67=\"METRE\",BG67<>\"\",BR67=\"\"),BG67,1),\"\")","v":""},"",""]
[null,2,1,null,null,null,null,null,null,null,"",null,null,null,null,null,null,null,null,null,null,null,null,null,null,null,null,null,null,null,"",null,null,null,null,null,null,null,null,null,null,null,null,null,"",null,null,"",{"$f":"IF(ISNUMBER(FIND(\"x\",BE68)),IFERROR(INDEX(INDIRECT(\"T_FinishColour[ColourCode-\"&IF(ISNUMBER(FIND(\"xxx\",BE68)),\"xxx\",IF(ISNUMBER(FIND(\"xx\",BE68)),\"xx\",\"error\"))&AR68&\"]\"),MATCH(AV68,T_FinishColour[Finish / Colour],0)),\"\"),\"\")","v":""},null,{"$f":"IF(AND(ISBLANK(BC68),ISBLANK(C68)),\"HIDE\",_xlfn.SWITCH(PRODUCT(C68:Z68,B68),2,\"HEADING\",1,\"SHOW\",0,\"HIDE\"))","v":"HEADING"},null,null,null,"NOT SUPPLIED",null,"Not Supplied","Fabric Width",null,{"$f":"IF(ISBLANK(BO68),\"\",IF(OR(BO68=L_Units),\"Y\",\"N\"))","v":{"$error":"#N/A"}},"Fabric",{"$f":"IFERROR(IF(BH68=\"Y\",((INDEX(T_Deduc18[Deduction],MATCH(BI68,T_Deduc18[Type],0),0))),\"\"),\"\")","v":""},"o_widthmm","","","",{"$f":"INDEX(T_UnitSelection[Units],MATCH(i_Units,T_UnitSelection[UnitSelection],0))","v":{"$error":"#N/A"}},{"$f":"IFERROR(IF(ISBLANK(BC68),\"\",INDEX(T_NAV_AU[Base Unit of Measure],MATCH(BC68,T_NAV_AU[No.],0))),\"\")","v":""},null,null,null,1,1,{"$f":"IF(ISBLANK(BT68),\"\",PRODUCT(AE68,BT68,i_systemQTY))","v":1},{"$f":"IFERROR(INDEX(INDIRECT(\"T_NAV_\"&i_Location&\"[\"&i_Location&\"]\"),MATCH(1,--(BC68=INDIRECT(\"T_NAV_\"&i_Location&\"[No.]\"))*--((INDIRECT(\"T_NAV_\"&i_Location&\"[\"&i_Location&\"]\"))<>\"\"),0))/IF(AND(BQ68=\"METRE\",BG68<>\"\",BR68=\"\"),BG68,1),\"\")","v":""},"","",{"$f":"IFERROR(IF(BX68<>\"\",BX68-BY68,\"\"),\"\")","v":""}]
[null,2,1,null,null,null,null,null,null,null,"",null,null,null,null,null,null,null,null,null,null,null,null,null,null,null,null,null,null,null,"",null,null,null,null,null,null,null,null,null,null,null,null,null,"",null,null,"",{"$f":"IF(ISNUMBER(FIND(\"x\",BE69)),IFERROR(INDEX(INDIRECT(\"T_FinishColour[ColourCode-\"&IF(ISNUMBER(FIND(\"xxx\",BE69)),\"xxx\",IF(ISNUMBER(FIND(\"xx\",BE69)),\"xx\",\"error\"))&AR69&\"]\"),MATCH(AV69,T_FinishColour[Finish / Colour],0)),\"\"),\"\")","v":""},null,{"$f":"IF(AND(ISBLANK(BC69),ISBLANK(C69)),\"HIDE\",_xlfn.SWITCH(PRODUCT(C69:Z69,B69),2,\"HEADING\",1,\"SHOW\",0,\"HIDE\"))","v":"HEADING"},null,null,null,null,null,null,"Fabric Drop",null,{"$f":"IF(ISBLANK(BO69),\"\",IF(OR(BO69=L_Units),\"Y\",\"N\"))","v":{"$error":"#N/A"}},"FabricDrop",{"$f":"IFERROR(IF(BH69=\"Y\",((INDEX(T_Deduc18[Deduction],MATCH(BI69,T_Deduc18[Type],0),0))),\"\"),\"\")","v":""},"o_dropmm","","","",{"$f":"INDEX(T_UnitSelection[Units],MATCH(i_Units,T_UnitSelection[UnitSelection],0))","v":{"$error":"#N/A"}},{"$f":"IFERROR(IF(ISBLANK(BC69),\"\",INDEX(T_NAV_AU[Base Unit of Measure],MATCH(BC69,T_NAV_AU[No.],0))),\"\")","v":""},null,null,null,null,null,null,{"$f":"IFERROR(INDEX(INDIRECT(\"T_NAV_\"&i_Location&\"[\"&i_Location&\"]\"),MATCH(1,--(BC69=INDIRECT(\"T_NAV_\"&i_Location&\"[No.]\"))*--((INDIRECT(\"T_NAV_\"&i_Location&\"[\"&i_Location&\"]\"))<>\"\"),0))/IF(AND(BQ69=\"METRE\",BG69<>\"\",BR69=\"\"),BG69,1),\"\")","v":""},"","",{"$f":"IFERROR(IF(BX69<>\"\",BX69-BY69,\"\"),\"\")","v":""}]
[null,2,1,null,null,null,null,null,null,null,"",null,null,null,null,null,null,null,null,null,null,null,null,null,null,null,null,null,null,null,null,null,null,null,null,null,null,null,null,null,null,null,null,null,null,null,null,null,null,null,{"$f":"IF(AND(ISBLANK(BC70),ISBLANK(C70)),\"HIDE\",_xlfn.SWITCH(PRODUCT(C70:Z70,B70),2,\"HEADING\",1,\"SHOW\",0,\"HIDE\"))","v":"HEADING"}]
[null,2,1,null,null,null,null,null,null,null,"",null,null,null,null,null,null,null,null,null,null,null,null,null,null,null,null,null,null,null,null,null,null,null,null,null,null,null,null,null,null,null,null,null,null,null,null,null,null,null,{"$f":"IF(AND(ISBLANK(BC71),ISBLANK(C71)),\"HIDE\",_xlfn.SWITCH(PRODUCT(C71:Z71,B71),2,\"HEADING\",1,\"SHOW\",0,\"HIDE\"))","v":"HEADING"},null,null,null,null,null,"CUSTOM NOTES"]
[null,null,1,null,null,null,null,null,null,null,"",null,null,null,null,null,null,null,null,null,null,null,null,null,null,null,null,null,null,null,null,null,null,null,null,null,null,null,null,null,null,null,null,null,null,null,null,null,null,null,{"$f":"IF(AND(ISBLANK(BC72),ISBLANK(C72)),\"HIDE\",_xlfn.SWITCH(PRODUCT(C72:Z72,B72),2,\"HEADING\",1,\"SHOW\",0,\"HIDE\"))","v":"SHOW"},null,null,null,null,null,{"$f":"\"Recommended \"&IF(i_Location=\"US\",\"Hem Bar\",\"Weight Bar\")&\" total mass: \"&IF(i_Units=\"Metric\",ROUND(o_wbRecMass_Metric,2)&\" kg\",ROUND(o_wbRecMass_Imperial,2)&\" lbs\")","v":{"$error":"#VALUE!"}}]
[null,null,1,null,null,null,null,null,null,null,"",null,null,null,null,null,null,null,null,null,null,null,null,null,null,null,null,null,null,null,null,null,null,null,null,null,null,null,null,null,null,null,null,null,null,null,null,null,null,null,{"$f":"IF(AND(ISBLANK(BC73),ISBLANK(C73)),\"HIDE\",_xlfn.SWITCH(PRODUCT(C73:Z73,B73),2,\"HEADING\",1,\"SHOW\",0,\"HIDE\"))","v":"SHOW"}]
[null,null,1,null,null,null,null,null,null,null,"",null,null,null,null,null,null,null,null,null,null,null,null,null,null,null,null,null,null,null,null,null,null,null,null,null,null,null,null,null,null,null,null,null,null,null,null,null,null,null,{"$f":"IF(AND(ISBLANK(BC74),ISBLANK(C74)),\"HIDE\",_xlfn.SWITCH(PRODUCT(C74:Z74,B74),2,\"HEADING\",1,\"SHOW\",0,\"HIDE\"))","v":"SHOW"}]
[null,null,1,null,null,null,null,null,null,null,{"$f":"IFERROR(IF(ISBLANK(J75),\"\",IF(FIND(J75,INDIRECT($J$58))>0,1,0)),0)","v":""},null,null,null,null,null,null,null,null,null,null,null,null,null,null,null,null,null,null,null,null,null,null,null,null,null,null,null,null,null,null,null,null,null,null,null,null,null,null,null,{"$f":"IF(AND(ISBLANK(BC75),ISBLANK(C75)),\"HIDE\",_xlfn.SWITCH(PRODUCT(C75:Z75,B75),2,\"HEADING\",1,\"SHOW\",0,\"HIDE\"))","v":"SHOW"}]
[null,null,1,null,null,null,null,null,null,null,{"$f":"IFERROR(IF(ISBLANK(J76),\"\",IF(FIND(J76,INDIRECT($J$58))>0,1,0)),0)","v":""},null,null,null,null,null,null,null,null,null,null,null,null,null,null,null,null,null,null,null,null,null,null,null,null,null,null,null,null,null,null,null,null,null,null,null,null,null,null,null,{"$f":"IF(AND(ISBLANK(BC76),ISBLANK(C76)),\"HIDE\",_xlfn.SWITCH(PRODUCT(C76:Z76,B76),2,\"HEADING\",1,\"SHOW\",0,\"HIDE\"))","v":"SHOW"}]
[null,null,null,null,null,null,null,null,null,null,null,null,null,null,null,null,null,null,null,null,null,null,null,null,null,null,null,null,null,null,null,null,null,null,null,null,null,null,null,null,null,null,null,null,{"$f":"IF(ISNUMBER(FIND(\"x\",BE77)),IFERROR(INDEX(AI77:AQ77,0,MATCH(AT77,AI77:AQ77,0)),IF(AI77<>\"\",AI77,i_DefaultColour)),\"\")","v":""},null,null,{"$f":"IF(ISNUMBER(FIND(\"x\",BE77)),IFERROR(INDEX(AI77:AQ77,0,MATCH(AT77,AI77:AQ77,0)),AS77),\"\")","v":""},{"$f":"IF(ISNUMBER(FIND(\"x\",BE77)),IFERROR(INDEX(INDIRECT(\"T_FinishColour[ColourCode-\"&IF(ISNUMBER(FIND(\"xxx\",BE77)),\"xxx\",IF(ISNUMBER(FIND(\"xx\",BE77)),\"xx\",\"error\"))&AR77&\"]\"),MATCH(AV77,T_FinishColour[Finish / Colour],0)),\"\"),\"\")","v":""},null,{"$f":"IF(AND(ISBLANK(BC77),ISBLANK(C77)),\"HIDE\",_xlfn.SWITCH(PRODUCT(C77:Z77,B77),2,\"HEADING\",1,\"SHOW\",0,\"HIDE\"))","v":"HIDE"}]
[null,null,null,null,null,null,null,null,null,null,null,null,null,null,null,null,null,null,null,null,null,null,null,null,null,null,null,null,null,null,null,null,null,null,null,null,null,null,null,null,null,null,null,null,"",null,null,"",{"$f":"IF(ISNUMBER(FIND(\"x\",BE78)),IFERROR(INDEX(INDIRECT(\"T_FinishColour[ColourCode-\"&IF(ISNUMBER(FIND(\"xxx\",BE78)),\"xxx\",IF(ISNUMBER(FIND(\"xx\",BE78)),\"xx\",\"error\"))&AR78&\"]\"),MATCH(AV78,T_FinishColour[Finish / Colour],0)),\"\"),\"\")","v":""},null,{"$f":"IF(i_Pricing=\"No\",\"HIDE\",\"SHOW\")","v":"HIDE"}]
[null,null,null,null,null,null,null,null,null,null,null,null,null,null,null,null,null,null,null,null,null,null,null,null,null,null,null,null,null,null,null,null,null,null,null,null,null,null,null,null,null,null,null,null,"",null,null,"",{"$f":"IF(ISNUMBER(FIND(\"x\",BE79)),IFERROR(INDEX(INDIRECT(\"T_FinishColour[ColourCode-\"&IF(ISNUMBER(FIND(\"xxx\",BE79)),\"xxx\",IF(ISNUMBER(FIND(\"xx\",BE79)),\"xx\",\"error\"))&AR79&\"]\"),MATCH(AV79,T_FinishColour[Finish / Colour],0)),\"\"),\"\")","v":""},null,{"$f":"IF(i_Pricing=\"No\",\"HIDE\",\"SHOW\")","v":"HIDE"},null,null,null,null,null,null,null,null,null,null,null,null,null,null,null,{"$f":"\"LIST PRICE: (\"&IF(CustomCurrency=\"\",i_Currency,CustomCurrency)&\")\"","v":{"$error":"#N/A"}},null,null,null,null,null,null,{"$f":"SUM(BX15:BX69)*(IF(CustomCurrencyRate<>\"\",CustomCurrencyRate,1))","v":0}]
[null,null,null,null,null,null,null,null,null,null,null,null,null,null,null,null,null,null,null,null,null,null,null,null,null,null,null,null,null,null,null,null,null,null,null,null,null,null,null,null,null,null,null,null,"",null,null,"",{"$f":"IF(ISNUMBER(FIND(\"x\",BE80)),IFERROR(INDEX(INDIRECT(\"T_FinishColour[ColourCode-\"&IF(ISNUMBER(FIND(\"xxx\",BE80)),\"xxx\",IF(ISNUMBER(FIND(\"xx\",BE80)),\"xx\",\"error\"))&AR80&\"]\"),MATCH(AV80,T_FinishColour[Finish / Colour],0)),\"\"),\"\")","v":""},null,{"$f":"IF(i_Pricing=\"No\",\"HIDE\",\"SHOW\")","v":"HIDE"},null,null,null,null,null,null,null,null,null,null,null,null,null,null,null,{"$f":"\"Discounts Applied: \"","v":"Discounts Applied: "},null,null,null,null,null,null,{"$f":"SUM(BY15:BY69)","v":0}]
[null,null,null,null,null,null,null,null,null,null,null,null,null,null,null,null,null,null,null,null,null,null,null,null,null,null,null,null,null,null,null,null,null,null,null,null,null,null,null,null,null,null,null,null,"",null,null,"",{"$f":"IF(ISNUMBER(FIND(\"x\",BE81)),IFERROR(INDEX(INDIRECT(\"T_FinishColour[ColourCode-\"&IF(ISNUMBER(FIND(\"xxx\",BE81)),\"xxx\",IF(ISNUMBER(FIND(\"xx\",BE81)),\"xx\",\"error\"))&AR81&\"]\"),MATCH(AV81,T_FinishColour[Finish / Colour],0)),\"\"),\"\")","v":""},null,{"$f":"IF(i_Pricing=\"No\",\"HIDE\",\"SHOW\")","v":"HIDE"},null,null,null,null,null,null,null,null,null,null,null,null,null,null,null,{"$f":"\"TOTAL ex. GST: (\"&IF(CustomCurrency=\"\",i_Currency,CustomCurrency)&\")\"","v":{"$error":"#N/A"}},null,null,null,null,null,null,{"$f":"BV79-BV80","v":0}]
[null,null,null,null,null,null,null,null,null,null,null,null,null,null,null,null,null,null,null,null,null,null,null,null,null,null,null,null,null,null,null,null,null,null,null,null,null,null,null,null,null,null,null,null,"",null,null,"",{"$f":"IF(ISNUMBER(FIND(\"x\",BE82)),IFERROR(INDEX(INDIRECT(\"T_FinishColour[ColourCode-\"&IF(ISNUMBER(FIND(\"xxx\",BE82)),\"xxx\",IF(ISNUMBER(FIND(\"xx\",BE82)),\"xx\",\"error\"))&AR82&\"]\"),MATCH(AV82,T_FinishColour[Finish / Colour],0)),\"\"),\"\")","v":""},null,{"$f":"IF(i_Pricing=\"No\",\"HIDE\",\"SHOW\")","v":"HIDE"}]
[null,null,null,null,null,null,null,null,null,null,null,null,null,null,null,null,null,null,null,null,null,null,null,null,null,null,null,null,null,null,null,null,null,null,null,null,null,null,null,null,null,null,null,null,"",null,null,"",{"$f":"IF(ISNUMBER(FIND(\"x\",BE83)),IFERROR(INDEX(INDIRECT(\"T_FinishColour[ColourCode-\"&IF(ISNUMBER(FIND(\"xxx\",BE83)),\"xxx\",IF(ISNUMBER(FIND(\"xx\",BE83)),\"xx\",\"error\"))&AR83&\"]\"),MATCH(AV83,T_FinishColour[Finish / Colour],0)),\"\"),\"\")","v":""},null,{"$f":"IF(AND(ISBLANK(BE83),ISBLANK(C83)),\"HIDE\",IF(PRODUCT(C83:Z83)=1,\"SHOW\",\"HIDE\"))","v":"HIDE"}]
[null,null,null,null,null,null,null,null,null,null,null,null,null,null,null,null,null,null,null,null,null,null,null,null,null,null,null,null,null,null,null,null,null,null,null,null,null,null,null,null,null,null,null,null,"",null,null,"",{"$f":"IF(ISNUMBER(FIND(\"x\",BE84)),IFERROR(INDEX(INDIRECT(\"T_FinishColour[ColourCode-\"&IF(ISNUMBER(FIND(\"xxx\",BE84)),\"xxx\",IF(ISNUMBER(FIND(\"xx\",BE84)),\"xx\",\"error\"))&AR84&\"]\"),MATCH(AV84,T_FinishColour[Finish / Colour],0)),\"\"),\"\")","v":""},null,"HIDE",null,null,null,null,null,null,null,null,null,null,null,null,null,null,null,"System unit cost",null,null,null,null,null,null,{"$f":"BV81/i_systemQTY","v":0}]
[null,null,null,null,null,null,null,null,null,null,null,null,null,null,null,null,null,null,null,null,null,null,null,null,null,null,null,null,null,null,null,null,null,null,null,null,null,null,null,null,null,null,null,null,"",null,null,"",{"$f":"IF(ISNUMBER(FIND(\"x\",BE85)),IFERROR(INDEX(INDIRECT(\"T_FinishColour[ColourCode-\"&IF(ISNUMBER(FIND(\"xxx\",BE85)),\"xxx\",IF(ISNUMBER(FIND(\"xx\",BE85)),\"xx\",\"error\"))&AR85&\"]\"),MATCH(AV85,T_FinishColour[Finish / Colour],0)),\"\"),\"\")","v":""},null,"HIDE"]
[null,null,null,null,null,null,null,null,null,null,null,null,null,null,null,null,null,null,null,null,null,null,null,null,null,null,null,null,null,null,null,null,null,null,null,null,null,null,null,null,null,null,null,null,"",null,null,"",{"$f":"IF(ISNUMBER(FIND(\"x\",BE86)),IFERROR(INDEX(INDIRECT(\"T_FinishColour[ColourCode-\"&IF(ISNUMBER(FIND(\"xxx\",BE86)),\"xxx\",IF(ISNUMBER(FIND(\"xx\",BE86)),\"xx\",\"error\"))&AR86&\"]\"),MATCH(AV86,T_FinishColour[Finish / Colour],0)),\"\"),\"\")","v":""},null,"HIDE"]
[null,null,null,null,null,null,null,null,null,null,null,null,null,null,null,null,null,null,null,null,null,null,null,null,null,null,null,null,null,null,null,null,null,null,null,null,null,null,null,null,null,null,null,null,"",null,null,"",{"$f":"IF(ISNUMBER(FIND(\"x\",BE87)),IFERROR(INDEX(INDIRECT(\"T_FinishColour[ColourCode-\"&IF(ISNUMBER(FIND(\"xxx\",BE87)),\"xxx\",IF(ISNUMBER(FIND(\"xx\",BE87)),\"xx\",\"error\"))&AR87&\"]\"),MATCH(AV87,T_FinishColour[Finish / Colour],0)),\"\"),\"\")","v":""},null,"HIDE"]
[null,null,null,null,null,null,null,null,null,null,null,null,null,null,null,null,null,null,null,null,null,null,null,null,null,null,null,null,null,null,null,null,null,null,null,null,null,null,null,null,null,null,null,null,"",null,null,"",{"$f":"IF(ISNUMBER(FIND(\"x\",BE88)),IFERROR(INDEX(INDIRECT(\"T_FinishColour[ColourCode-\"&IF(ISNUMBER(FIND(\"xxx\",BE88)),\"xxx\",IF(ISNUMBER(FIND(\"xx\",BE88)),\"xx\",\"error\"))&AR88&\"]\"),MATCH(AV88,T_FinishColour[Finish / Colour],0)),\"\"),\"\")","v":""},null,"HIDE"]
[null,null,null,null,null,null,null,null,null,null,null,null,null,null,null,null,null,null,null,null,null,null,null,null,null,null,null,null,null,null,null,null,null,null,null,null,null,null,null,null,null,null,null,null,null,null,null,"",{"$f":"IF(ISNUMBER(FIND(\"x\",BE89)),IFERROR(INDEX(INDIRECT(\"T_FinishColour[ColourCode-\"&IF(ISNUMBER(FIND(\"xxx\",BE89)),\"xxx\",IF(ISNUMBER(FIND(\"xx\",BE89)),\"xx\",\"error\"))&AR89&\"]\"),MATCH(AV89,T_FinishColour[Finish / Colour],0)),\"\"),\"\")","v":""},null,"HIDE"]
[null,null,null,null,null,null,null,null,null,null,null,null,null,null,null,null,null,null,null,null,null,null,null,null,null,null,null,null,null,null,null,null,null,null,null,null,null,null,null,null,null,null,null,null,null,null,null,null,null,null,"HIDE"]
[]
[]
[]
[]
[]
[]
[]
[]
[]
[]
[]
[]
[]
[]
[]
[]
[]
[]
[]
[]
[]
[]
[]
[]
[]
[]
[]
[]
[]
[]
[]
[]
[]
[]
[]
[]
[]
[]
[]
[]
[]
[]
[]
[]
[]
[]
[]
[]
[]
[]
[]
[]
[]
[]
[]
[]
[]
[]
[]
[]
[]
[]
[]
[]
[]
[]
[]
[]
[]
[]
[]
[]
[]
[]
[]
[]
[]
[]
[]
[]
[]
[]
[]
[]
[]
[]
[]
[]
[]
[]
[]
[]
[]
[]
[]
[]
[]
[]
[]
[]
[]
[]
[]
[]
[]
[]
[]
[]
[]
[]
[]
[]
[]
[]
[]
[null,null,null,null,"Ultra-Lock Wire Guide","Ultra-Lock Zipscreen"]
[]
[]
[]
[]
[]
[]
[]
[]
[]
[]
[]
[]
[]
[]
[]
[]
[]
[]
[]
[]
[]
[]
[]
[]
[]
[]
[]
[]
[]
[]
[null,null,null,null,null,"Ultra-Lock Zipscreen"]
[null,null,null,null,"Ultra-Lock Wire Guide"]

{"sheet":"Ctrl_Lists","index":3,"n_rows":57,"n_cols":37,"rows_kept":57,"cut":false,"hidden":true,"merged":[[20,25,20,26],[1,0,1,1],[19,13,19,15],[19,8,19,11],[20,8,20,11],[5,20,5,22],[6,20,6,22],[5,17,5,18]]}
[null,null,null,null,null,null,"TO BE FINISHED LATER>"]
["List Summary",null,null,null,null,null,null,null,null,null,null,null,null,null,null,null,null,null,null,null,"L_SelectUnitsSingle"]
[null,null,null,"i_Currency",null,null,null,null,null,null,null,null,null,null,"o_nScreens",null,null,null,null,null,{"$f":"IF(i_Units=\"Metric\",\"Imperial\",\"Metric\")","v":"Metric"}]
[null,null,null,{"$f":"INDEX(T_Currency[Currency],MATCH(i_Location,T_Location[Location],0))","v":{"$error":"#N/A"}},null,null,null,null,null,null,null,null,null,null,{"$f":"IF(OR(i_LinkedScreens=\"No\",i_LinkedScreens=\"\"),1,i_nScreens)","v":{"$error":"#NAME?"}},null,null,null,null,null,{"$f":"IF(i_Units=\"\",\"Imperial\",0)","v":"Imperial"}]
[null,"Activate List ->"]
[null,"Table/List Name (MUST MATCH) ->",{"$f":"\"T_\"&SUBSTITUTE((OFFSET(C6,2,0)),\" \",\"\")","v":"T_Installation"},"T_Currency","T_Location","T_BlindType","T_SystemType","T_InstallationType","T_ControlType","T_SideGuideFixing",null,{"$f":"\"T_\"&SUBSTITUTE((OFFSET(L6,2,0)),\" \",\"\")","v":"T_ControlSide"},"T_YesNo","T_BoxShape","T_nScreens","T_CassetteBrush","T_wbBallast","T_PivotArmLength",null,"T_Linked",{"$f":"\"T_\"&SUBSTITUTE((OFFSET(U6,2,0)),\" \",\"\")","v":"T_UnitSelection"},null,null,"T_SheetStatus",null,"T_Motor",null,{"$f":"\"T_\"&SUBSTITUTE((OFFSET(AB6,2,0)),\" \",\"\")","v":"T_RemoteList"},"T_ZipscreenSideGuides","T_WGTopTerminal","T_Booster","T_GearArm","T_GearRatio","T_BracketOptions","T_IdlerType","T_OpenBktOrientation","T_Sensors"]
[null,"List Test ->"]
[null,"Header Name ->","Installation","Currency","Location","Blind Type","System Type","Installation Type","Control Type","SideGuideFixing","Outcome","Control Side","YesNo","Box Shape","nScreens","CassetteBrush","wbBallast","PivotArmLength","Converted","Linked","UnitSelection","Units","Fabric","Status",null,"Motor",null,"RemoteList","ZipscreenSideGuides","WGTopTerminal","Booster","GearArm","GearRatio","BracketOptions","IdlerType","OpenBktOrientation","Sensors"]
[null,null,"Internal","AUD","US","Single","Zipscreen","Open","Spring","Side Guide - Face Fix (Wall / Outside Mount)","No Clip","Left","Yes","Round",2,"Yes","Yes","1.0m (40\")",1000,"No","Metric","mm","gsm","Development",null,"AUTOMATE | ARC FT Motor",null,"PUSH Five Ch. | White","L-Fixing Rail","Hook Saddle Bracket","Short","1m (40\")","5:1 (7.5 Nm)","Mild Steel","Bearing Idler 63mm","Bracket - Face Fix Orientation","No Sensor"]
[null,null,"External","USD",null,"Dual","VEUE - Straight Drop",null,"Gear","Side Guide - Recess Fix (Inside Mount)","Top Fix","Right","No","Square",3,"No","No","1.4m (55\")",1400,"Easy Link","Imperial","in","oz/yd²","Release",null,"Somfy Motor (Round Head)",null,"PUSH Five Ch. | Black","Face Fix U-Rail (Wall Mount)","Round Clamp Terminal","Standard","1.5m (60\")","8:1 (20 Nm)","Stainless Steel","Idler Housing & Pin Kit","Bracket - Top Fix Orientation","AUTOMATE | ARC Solar Sun & Wind Sensor"]
[null,null,null,"EUR",null,null,"VEUE - Wire Guide",null,"Motor",null,null,null,null,null,null,null,null,"1.6m",1600,"Multi Infinite Link",null,null,null,null,null,"Somfy Motor (Star Head)",null,"PUSH Fifteen Ch. | White",null,null,"Heavy","2m (80\")",null,null,"Extreme Bearing Idler"]
[null,null,null,null,null,null,"VEUE - Pivot Arm",null,null,null,null,null,null,null,null,null,null,null,null,null,null,null,null,null,null,null,null,"PUSH Fifteen Ch. | Black",null,null,"Extra Heavy"]
[null,null,null,null,null,null,"VEUE - Channel Guide",null,null,null,null,null,null,null,null,null,null,null,null,null,null,null,null,null,null,null,null,"No Remote",null,null,"Dual Heavy"]
[null,null,null,null,"EU",null,"EXTREME - Zipscreen"]
[null,null,null,null,null,null,"EXTREME - Wire Guide"]
[]
[]
[]
[]
[null,null,{"$f":"\"T_\"&SUBSTITUTE((OFFSET(C20,2,0)),\" \",\"\")","v":"T_Tube"},{"$f":"\"T_\"&SUBSTITUTE((OFFSET(D20,2,0)),\" \",\"\")","v":"T_WeightBar"},{"$f":"\"T_\"&SUBSTITUTE((OFFSET(E20,2,0)),\" \",\"\")","v":"T_wbSpline"},"T_TubeExtras","T_Chain","T_Finish","T_FinishColour",null,null,null,null,"T_Fabric",null,null,null,{"$f":"\"T_\"&SUBSTITUTE((OFFSET(R20,2,0)),\" \",\"\")","v":"T_ChainTensioner"},null,"T_ChainType",null,"T_CostCalc"]
[null,null,null,null,{"$f":"INDEX(Ctrl_Lists!$E$23:$E$30,MATCH(i_WeightBar,T_WeightBar[],0))","v":{"$error":"#N/A"}},null,null,null,null,null,null,null,null,"gsm","oz/yd²","mm",null,null,null,null,null,null,null,null,null,"Translate",null,null,{"$f":"\"T_\"&SUBSTITUTE((OFFSET(AC21,2,0)),\" \",\"\")","v":"T_HandleOptions"}]
[null,null,"Tube","WeightBar","wbSpline","TubeExtras","Chain","Finish","Finish / Colour","ColourCode-xxxAU","ColourCode-xxUS","ColourCode-xxxUS",null,"Metric","Imperial","Thickness",null,"ChainTensioner",null,"ChainType",null,"CostCalc",null,null,null,"US","AU"]
[null,null,"1.5\"","D30","9mm Flat Spline (D/S Tape)","Spline","50 cm","Mill",{"$f":"T_Finish[[#This Row],[Finish]]","v":"Mill"},"000","U",null,null,180,{"$f":"ROUND(T_Fabric[[#This Row],[Metric]]/33.9,2)","v":5.31},0.4,null,"Face Fix",null,"Plastic",null,"Pro-rata'd lengths",null,null,null,"Pin End","Idler End",null,"HandleOptions"]
[null,null,"S45 LT","Fabric Wrap","7.2mm Round Spline w/ 15mm Tail","D/S Tape","75 cm","Anodised","Anodised","018","A",null,null,320,{"$f":"ROUND(T_Fabric[[#This Row],[Metric]]/33.9,2)","v":9.44},0.55000000000000004,null,"Recess Fix",null,"Metal",null,"Charge full lengths",null,null,null,"Edge","dim-OUT",null,"No"]
[null,null,"S45 STD","F4115",null,null,"100 cm","Power Coat","Stainless","013",null,null,null,420,{"$f":"ROUND(T_Fabric[[#This Row],[Metric]]/33.9,2)","v":12.39},0.55000000000000004,null,"Universal",null,null,null,"Minimum pack sizes???",null,null,null,null,null,null,"Handle (x1)"]
[null,null,"S45 HD","Oval",null,null,"125 cm",null,"Black","050","BK","050",null,500,{"$f":"ROUND(T_Fabric[[#This Row],[Metric]]/33.9,2)","v":14.75},0.9,null,"Chain Hold",null,null,null,null,null,null,null,null,null,null,"Handle (x2)"]
[null,null,null,"Round",null,null,"150 cm",null,"White","069","W","075"]
[null,null,null,"No Weight Bar",null,null,"175 cm",null,"Silver Grey","338"]
[null,null,null,"HB16",null,null,"200 cm",null,"Bronze","082","BR",472]
[null,null,null,null,null,null,null,null,"Vanilla",null,"V",414]
[null,null,null,null,null,null,null,null,"Cream",null,"CR"]
[null,null,null,null,null,null,null,null,"Sandstone","269"]
[null,null,null,null,null,null,null,null,"Barley","283"]
[null,null,null,null,null,null,null,null,"Gray","340","G"]
[null,null,null,null,null,null,null,null,"Brown",null,"GR"]
[null,null,null,null,null,null,null,null,"Zinc Plated","025",{"$f":"1/0","v":{"$error":"#DIV/0!"}},"025"]
[null,null,null,null,null,null,null,null,"Monument"]
[null,null,null,null,null,null,null,null,"Woodland Grey"]
[]
[null,null,null,null,null,null,null,null,null,"Test"]
[null,null,null,null,null,null,null,null,"L_ColourList"]
[]
[]
[]
[]
[]
[]
[null,null,null,null,null,null,null,null,{"$f":"_xlfn._xlws.FILTER(T_FinishColour[Finish / Colour],T_FinishColour[ColourCode-xxxUS]<>\"\")","v":"Black"},null,null,null,null,{"$f":"\"T_\"&SUBSTITUTE((OFFSET(N48,2,0)),\" \",\"\")","v":"T_wbBrush"},{"$f":"\"T_\"&SUBSTITUTE((OFFSET(O48,2,0)),\" \",\"\")","v":"T_wbBubbleSeal"},null,{"$f":"\"T_\"&SUBSTITUTE((OFFSET(Q48,2,0)),\" \",\"\")","v":"T_ChainLength"}]
[null,null,null,null,null,null,null,null,"White"]
[null,null,null,null,null,null,null,null,"Bronze",null,null,null,null,"wbBrush","wbBubbleSeal",null,"ChainLength"]
[null,null,null,null,null,null,null,null,"Vanilla",null,null,null,null,"Yes","No Bubble Seal",null,50]
[null,null,null,null,null,null,null,null,"Zinc Plated",null,null,null,null,"No","Yes - Bottom/Back Seal (1x)",null,75]
[null,null,null,null,null,null,null,null,null,null,null,null,null,null,"Yes - Bottom + Back Seal (2x)",null,100]
[null,null,null,null,null,null,null,null,null,null,null,null,null,null,null,null,125]
[null,null,null,null,null,null,null,null,null,null,null,null,null,null,null,null,150]
[null,null,null,null,null,null,null,null,null,null,null,null,null,null,null,null,175]
[null,null,null,null,null,null,null,null,null,null,null,null,null,null,null,null,200]

{"sheet":"Ctrl_Selections","index":4,"n_rows":768,"n_cols":14,"rows_kept":768,"cut":false,"hidden":true,"merged":[[543,3,545,3],[546,3,548,3],[575,2,576,2],[573,4,573,13],[575,3,576,3],[577,3,578,3],[595,3,595,13],[556,3,556,13],[580,2,582,2],[583,2,587,2],[543,2,545,2],[546,2,548,2],[14,3,18,3],[14,2,18,2],[84,3,87,3],[88,2,90,2],[88,3,90,3],[481,3,485,3],[527,3,527,13],[514,3,515,3],[514,2,515,2],[244,2,247,2],[248,2,250,2],[262,3,262,13],[387,3,389,3],[468,3,468,13],[360,3,360,13],[248,3,250,3],[541,2,542,2],[541,3,542,3],[511,2,513,2],[511,3,513,3],[293,3,295,3],[37,4,37,13],[177,3,177,13],[382,3,386,3],[202,2,206,2],[202,3,206,3],[207,2,210,2],[207,3,210,3],[509,4,509,13],[499,3,499,13],[272,3,272,13],[219,3,219,13],[326,4,326,13],[328,2,331,2],[328,3,331,3],[332,2,337,2],[332,3,337,3],[486,3,490,3],[486,2,490,2],[449,3,450,3],[6,2,10,2],[6,3,10,3],[11,3,13,3],[111,3,111,13],[39,2,44,2],[39,3,44,3],[227,3,227,13],[200,4,200,13],[123,4,123,13],[125,2,129,2],[125,3,129,3],[145,3,145,13],[130,3,135,3],[130,2,135,2],[185,3,185,13],[11,2,13,2],[162,3,165,3],[162,2,165,2],[166,2,168,2],[166,3,168,3],[62,3,62,13],[70,3,70,13],[82,4,82,13],[84,2,87,2],[2,0,2,1],[760,3,760,13],[731,4,731,13],[744,3,744,13],[752,3,752,13],[287,4,287,13],[289,2,292,2],[307,3,307,13],[293,2,295,2],[447,4,447,13],[460,3,460,13],[400,3,400,13],[387,2,389,2],[160,4,160,13],[564,3,564,13],[99,3,99,13],[380,4,380,13],[382,2,386,2],[4,4,4,13],[27,3,27,13],[242,4,242,13],[449,2,450,2],[479,4,479,13],[481,2,485,2],[717,3,717,13],[704,4,704,13],[706,2,708,2],[706,3,708,3],[614,4,614,13],[619,2,622,2],[635,3,635,13],[616,3,618,3],[616,2,618,2],[619,3,622,3],[623,3,625,3],[623,2,625,2],[647,4,647,13],[649,2,651,2],[649,3,651,3],[652,2,654,2],[539,4,539,13],[692,3,692,13],[289,3,292,3],[244,3,247,3],[418,4,418,13],[420,2,424,2],[420,3,424,3],[434,3,434,13],[425,2,426,2],[425,3,426,3],[680,2,681,2],[680,3,681,3],[682,2,684,2],[682,3,684,3],[652,3,654,3],[655,2,657,2],[655,3,657,3],[667,3,667,13],[678,4,678,13],[350,3,350,13],[338,2,340,2],[338,3,340,3],[603,3,603,13],[577,2,579,2]]}
[null,null,"=IF(INDIRECT(\"i_\"&SUBSTITUTE(D55,\" \",\"\")),0,\"No\") if a default value is required"]
[]
["Configuration Matrix"]
[]
[null,null,"Enter DEPENDENCIES","SELECTION OPTIONS","CONFIGURATIONS"]
[null,null,"Ref Position →",{"$f":"COUNTA(D7:D20)","v":2},{"$f":"SUM(COUNTIF(E7:E20,$C7:$C20))","v":0},{"$f":"SUM(COUNTIF(F7:F20,$C7:$C20))","v":0},{"$f":"SUM(COUNTIF(G7:G20,$C7:$C20))","v":0},{"$f":"SUM(COUNTIF(H7:H20,$C7:$C20))","v":0},{"$f":"SUM(COUNTIF(I7:I20,$C7:$C20))","v":0},{"$f":"SUM(COUNTIF(J7:J20,$C7:$C20))","v":0},{"$f":"SUM(COUNTIF(K7:K20,$C7:$C20))","v":0},{"$f":"SUM(COUNTIF(L7:L20,$C7:$C20))","v":0},{"$f":"SUM(COUNTIF(M7:M20,$C7:$C20))","v":0},{"$f":"SUM(COUNTIF(N7:N20,$C7:$C20))","v":0}]
[null,"Enter Selection 1 ->",{"$f":"i_InstallationType","v":0},"Installation Type","Open"]
[]
[]
[]
[]
[null,"Enter Selection 2->",{"$f":"i_BktFixType","v":0},"Bkt Fix Type","Bracket - Face Fix Orientation"]
[null,null,null,null,"Bracket - Top Fix Orientation"]
[]
[]
[]
[]
[]
[null,"Enter Selection 3->"]
[null,"Enter Selection 4->"]
[]
[null,null,null,{"$f":"MAX(E22:N22)","v":0},{"$f":"IF(E6<>$D6,0,COUNTA(E23:E27))","v":0},0,0,0,0,0,0,0,0,0]
[null,"Dependent (Output List) 1 -> ",null,"OpenBktCovers","Yes"]
[null,null,null,null,"No"]
[]
[]
[]
[null,null,null,"DO NOT FILL"]
[]
[null,null,null,{"$f":"D23","v":"OpenBktCovers"},null,null,{"$f":"SUBSTITUTE(\" \",\"\",$D7)","v":" "},{"$f":"IFERROR(INDEX(#REF!, MATCH(0, COUNTIF($D30:G$445,#REF!) + ( COUNTIF(#REF!,#REF!)<>1), 0)), \"\")","v":""},{"$f":"IFERROR(INDEX(#REF!, MATCH(0, COUNTIF($D30:H$445,#REF!) + ( COUNTIF(#REF!,#REF!)<>1), 0)), \"\")","v":""}]
[null,null,"row",{"$f":"MATCH(D30,$D6:$D29,0)","v":18}]
[null,null,"column",{"$f":"MATCH(OFFSET($D6,MATCH(D30,$D6:$D29,0)-2,0),OFFSET($D6,MATCH(D30,$D6:$D29,0)-2,1,1,11),0)+1","v":2}]
[null,null,"Size",{"$f":"OFFSET($D6,MATCH(D30,$D6:$D29,0)-2,0,)","v":0}]
[null,null,"Test →"]
[null,null,"Data Validation Name",{"$f":"\"L_\"&SUBSTITUTE(D30,\" \",\"\")","v":"L_OpenBktCovers"}]
[]
[]
[null,null,"Enter DEPENDENCIES","SELECTION OPTIONS","CONFIGURATIONS"]
[null,null,"Ref Position →",{"$f":"COUNTA(D40:D51)","v":1},{"$f":"SUM(COUNTIF(E40:E51,$C40:$C51))","v":0},{"$f":"SUM(COUNTIF(F40:F51,$C40:$C51))","v":0},{"$f":"SUM(COUNTIF(G40:G51,$C40:$C51))","v":0},{"$f":"SUM(COUNTIF(H40:H51,$C40:$C51))","v":0},{"$f":"SUM(COUNTIF(I40:I51,$C40:$C51))","v":0},{"$f":"SUM(COUNTIF(J40:J51,$C40:$C51))","v":0},{"$f":"SUM(COUNTIF(K40:K51,$C40:$C51))","v":0},{"$f":"SUM(COUNTIF(L40:L51,$C40:$C51))","v":0},{"$f":"SUM(COUNTIF(M40:M51,$C40:$C51))","v":0},{"$f":"SUM(COUNTIF(N40:N51,$C40:$C51))","v":0}]
[null,"Enter Selection 2->",{"$f":"i_InstallationType","v":0},"Installation Type","Open",null,null,null,null,null,"Open"]
[]
[]
[]
[]
[]
[null,null,null,null,null,null,null,null,null,null,"Bracket - Recess Fix"]
[]
[]
[]
[null,"Enter Selection 3->"]
[null,"Enter Selection 4->"]
[]
[null,null,null,{"$f":"MAX(E53:N53)","v":0},{"$f":"IF(E39<>$D39,0,COUNTA(E54:E62))","v":0},0,0,0,0,0,0,0,0,0]
[null,"Dependent (Output List) 1 -> ",null,"Tension Tool","Not Required",null,null,null,null,null,"Side Guide - Recess Fix (Inside Mount)"]
[null,null,null,null,"Tension Lock - 1.5\""]
[null,null,null,null,"PreTension Tool 1.5\""]
[null,null,null,null,"Spanner Tool"]
[null,null,null,null,"Tension Lock + PreTension + Spanner"]
[null,null,null,null,"Tension Lock + PreTension"]
[null,null,null,null,"Tension Lock + Spanner"]
[null,null,null,null,"PreTension + Spanner"]
[]
[null,null,null,"DO NOT FILL"]
[]
[null,null,null,{"$f":"MAX(E65:N65)","v":0},{"$f":"IF(E39<>$D39,0,COUNTA(E66:E70))","v":0},0,0,0,0,0,0,0,0,0]
[null,"Dependent (Output List) 1 -> "]
[]
[]
[]
[]
[null,null,null,"DO NOT FILL"]
[]
[null,null,null,{"$f":"D54","v":"Tension Tool"},{"$f":"D66","v":0},null,null,{"$f":"IFERROR(INDEX(#REF!, MATCH(0, COUNTIF($D73:G$445,#REF!) + ( COUNTIF(#REF!,#REF!)<>1), 0)), \"\")","v":""},{"$f":"IFERROR(INDEX(#REF!, MATCH(0, COUNTIF($D73:H$445,#REF!) + ( COUNTIF(#REF!,#REF!)<>1), 0)), \"\")","v":""}]
[null,null,"row",{"$f":"MATCH(D73,$D39:$D71,0)","v":16},{"$f":"MATCH(E73,$D39:$D71,0)","v":15}]
[null,null,"column",{"$f":"MATCH(OFFSET($D39,MATCH(D73,$D39:$D64,0)-2,0),OFFSET($D39,MATCH(D73,$D39:$D64,0)-2,1,1,11),0)+1","v":2},{"$f":"MATCH(OFFSET($D39,MATCH(E73,$D39:$D71,0)-2,0),OFFSET($D39,MATCH(E73,$D39:$D71,0)-2,1,1,11),0)+1","v":{"$error":"#N/A"}}]
[null,null,"Size",{"$f":"OFFSET($D39,MATCH(D73,$D39:$D64,0)-2,0,)","v":0},{"$f":"OFFSET($D39,MATCH(E73,$D39:$D71,0)-2,0,)","v":0}]
[null,null,"Test →"]
[null,null,"Data Validation Name",{"$f":"\"L_\"&SUBSTITUTE(D73,\" \",\"\")","v":"L_TensionTool"},{"$f":"\"L_\"&SUBSTITUTE(E73,\" \",\"\")","v":"L_0"}]
[]
[]
[]
[]
[null,null,"Enter DEPENDENCIES","SELECTION OPTIONS","CONFIGURATIONS"]
[null,null,"Ref Position →",{"$f":"COUNTA(D85:D91)","v":1},{"$f":"SUM(COUNTIF(E85:E91,$C85:$C91))","v":0},{"$f":"SUM(COUNTIF(F85:F91,$C85:$C91))","v":0},{"$f":"SUM(COUNTIF(G85:G91,$C85:$C91))","v":0},{"$f":"SUM(COUNTIF(H85:H91,$C85:$C91))","v":0},{"$f":"SUM(COUNTIF(I85:I91,$C85:$C91))","v":0},{"$f":"SUM(COUNTIF(J85:J91,$C85:$C91))","v":0},{"$f":"SUM(COUNTIF(K85:K91,$C85:$C91))","v":0},{"$f":"SUM(COUNTIF(L85:L91,$C85:$C91))","v":0},{"$f":"SUM(COUNTIF(M85:M91,$C85:$C91))","v":0},{"$f":"SUM(COUNTIF(N85:N91,$C85:$C91))","v":0}]
[null,"Enter Selection 1 ->",{"$f":"i_Location","v":0},"Location","AU","US"]
[]
[]
[]
[]
[]
[]
[]
[null,null,null,{"$f":"MAX(E93:N93)","v":0},{"$f":"IF(E84<>$D84,0,COUNTA(E94:E99))","v":0},{"$f":"IF(F84<>$D84,0,COUNTA(F94:F99))","v":0},0,0,0,0,0,0,0,0]
[null,"Dependent (Output List) 1 -> ",null,"Booster","Compact","Short"]
[null,null,null,null,"Short","Standard"]
[null,null,null,null,"Standard","Heavy"]
[null,null,null,null,"Heavy","Extra Heavy"]
[null,null,null,null,"Extra Heavy"]
[null,null,null,null,"Dual Heavy"]
[null,null,null,"DO NOT FILL"]
[]
[null,null,null,{"$f":"MAX(E102:N102)","v":0},{"$f":"IF(E84<>$D84,0,COUNTA(E103:E111))","v":0},{"$f":"IF(F84<>$D84,0,COUNTA(F103:F111))","v":0},0,0,0,0,0,0,0,0]
[null,"Dependent (Output List) 1 -> ",null,"Colours","Black (050)","Black (050)"]
[null,null,null,null,"Monument (057)","White (069)"]
[null,null,null,null,"Surfmist (068)","Bronze (080)"]
[null,null,null,null,"White (069)","Woodland Grey (352)"]
[null,null,null,null,"Classic Cream (295)","Paperbark (425)"]
[null,null,null,null,"Woodland Grey (352)"]
[null,null,null,null,"Paperbark (425)"]
[]
[]
[null,null,null,"DO NOT FILL"]
[]
[null,null,null,{"$f":"D94","v":"Booster"},{"$f":"D103","v":"Colours"},null,{"$f":"SUBSTITUTE(\" \",\"\",$D85)","v":" "},{"$f":"IFERROR(INDEX(#REF!, MATCH(0, COUNTIF($D114:G$445,#REF!) + ( COUNTIF(#REF!,#REF!)<>1), 0)), \"\")","v":""},{"$f":"IFERROR(INDEX(#REF!, MATCH(0, COUNTIF($D114:H$445,#REF!) + ( COUNTIF(#REF!,#REF!)<>1), 0)), \"\")","v":""}]
[null,null,"row",{"$f":"MATCH(D114,$D84:$D101,0)","v":11},{"$f":"MATCH(E114,$D84:$D112,0)","v":20}]
[null,null,"column",{"$f":"MATCH(OFFSET($D84,MATCH(D114,$D84:$D101,0)-2,0),OFFSET($D84,MATCH(D114,$D84:$D101,0)-2,1,1,11),0)+1","v":2},{"$f":"MATCH(OFFSET($D84,MATCH(E114,$D84:$D112,0)-2,0),OFFSET($D84,MATCH(E114,$D84:$D112,0)-2,1,1,11),0)+1","v":2}]
[null,null,"Size",{"$f":"OFFSET($D84,MATCH(D114,$D84:$D101,0)-2,0,)","v":0},{"$f":"OFFSET($D84,MATCH(E114,$D84:$D112,0)-2,0,)","v":0}]
[null,null,"Test →"]
[null,null,"Data Validation Name",{"$f":"\"L_\"&SUBSTITUTE(D114,\" \",\"\")","v":"L_Booster"},{"$f":"\"L_\"&SUBSTITUTE(E114,\" \",\"\")","v":"L_Colours"}]
[]
[]
[]
[]
[null,null,"Enter DEPENDENCIES","SELECTION OPTIONS","CONFIGURATIONS"]
[null,null,"Ref Position →",{"$f":"COUNTA(D126:D137)","v":1},{"$f":"SUM(COUNTIF(E126:E137,$C126:$C137))","v":0},{"$f":"SUM(COUNTIF(F126:F137,$C126:$C137))","v":0},{"$f":"SUM(COUNTIF(G126:G137,$C126:$C137))","v":0},{"$f":"SUM(COUNTIF(H126:H137,$C126:$C137))","v":0},{"$f":"SUM(COUNTIF(I126:I137,$C126:$C137))","v":0},{"$f":"SUM(COUNTIF(J126:J137,$C126:$C137))","v":0},{"$f":"SUM(COUNTIF(K126:K137,$C126:$C137))","v":0},{"$f":"SUM(COUNTIF(L126:L137,$C126:$C137))","v":0},{"$f":"SUM(COUNTIF(M126:M137,$C126:$C137))","v":0},{"$f":"SUM(COUNTIF(N126:N137,$C126:$C137))","v":0}]
[null,"Enter Selection 1 ->",{"$f":"i_InstallationType","v":0},"Installation Type","Open"]
[]
[]
[]
[]
[]
[]
[]
[]
[]
[]
[]
[]
[null,null,null,{"$f":"MAX(E139:N139)","v":0},{"$f":"IF(E125<>$D125,0,COUNTA(E140:E145))","v":0},0,0,0,0,0,0,0,0,0]
[null,"Dependent (Output List) 1 -> ",null,"Bkt Fix Orientation","Bracket - Face Fix Orientation"]
[null,null,null,null,"Bracket - Top Fix Orientation"]
[]
[]
[]
[]
[null,null,null,"DO NOT FILL"]
[]
[null,null,null,{"$f":"D140","v":"Bkt Fix Orientation"},null,null,{"$f":"SUBSTITUTE(\" \",\"\",$D126)","v":" "},{"$f":"IFERROR(INDEX(#REF!, MATCH(0, COUNTIF($D148:G$445,#REF!) + ( COUNTIF(#REF!,#REF!)<>1), 0)), \"\")","v":""},{"$f":"IFERROR(INDEX(#REF!, MATCH(0, COUNTIF($D148:H$445,#REF!) + ( COUNTIF(#REF!,#REF!)<>1), 0)), \"\")","v":""}]
[null,null,"row",{"$f":"MATCH(D148,$D125:$D147,0)","v":16}]
[null,null,"column",{"$f":"MATCH(OFFSET($D125,MATCH(D148,$D125:$D147,0)-2,0),OFFSET($D125,MATCH(D148,$D125:$D147,0)-2,1,1,11),0)+1","v":2}]
[null,null,"Size",{"$f":"OFFSET($D125,MATCH(D148,$D125:$D147,0)-2,0,)","v":0}]
[null,null,"Test →"]
[null,null,"Data Validation Name",{"$f":"\"L_\"&SUBSTITUTE(D148,\" \",\"\")","v":"L_BktFixOrientation"}]
[]
[]
[]
[]
[]
[]
[]
[null,null,"Enter DEPENDENCIES","SELECTION OPTIONS","CONFIGURATIONS"]
[null,null,"Ref Position →",{"$f":"COUNTA(D163:D169)","v":1},{"$f":"SUM(COUNTIF(E163:E169,$C163:$C169))","v":0},{"$f":"SUM(COUNTIF(F163:F169,$C163:$C169))","v":0},{"$f":"SUM(COUNTIF(G163:G169,$C163:$C169))","v":0},{"$f":"SUM(COUNTIF(H163:H169,$C163:$C169))","v":0},{"$f":"SUM(COUNTIF(I163:I169,$C163:$C169))","v":0},{"$f":"SUM(COUNTIF(J163:J169,$C163:$C169))","v":0},{"$f":"SUM(COUNTIF(K163:K169,$C163:$C169))","v":0},{"$f":"SUM(COUNTIF(L163:L169,$C163:$C169))","v":0},{"$f":"SUM(COUNTIF(M163:M169,$C163:$C169))","v":0},{"$f":"SUM(COUNTIF(N163:N169,$C163:$C169))","v":0}]
[null,"Enter Selection 1 ->",{"$f":"i_SystemType","v":0},"System Type"]
[]
[]
[]
[]
[]
[]
[]
[null,null,null,{"$f":"MAX(E171:N171)","v":0},{"$f":"IF(E162<>$D162,0,COUNTA(E172:E177))","v":0},0,0,0,0,0,0,0,0,0]
[null,"Dependent (Output List) 1 -> ",null,"Installation Type"]
[]
[]
[]
[]
[]
[null,null,null,"DO NOT FILL"]
[]
[null,null,null,{"$f":"MAX(E180:N180)","v":0},{"$f":"IF(E162<>$D162,0,COUNTA(E181:E185))","v":0},0,0,0,0,0,0,0,0,0]
[null,"Dependent (Output List) 1 -> "]
[]
[]
[]
[]
[null,null,null,"DO NOT FILL"]
[]
[null,null,null,{"$f":"D172","v":"Installation Type"},{"$f":"D181","v":0},null,{"$f":"SUBSTITUTE(\" \",\"\",$D163)","v":" "},{"$f":"IFERROR(INDEX(#REF!, MATCH(0, COUNTIF($D188:G$445,#REF!) + ( COUNTIF(#REF!,#REF!)<>1), 0)), \"\")","v":""},{"$f":"IFERROR(INDEX(#REF!, MATCH(0, COUNTIF($D188:H$445,#REF!) + ( COUNTIF(#REF!,#REF!)<>1), 0)), \"\")","v":""}]
[null,null,"row",{"$f":"MATCH(D188,$D162:$D179,0)","v":11},{"$f":"MATCH(E188,$D162:$D186,0)","v":10}]
[null,null,"column",{"$f":"MATCH(OFFSET($D162,MATCH(D188,$D162:$D179,0)-2,0),OFFSET($D162,MATCH(D188,$D162:$D179,0)-2,1,1,11),0)+1","v":2},{"$f":"MATCH(OFFSET($D162,MATCH(E188,$D162:$D186,0)-2,0),OFFSET($D162,MATCH(E188,$D162:$D186,0)-2,1,1,11),0)+1","v":{"$error":"#N/A"}}]
[null,null,"Size",{"$f":"OFFSET($D162,MATCH(D188,$D162:$D179,0)-2,0,)","v":0},{"$f":"OFFSET($D162,MATCH(E188,$D162:$D186,0)-2,0,)","v":0}]
[null,null,"Test →"]
[null,null,"Data Validation Name",{"$f":"\"L_\"&SUBSTITUTE(D188,\" \",\"\")","v":"L_InstallationType"},{"$f":"\"L_\"&SUBSTITUTE(E188,\" \",\"\")","v":"L_0"}]
[]
[]
[]
[]
[]
[]
[]
[null,null,"Enter DEPENDENCIES","SELECTION OPTIONS","CONFIGURATIONS"]
[null,null,"Ref Position →",{"$f":"COUNTA(D203:D211)","v":1},{"$f":"SUM(COUNTIF(E203:E211,$C203:$C211))","v":0},{"$f":"SUM(COUNTIF(F203:F211,$C203:$C211))","v":0},{"$f":"SUM(COUNTIF(G203:G211,$C203:$C211))","v":0},{"$f":"SUM(COUNTIF(H203:H211,$C203:$C211))","v":0},{"$f":"SUM(COUNTIF(I203:I211,$C203:$C211))","v":0},{"$f":"SUM(COUNTIF(J203:J211,$C203:$C211))","v":0},{"$f":"SUM(COUNTIF(K203:K211,$C203:$C211))","v":0},{"$f":"SUM(COUNTIF(L203:L211,$C203:$C211))","v":0},{"$f":"SUM(COUNTIF(M203:M211,$C203:$C211))","v":0},{"$f":"SUM(COUNTIF(N203:N211,$C203:$C211))","v":0}]
[null,"Enter Selection 1 ->",{"$f":"i_InstallationType","v":0},"Installation Type","Open"]
[]
[]
[]
[]
[null,null,{"$f":"i_Tube","v":0}]
[]
[]
[]
[]
[null,null,null,{"$f":"MAX(E213:N213)","v":0},{"$f":"IF(E202<>$D202,0,COUNTA(E214:E219))","v":0},0,0,0,0,0,0,0,0,0]
[null,"Dependent (Output List) 1 -> ",null,"Idler Type","Skyline Pin End 1.5\""]
[null,null,null,null,"Skyline Heavy Duty Pin End 1.5\""]
[null,null,null,null,"Single Limiter | Universal 1.5\""]
[null,null,null,null,"Single Stop Limiter | Short 1.5\""]
[]
[]
[null,null,null,"DO NOT FILL"]
[]
[null,null,null,{"$f":"MAX(E222:N222)","v":0},{"$f":"IF(E202<>$D202,0,COUNTA(E223:E227))","v":0},0,0,0,0,0,0,0,0,0]
[null,"Dependent (Output List) 1 -> "]
[]
[]
[]
[]
[null,null,null,"DO NOT FILL"]
[]
[null,null,null,{"$f":"D214","v":"Idler Type"},{"$f":"D223","v":0},null,{"$f":"SUBSTITUTE(\" \",\"\",$D203)","v":" "},{"$f":"IFERROR(INDEX(#REF!, MATCH(0, COUNTIF($D230:G$445,#REF!) + ( COUNTIF(#REF!,#REF!)<>1), 0)), \"\")","v":""},{"$f":"IFERROR(INDEX(#REF!, MATCH(0, COUNTIF($D230:H$445,#REF!) + ( COUNTIF(#REF!,#REF!)<>1), 0)), \"\")","v":""}]
[null,null,"row",{"$f":"MATCH(D230,$D202:$D221,0)","v":13},{"$f":"MATCH(E230,$D202:$D228,0)","v":12}]
[null,null,"column",{"$f":"MATCH(OFFSET($D202,MATCH(D230,$D202:$D221,0)-2,0),OFFSET($D202,MATCH(D230,$D202:$D221,0)-2,1,1,11),0)+1","v":2},{"$f":"MATCH(OFFSET($D202,MATCH(E230,$D202:$D228,0)-2,0),OFFSET($D202,MATCH(E230,$D202:$D228,0)-2,1,1,11),0)+1","v":{"$error":"#N/A"}}]
[null,null,"Size",{"$f":"OFFSET($D202,MATCH(D230,$D202:$D221,0)-2,0,)","v":0},{"$f":"OFFSET($D202,MATCH(E230,$D202:$D228,0)-2,0,)","v":0}]
[null,null,"Test →"]
[null,null,"Data Validation Name",{"$f":"\"L_\"&SUBSTITUTE(D230,\" \",\"\")","v":"L_IdlerType"},{"$f":"\"L_\"&SUBSTITUTE(E230,\" \",\"\")","v":"L_0"}]
[]
[null,null,null,{"$f":"OFFSET($D$202,$D$231-1,$D$232-1,$D$233)","v":{"$error":"#REF!"}}]
[null,null,null,{"$f":"OFFSET(Ctrl_Selections!$D$202,Ctrl_Selections!$D$231-1,Ctrl_Selections!$D$232-1,Ctrl_Selections!$D$233)","v":{"$error":"#REF!"}}]
[]
[]
[]
[]
[null,null,"Enter DEPENDENCIES","SELECTION OPTIONS","CONFIGURATIONS"]
[null,null,"Ref Position →",{"$f":"COUNTA(D245:D253)","v":1},{"$f":"SUM(COUNTIF(E245:E253,$C$245:$C$253))","v":0},{"$f":"SUM(COUNTIF(F245:F253,$C$245:$C$253))","v":0},{"$f":"SUM(COUNTIF(G245:G253,$C$245:$C$253))","v":0},{"$f":"SUM(COUNTIF(H245:H253,$C$245:$C$253))","v":0},{"$f":"SUM(COUNTIF(I245:I253,$C$245:$C$253))","v":0},{"$f":"SUM(COUNTIF(J245:J253,$C$245:$C$253))","v":0},{"$f":"SUM(COUNTIF(K245:K253,$C$245:$C$253))","v":0},{"$f":"SUM(COUNTIF(L245:L253,$C$245:$C$253))","v":0},{"$f":"SUM(COUNTIF(M245:M253,$C$245:$C$253))","v":0},{"$f":"SUM(COUNTIF(N245:N253,$C$245:$C$253))","v":0}]
[null,"Enter Selection 3->",{"$f":"i_InstallationType","v":0},"Installation Type","Open"]
[]
[]
[]
[null,null,{"$f":"i_Tube","v":0}]
[]
[]
[]
[]
[]
[null,null,null,{"$f":"MAX(E255:N255)","v":0},{"$f":"IF(E244<>$D244,0,COUNTA(E256:E262))","v":0},0,0,0,0,0,0,0,0,0]
[null,"Dependent (Output List) 1 -> ",null,"Control Type","Easy Spring Air - MICRO - LH"]
[null,null,null,null,"Easy Spring Air - MINI - LH"]
[null,null,null,null,"Easy Spring Air - SMALL - LH"]
[null,null,null,null,"Easy Spring Air - LIGHT - LH"]
[null,null,null,null,"Easy Spring Air - MEDIUM - LH"]
[null,null,null,null,"Easy Spring Air - HEAVY - LH"]
[]
[null,null,null,"DO NOT FILL"]
[]
[null,null,null,{"$f":"MAX(E265:N265)","v":0},{"$f":"IF(E244<>$D244,0,COUNTA(E266:E272))","v":0},{"$f":"IF(F244<>$D244,0,COUNTA(F266:F272))","v":0},0,0,0,0,0,0,0,0]
[null,"Dependent (Output List) 1 -> ",null,"Gear Ratio"]
[]
[]
[]
[]
[]
[]
[null,null,null,"DO NOT FILL"]
[]
[null,null,null,{"$f":"D256","v":"Control Type"},{"$f":"D266","v":"Gear Ratio"}]
[null,null,"row",{"$f":"MATCH(D275,$D244:$D264,0)","v":13},{"$f":"MATCH(E275,$D244:$D273,0)","v":23}]
[null,null,"column",{"$f":"MATCH(OFFSET($D244,MATCH(D275,$D244:$D264,0)-2,0),OFFSET($D244,MATCH(D275,$D244:$D264,0)-2,1,1,11),0)+1","v":2},{"$f":"MATCH(OFFSET($D244,MATCH(E275,$D244:$D272,0)-2,0),OFFSET($D244,MATCH(E275,$D244:$D272,0)-2,1,1,11),0)+1","v":2}]
[null,null,"Size",{"$f":"OFFSET($D244,MATCH(D275,$D244:$D264,0)-2,0,)","v":0},{"$f":"OFFSET($D243,MATCH(E275,$D243:$D273,0)-2,0,)","v":0}]
[null,null,"Test →"]
[null,null,"Data Validation Name",{"$f":"\"L_\"&SUBSTITUTE(D275,\" \",\"\")","v":"L_ControlType"},{"$f":"\"L_\"&SUBSTITUTE(E275,\" \",\"\")","v":"L_GearRatio"}]
[]
[]
[]
[]
[]
[]
[]
[null,null,"Enter DEPENDENCIES","SELECTION OPTIONS","CONFIGURATIONS"]
[null,null,"Ref Position →",{"$f":"COUNTA(D290:D298)","v":1},{"$f":"SUM(COUNTIF(E290:E298,$C$290:$C$298))","v":0},{"$f":"SUM(COUNTIF(F290:F298,$C$290:$C$298))","v":0},{"$f":"SUM(COUNTIF(G290:G298,$C$290:$C$298))","v":0},{"$f":"SUM(COUNTIF(H290:H298,$C$290:$C$298))","v":0},{"$f":"SUM(COUNTIF(I290:I298,$C$290:$C$298))","v":0},{"$f":"SUM(COUNTIF(J290:J298,$C$290:$C$298))","v":0},{"$f":"SUM(COUNTIF(K290:K298,$C$290:$C$298))","v":0},{"$f":"SUM(COUNTIF(L290:L298,$C$290:$C$298))","v":0},{"$f":"SUM(COUNTIF(M290:M298,$C$290:$C$298))","v":0},{"$f":"SUM(COUNTIF(N290:N298,$C$290:$C$298))","v":0}]
[null,"Enter Selection 3->",{"$f":"i_InstallationType","v":0},"Installation Type","Open"]
[]
[]
[]
[]
[]
[]
[]
[]
[]
[null,null,null,{"$f":"MAX(E300:N300)","v":0},{"$f":"IF(E289<>$D289,0,COUNTA(E301:E307))","v":0},0,0,0,0,0,0,0,0,0]
[null,"Dependent (Output List) 1 -> ",null,"Tube","1.5\""]
[null,null,null,null,"2\""]
[]
[]
[]
[]
[]
[null,null,null,"DO NOT FILL"]
[]
[]
[null,null,null,{"$f":"D301","v":"Tube"}]
[null,null,"row",{"$f":"MATCH(D311,$D289:$D309,0)","v":13}]
[null,null,"column",{"$f":"MATCH(OFFSET($D289,MATCH(D311,$D289:$D309,0)-2,0),OFFSET($D289,MATCH(D311,$D289:$D309,0)-2,1,1,11),0)+1","v":2}]
[null,null,"Size",{"$f":"OFFSET($D289,MATCH(D311,$D289:$D309,0)-2,0,)","v":0}]
[null,null,"Test →"]
[null,null,"Data Validation Name",{"$f":"\"L_\"&SUBSTITUTE(D311,\" \",\"\")","v":"L_Tube"}]
[]
[]
[null,null,null,"=OFFSET($D$134,OFFSET(INDIRECT(ADDRESS(ROW(),COLUMN(),4)),-3,0)-1,OFFSET(INDIRECT(ADDRESS(ROW(),COLUMN(),4)),-2,0)-1,OFFSET(INDIRECT(ADDRESS(ROW(),COLUMN(),4)),-1,0))"]
[]
[]
[]
[]
[]
[]
[]
[null,null,"Enter DEPENDENCIES","SELECTION OPTIONS","CONFIGURATIONS"]
[null,null,"Ref Position →",{"$f":"COUNTA(D329:D341)","v":2},{"$f":"SUM(COUNTIF(E329:E341,$C$329:$C$341))","v":0},{"$f":"SUM(COUNTIF(F329:F341,$C$329:$C$341))","v":0},{"$f":"SUM(COUNTIF(G329:G341,$C$329:$C$341))","v":0},{"$f":"SUM(COUNTIF(H329:H341,$C$329:$C$341))","v":0},{"$f":"SUM(COUNTIF(I329:I341,$C$383:$C$391))","v":0},{"$f":"SUM(COUNTIF(J329:J341,$C$383:$C$391))","v":0},{"$f":"SUM(COUNTIF(K329:K341,$C$383:$C$391))","v":0},{"$f":"SUM(COUNTIF(L329:L341,$C$383:$C$391))","v":0},{"$f":"SUM(COUNTIF(M329:M341,$C$383:$C$391))","v":0},{"$f":"SUM(COUNTIF(N329:N341,$C$383:$C$391))","v":0}]
[null,"Enter Selection 3->",{"$f":"i_Location","v":0},"i_Location"]
[]
[]
[]
[null,null,{"$f":"i_SystemType","v":0},"i_SystemType"]
[]
[]
[]
[]
[]
[]
[]
[null,"Enter Selection 4->"]
[]
[null,null,null,{"$f":"MAX(E343:N343)","v":0},{"$f":"IF(E328<>$D328,0,COUNTA(#REF!))","v":0},{"$f":"IF(F328<>$D328,0,COUNTA(F344:F350))","v":0},0,0,{"$f":"IF(I328<>$D328,0,COUNTA(E344:E350))","v":0},0,0,0,0,0]
[null,"Dependent (Output List) 1 -> "]
[]
[]
[]
[]
[]
[]
[null,null,null,"DO NOT FILL"]
[]
[null,null,null,{"$f":"MAX(E353:N353)","v":0},{"$f":"IF(E328<>$D328,0,COUNTA(E354:E360))","v":0},{"$f":"IF(F328<>$D328,0,COUNTA(F354:F360))","v":0},0,0,0,0,0,0,0,0]
[null,"Dependent (Output List) 1 -> "]
[]
[]
[]
[]
[]
[]
[null,null,null,"DO NOT FILL"]
[]
[]
[null,null,null,{"$f":"D344","v":0},{"$f":"D354","v":0}]
[null,null,"row",{"$f":"MATCH(D364,$D328:$D362,0)","v":16},{"$f":"MATCH(E364,$D328:$D362,0)","v":16}]
[null,null,"column",{"$f":"MATCH(OFFSET($D328,MATCH(D364,$D328:$D362,0)-2,0),OFFSET($D328,MATCH(D364,$D328:$D362,0)-2,1,1,11),0)+1","v":{"$error":"#N/A"}},{"$f":"MATCH(OFFSET($D328,MATCH(E364,$D328:$D362,0)-2,0),OFFSET($D328,MATCH(E364,$D328:$D362,0)-2,1,1,11),0)+1","v":{"$error":"#N/A"}}]
[null,null,"Size",{"$f":"OFFSET($D328,MATCH(D364,$D328:$D362,0)-2,0,)","v":0},{"$f":"OFFSET($D328,MATCH(E364,$D328:$D362,0)-2,0,)","v":0}]
[null,null,"Test →",null,"L-Fixing Rail"]
[null,null,"Data Validation Name",{"$f":"\"L_\"&SUBSTITUTE(D364,\" \",\"\")","v":"L_0"},{"$f":"\"L_\"&SUBSTITUTE(E364,\" \",\"\")","v":"L_0"}]
[]
[]
[null,null,null,{"$f":"OFFSET($D$328,$D$365-1,$D$366-1,$D$367)","v":{"$error":"#N/A"}}]
[]
[null,null,null,{"$f":"OFFSET(Ctrl_Selections!$D$328,Ctrl_Selections!$D$365-1,Ctrl_Selections!$D$366-1,Ctrl_Selections!$D$367)","v":{"$error":"#N/A"}}]
[]
[]
[]
[]
[null,null,null,null,null,null,"have not set up deductions for pivot arm / wire guide systems. "]
[]
[null,null,"Enter DEPENDENCIES","SELECTION OPTIONS","CONFIGURATIONS"]
[null,null,"Ref Position →",{"$f":"COUNTA(D383:D391)","v":1},{"$f":"SUM(COUNTIF(E383:E391,$C$383:$C$391))","v":0},{"$f":"SUM(COUNTIF(F383:F391,$C$383:$C$391))","v":0},{"$f":"SUM(COUNTIF(G383:G391,$C$383:$C$391))","v":0},{"$f":"SUM(COUNTIF(H383:H391,$C$383:$C$391))","v":0},{"$f":"SUM(COUNTIF(I383:I391,$C$383:$C$391))","v":0},{"$f":"SUM(COUNTIF(J383:J391,$C$383:$C$391))","v":0},{"$f":"SUM(COUNTIF(K383:K391,$C$383:$C$391))","v":0},{"$f":"SUM(COUNTIF(L383:L391,$C$383:$C$391))","v":0},{"$f":"SUM(COUNTIF(M383:M391,$C$383:$C$391))","v":0},{"$f":"SUM(COUNTIF(N383:N391,$C$383:$C$391))","v":0}]
[null,"Enter Selection 3->",{"$f":"i_InstallationType","v":0},"Installation Type","Open"]
[]
[]
[]
[]
[]
[]
[]
[null,"Enter Selection 4->"]
[]
[null,null,null,{"$f":"MAX(E393:N393)","v":0},{"$f":"IF(E382<>$D382,0,COUNTA(E394:E400))","v":0},{"$f":"IF(F382<>$D382,0,COUNTA(F394:F400))","v":0},0,0,0,0,0,0,0,0]
[null,"Dependent (Output List) 1 -> ",null,"Open Bkt Style","Skyline 1.5\""]
[null,null,null,null,"LX Skyline"]
[]
[]
[]
[]
[]
[null,null,null,"DO NOT FILL"]
[]
[]
[null,null,null,{"$f":"D394","v":"Open Bkt Style"}]
[null,null,"row",{"$f":"MATCH(D404,$D382:$D402,0)","v":13}]
[null,null,"column",{"$f":"MATCH(OFFSET($D382,MATCH(D404,$D382:$D402,0)-2,0),OFFSET($D382,MATCH(D404,$D382:$D402,0)-2,1,1,11),0)+1","v":2}]
[null,null,"Size",{"$f":"OFFSET($D382,MATCH(D404,$D382:$D402,0)-2,0,)","v":0}]
[null,null,"Test →"]
[null,null,"Data Validation Name",{"$f":"\"L_\"&SUBSTITUTE(D404,\" \",\"\")","v":"L_OpenBktStyle"}]
[]
[]
[null,null,null,"=OFFSET($D$134,OFFSET(INDIRECT(ADDRESS(ROW(),COLUMN(),4)),-3,0)-1,OFFSET(INDIRECT(ADDRESS(ROW(),COLUMN(),4)),-2,0)-1,OFFSET(INDIRECT(ADDRESS(ROW(),COLUMN(),4)),-1,0))"]
[]
[null,null,null,{"$f":"OFFSET($D$382,$D$405-1,$D$406-1,$D$407)","v":{"$error":"#REF!"}}]
[]
[]
[]
[]
[null,null,"Enter DEPENDENCIES","SELECTION OPTIONS","CONFIGURATIONS"]
[null,null,"Ref Position →",{"$f":"COUNTA(D421:D426)","v":2},{"$f":"SUM(COUNTIF($E$421:$E$427,$C$421:$C$427))","v":0},{"$f":"SUM(COUNTIF($F$421:$F$427,$C$421:$C$427))","v":0}]
[null,"Enter Selection 1 ->",{"$f":"i_SystemType","v":0},"System"]
[]
[]
[]
[null,"Enter Selection 2->"]
[null,"Enter Selection 3->",{"$f":"i_ControlType","v":0},"Control "]
[null,"Enter Selection 4->"]
[]
[null,null,null,{"$f":"MAX(E429:N429)","v":0},{"$f":"IF(E420<>$D420,0,COUNTA(E430:E434))","v":0},0,0,0,0,0,0,0,0,0]
[null,"Dependent (Output List) 1 -> ",null,"Gear Arm Length"]
[]
[]
[]
[]
[null,null,null,"DO NOT FILL"]
[]
[null,null,null,{"$f":"D430","v":"Gear Arm Length"},null,null,null,{"$f":"IFERROR(INDEX(#REF!, MATCH(0, COUNTIF($D437:G$445,#REF!) + ( COUNTIF(#REF!,#REF!)<>1), 0)), \"\")","v":""},{"$f":"IFERROR(INDEX(#REF!, MATCH(0, COUNTIF($D437:H$445,#REF!) + ( COUNTIF(#REF!,#REF!)<>1), 0)), \"\")","v":""}]
[null,null,"row",{"$f":"MATCH(D437,$D420:$D436,0)","v":11}]
[null,null,"column",{"$f":"MATCH(OFFSET($D420,MATCH(D437,$D420:$D436,0)-2,0),OFFSET($D420,MATCH(D437,$D420:$D436,0)-2,1,1,11),0)+1","v":2}]
[null,null,"Size",{"$f":"OFFSET($D420,MATCH(D437,$D420:$D436,0)-2,0,)","v":0}]
[null,null,"Test →","1.2m (47\")"]
[null,null,"Data Validation Name",{"$f":"\"L_\"&SUBSTITUTE(D437,\" \",\"\")","v":"L_GearArmLength"}]
[]
[]
[]
[]
[]
[null,null,"Enter DEPENDENCIES","SELECTION OPTIONS","CONFIGURATIONS"]
[null,null,"Ref Position →",{"$f":"COUNTA(D450:D452)","v":1},{"$f":"SUM(COUNTIF(E450:E453,$C$450:$C$453))","v":0},{"$f":"SUM(COUNTIF(F450:F453,$C$450:$C$453))","v":0},{"$f":"SUM(COUNTIF(G450:G453,$C$450:$C$453))","v":0},{"$f":"SUM(COUNTIF(H450:H453,$C$450:$C$453))","v":0},{"$f":"SUM(COUNTIF(I450:I453,$C$450:$C$453))","v":0},{"$f":"SUM(COUNTIF(J450:J453,$C$450:$C$453))","v":0},{"$f":"SUM(COUNTIF(K450:K453,$C$450:$C$453))","v":0},{"$f":"SUM(COUNTIF(L450:L453,$C$450:$C$453))","v":0},{"$f":"SUM(COUNTIF(M450:M453,$C$450:$C$453))","v":0},{"$f":"SUM(COUNTIF(N450:N453,$C$450:$C$453))","v":0}]
[null,"Enter Selection 1 ->",{"$f":"i_Location","v":0},"Location","AU"]
[null,"Enter Selection 2->",null,null,"EU"]
[null,"Enter Selection 3->",null,null,"US"]
[null,"Enter Selection 4->"]
[]
[null,null,null,{"$f":"MAX(E455:N455)","v":0},{"$f":"IF(E449<>$D449,0,COUNTA(E456:E460))","v":0},0,0,0,0,0,0,0,0,0]
[null,"Dependent (Output List) 1 -> ",null,"Colour","Powdercoat"]
[null,null,null,null,"Mill"]
[null,null,null,null,"Anodised"]
[]
[]
[null,null,null,"DO NOT FILL"]
[]
[null,null,null,{"$f":"MAX(E463:N463)","v":0},{"$f":"IF(E449<>$D449,0,COUNTA(E464:E468))","v":0},{"$f":"IF(F449<>$D449,0,COUNTA(F464:F468))","v":0},{"$f":"IF(G449<>$D449,0,COUNTA(G464:G468))","v":0},0,0,0,0,0,0,0]
[null,"Dependent (Output List) 1 -> ",null,"Pivot Arm","1.6m [5.25 ft]"]
[]
[]
[]
[]
[null,null,null,"DO NOT FILL"]
[]
[null,null,null,{"$f":"D456","v":"Colour"},{"$f":"D464","v":"Pivot Arm"},null,null,{"$f":"IFERROR(INDEX(#REF!, MATCH(0, COUNTIF($D$445:G471,#REF!) + ( COUNTIF(#REF!,#REF!)<>1), 0)), \"\")","v":""},{"$f":"IFERROR(INDEX(#REF!, MATCH(0, COUNTIF($D$445:H471,#REF!) + ( COUNTIF(#REF!,#REF!)<>1), 0)), \"\")","v":""}]
[null,null,"row",{"$f":"MATCH(D471,$D449:$D470,0)","v":8},{"$f":"MATCH(E471,$D449:$D470,0)","v":16}]
[null,null,"column",{"$f":"MATCH(OFFSET($D449,MATCH(D471,$D449:$D470,0)-2,0),OFFSET($D449,MATCH(D471,$D449:$D470,0)-2,1,1,11),0)+1","v":2},{"$f":"MATCH(OFFSET($D449,MATCH(E471,$D449:$D470,0)-2,0),OFFSET($D449,MATCH(E471,$D449:$D470,0)-2,1,1,11),0)+1","v":2}]
[null,null,"Size",{"$f":"OFFSET($D449,MATCH(D471,$D449:$D470,0)-2,0,)","v":0},{"$f":"OFFSET($D449,MATCH(E471,$D449:$D470,0)-2,0,)","v":0}]
[null,null,"Test →","White","1.0 m"]
[null,null,"Data Validation Name",{"$f":"\"L_\"&SUBSTITUTE(D471,\" \",\"\")","v":"L_Colour"},{"$f":"\"L_\"&SUBSTITUTE(E471,\" \",\"\")","v":"L_PivotArm"}]
[]
[]
[]
[null,null,"Enter DEPENDENCIES","SELECTION OPTIONS","CONFIGURATIONS"]
[null,null,"Ref Position →",{"$f":"COUNTA(D482:D487)","v":1},{"$f":"SUM(COUNTIF(E482:E492,$C$482:$C$492))","v":0},{"$f":"SUM(COUNTIF(F482:F492,$C$482:$C$492))","v":0},{"$f":"SUM(COUNTIF(G482:G492,$C$482:$C$492))","v":0},{"$f":"SUM(COUNTIF(H482:H492,$C$482:$C$492))","v":0},{"$f":"SUM(COUNTIF(I482:I492,$C$482:$C$492))","v":0},{"$f":"SUM(COUNTIF(J482:J492,$C$482:$C$492))","v":0},{"$f":"SUM(COUNTIF(K482:K492,$C$482:$C$492))","v":0},{"$f":"SUM(COUNTIF(L482:L492,$C$482:$C$492))","v":0},{"$f":"SUM(COUNTIF(M482:M492,$C$482:$C$492))","v":0},{"$f":"SUM(COUNTIF(N482:N492,$C$482:$C$492))","v":0}]
[null,"Enter Selection 1 ->",null,"Tube"]
[]
[]
[]
[]
[null,"Enter Selection 3->"]
[]
[]
[]
[]
[null,"Enter Selection 4->"]
[]
[null,null,null,{"$f":"MAX(E494:N494)","v":0},{"$f":"IF(E481<>$D481,0,COUNTA(E495:E499))","v":0},{"$f":"IF(F481<>$D481,0,COUNTA(F495:F499))","v":0},0,{"$f":"IF(H481<>$D481,0,COUNTA(H495:H499))","v":0},0,0,0,0,0,0]
[null,"Dependent (Output List) 1 -> "]
[]
[]
[]
[]
[null,null,null,"DO NOT FILL"]
[]
[null,null,null,{"$f":"D495","v":0},null,null,null,{"$f":"IFERROR(INDEX(#REF!, MATCH(0, COUNTIF($D$445:G502,#REF!) + ( COUNTIF(#REF!,#REF!)<>1), 0)), \"\")","v":""},{"$f":"IFERROR(INDEX(#REF!, MATCH(0, COUNTIF($D$445:H502,#REF!) + ( COUNTIF(#REF!,#REF!)<>1), 0)), \"\")","v":""}]
[null,null,"row",{"$f":"MATCH(D502,$D481:$D501,0)","v":14}]
[null,null,"column",{"$f":"MATCH(OFFSET($D481,MATCH(D502,$D481:$D501,0)-2,0),OFFSET($D481,MATCH(D502,$D481:$D501,0)-2,1,1,11),0)+1","v":{"$error":"#N/A"}}]
[null,null,"Size",{"$f":"OFFSET($D481,MATCH(D502,$D481:$D501,0)-2,0,)","v":0}]
[null,null,"Test →"]
[null,null,"Data Validation Name",{"$f":"\"L_\"&SUBSTITUTE(D502,\" \",\"\")","v":"L_0"}]
[]
[]
[null,null,"Enter DEPENDENCIES","SELECTION OPTIONS","CONFIGURATIONS"]
[null,null,"Ref Position →",{"$f":"COUNTA(D512:D520)-IF(i_ControlType=\"Chain\",1,0)","v":1},{"$f":"SUM(COUNTIF(E512:E520,$C$512:$C$520))","v":0},{"$f":"SUM(COUNTIF(F512:F520,$C$512:$C$520))","v":0},{"$f":"SUM(COUNTIF(G512:G520,$C$512:$C$520))","v":0},{"$f":"SUM(COUNTIF(H512:H520,$C$512:$C$520))","v":0},{"$f":"SUM(COUNTIF(I512:I520,$C$512:$C$520))","v":0},{"$f":"SUM(COUNTIF(J512:J520,$C$512:$C$520))","v":0},{"$f":"SUM(COUNTIF(K512:K520,$C$512:$C$520))","v":0},{"$f":"SUM(COUNTIF(L512:L520,$C$512:$C$520))","v":0},{"$f":"SUM(COUNTIF(M512:M520,$C$512:$C$520))","v":0},{"$f":"SUM(COUNTIF(N512:N520,$C$512:$C$520))","v":0}]
[null,"Enter Selection 1 ->",{"$f":"i_InstallationType","v":0},"Installation Type","Open"]
[]
[]
[null,"Enter Selection 3->"]
[]
[]
[]
[]
[null,"Enter Selection 4->"]
[]
[null,null,null,{"$f":"MAX(E522:N522)","v":0},{"$f":"IF(E511<>$D511,0,COUNTA(E523:E527))","v":0},0,0,0,0,0,0,0,0,0]
[null,"Dependent (Output List) 1 -> ",null,"Weight Bar","D30 Medium Bottom Rail"]
[null,null,null,null,"Fabric Wrap"]
[]
[]
[]
[null,null,null,"DO NOT FILL"]
[]
[null,null,null,{"$f":"D523","v":"Weight Bar"},null,null,null,{"$f":"IFERROR(INDEX(#REF!, MATCH(0, COUNTIF($D$445:G530,#REF!) + ( COUNTIF(#REF!,#REF!)<>1), 0)), \"\")","v":""},{"$f":"IFERROR(INDEX(#REF!, MATCH(0, COUNTIF($D$445:H530,#REF!) + ( COUNTIF(#REF!,#REF!)<>1), 0)), \"\")","v":""}]
[null,null,"row",{"$f":"MATCH(D530,$D511:$D529,0)","v":13}]
[null,null,"column",{"$f":"MATCH(OFFSET($D511,MATCH(D530,$D511:$D529,0)-2,0),OFFSET($D511,MATCH(D530,$D511:$D529,0)-2,1,1,11),0)+1","v":2}]
[null,null,"Size",{"$f":"OFFSET($D511,MATCH(D530,$D511:$D529,0)-2,0,)","v":0}]
[null,null,"Test →"]
[null,null,"Data Validation Name",{"$f":"\"L_\"&SUBSTITUTE(D530,\" \",\"\")","v":"L_WeightBar"}]
[]
[]
[]
[]
[null,null,"Enter DEPENDENCIES","SELECTION OPTIONS","CONFIGURATIONS"]
[null,null,"Ref Position →",{"$f":"COUNTA(D542:D547)","v":3},{"$f":"SUM(COUNTIF(E542:E549,$C542:$C549))","v":0},{"$f":"SUM(COUNTIF(F542:F549,$C542:$C549))","v":0},{"$f":"SUM(COUNTIF(G542:G549,$C542:$C549))","v":0},{"$f":"SUM(COUNTIF(H542:H549,$C542:$C549))","v":0},{"$f":"SUM(COUNTIF(I542:I549,$C542:$C549))","v":0},{"$f":"SUM(COUNTIF(J542:J549,$C542:$C549))","v":0},{"$f":"SUM(COUNTIF(K542:K549,$C542:$C549))","v":0},{"$f":"SUM(COUNTIF(L542:L549,$C542:$C549))","v":0},{"$f":"SUM(COUNTIF(M542:M549,$C542:$C549))","v":0},{"$f":"SUM(COUNTIF(N542:N549,$C542:$C549))","v":0}]
[null,"Enter Selection 1 ->",{"$f":"i_SystemType","v":0},"System Type"]
[null,"Enter Selection 2->"]
[null,"Enter Selection 3->",{"$f":"i_WeightBar","v":0},"Weight Bar"]
[]
[]
[null,"Enter Selection 4->",{"$f":"i_Location","v":0},"Region"]
[]
[]
[]
[null,null,null,{"$f":"MAX(E551:N551)","v":0},{"$f":"IF(E541<>$D541,0,COUNTA(E552:E556))","v":0},0,0,0,0,0,0,0,0,0]
[null,"Dependent (Output List) 1 -> "]
[]
[]
[]
[]
[null,null,null,"DO NOT FILL"]
[]
[null,null,null,{"$f":"MAX(E559:N559)","v":0},{"$f":"IF(E541<>$D541,0,COUNTA(E560:E564))","v":0},0,0,0,0,0,0,0,0,0]
[null,"Dependent (Output List) 1 -> "]
[]
[]
[]
[]
[null,null,null,"DO NOT FILL"]
[]
[null,null,null,{"$f":"D552","v":0},{"$f":"D560","v":0},null,{"$f":"SUBSTITUTE(\" \",\"\",$D542)","v":" "},{"$f":"IFERROR(INDEX(#REF!, MATCH(0, COUNTIF($D$445:G567,#REF!) + ( COUNTIF(#REF!,#REF!)<>1), 0)), \"\")","v":""},{"$f":"IFERROR(INDEX(#REF!, MATCH(0, COUNTIF($D$445:H567,#REF!) + ( COUNTIF(#REF!,#REF!)<>1), 0)), \"\")","v":""}]
[null,null,"row",{"$f":"MATCH(D567,$D541:$D558,0)","v":11},{"$f":"MATCH(E567,$D541:$D565,0)","v":11}]
[null,null,"column",{"$f":"MATCH(OFFSET($D541,MATCH(D567,$D541:$D564,0)-2,0),OFFSET($D541,MATCH(D567,$D541:$D558,0)-2,1,1,11),0)+1","v":{"$error":"#N/A"}},{"$f":"MATCH(OFFSET($D541,MATCH(E567,$D541:$D564,0)-2,0),OFFSET($D541,MATCH(E567,$D541:$D564,0)-2,1,1,11),0)+1","v":{"$error":"#N/A"}}]
[null,null,"Size",{"$f":"OFFSET($D541,MATCH(D567,$D541:$D558,0)-2,0,)","v":0},{"$f":"OFFSET($D541,MATCH(E567,$D541:$D564,0)-2,0,)","v":0}]
[null,null,"Test →"]
[null,null,"Data Validation Name",{"$f":"\"L_\"&SUBSTITUTE(D567,\" \",\"\")","v":"L_0"},{"$f":"\"L_\"&SUBSTITUTE(E567,\" \",\"\")","v":"L_0"}]
[]
[null,null,"Enter DEPENDENCIES","SELECTION OPTIONS","CONFIGURATIONS"]
[null,null,"Ref Position →",{"$f":"COUNTA(D576:D588)","v":1},{"$f":"SUM(COUNTIF(E576:E588,$C576:$C588))","v":0},{"$f":"SUM(COUNTIF(F576:F588,$C576:$C588))","v":0},{"$f":"SUM(COUNTIF(G576:G588,$C576:$C588))","v":0},{"$f":"SUM(COUNTIF(H576:H588,$C576:$C588))","v":0},{"$f":"SUM(COUNTIF(I576:I588,$C576:$C588))","v":0},{"$f":"SUM(COUNTIF(J576:J588,$C576:$C588))","v":0},{"$f":"SUM(COUNTIF(K576:K588,$C576:$C588))","v":0},{"$f":"SUM(COUNTIF(L576:L588,$C576:$C588))","v":0},{"$f":"SUM(COUNTIF(M576:M588,$C576:$C588))","v":0},{"$f":"SUM(COUNTIF(N576:N588,$C576:$C588))","v":0}]
[null,"Enter Selection 1 ->",{"$f":"i_wbLock","v":0},"Weight Bar Lock"]
[null,"Enter Selection 2->"]
[null,"Enter Selection 3->"]
[]
[]
[null,"Enter Selection 4->"]
[]
[]
[null,"Enter Selection 5->"]
[]
[]
[]
[]
[]
[null,null,null,{"$f":"MAX(E590:N590)","v":0},{"$f":"IF(E575<>$D575,0,COUNTA(E591:E595))","v":0},0,0,0,0,0,0,0,0,0]
[null,"Dependent (Output List) 1 -> "]
[]
[]
[]
[]
[null,null,null,"DO NOT FILL"]
[]
[null,null,null,{"$f":"MAX(E598:N598)","v":0},{"$f":"IF(E575<>$D575,0,COUNTA(E599:E603))","v":0},0,0,0,0,0,0,0,0,0]
[null,"Dependent (Output List) 1 -> "]
[]
[]
[]
[]
[null,null,null,"DO NOT FILL"]
[]
[null,null,null,{"$f":"D591","v":0},{"$f":"D599","v":0},null,{"$f":"SUBSTITUTE(\" \",\"\",$D576)","v":" "},{"$f":"IFERROR(INDEX(#REF!, MATCH(0, COUNTIF($D$445:G606,#REF!) + ( COUNTIF(#REF!,#REF!)<>1), 0)), \"\")","v":""},{"$f":"IFERROR(INDEX(#REF!, MATCH(0, COUNTIF($D$445:H606,#REF!) + ( COUNTIF(#REF!,#REF!)<>1), 0)), \"\")","v":""}]
[null,null,"row",{"$f":"MATCH(D606,$D575:$D597,0)","v":16},{"$f":"MATCH(E606,$D575:$D604,0)","v":16}]
[null,null,"column",{"$f":"MATCH(OFFSET($D575,MATCH(D606,$D575:$D603,0)-2,0),OFFSET($D575,MATCH(D606,$D575:$D597,0)-2,1,1,11),0)+1","v":{"$error":"#N/A"}},{"$f":"MATCH(OFFSET($D575,MATCH(E606,$D575:$D603,0)-2,0),OFFSET($D575,MATCH(E606,$D575:$D603,0)-2,1,1,11),0)+1","v":{"$error":"#N/A"}}]
[null,null,"Size",{"$f":"OFFSET($D575,MATCH(D606,$D575:$D597,0)-2,0,)","v":0},{"$f":"OFFSET($D575,MATCH(E606,$D575:$D603,0)-2,0,)","v":0}]
[null,null,"Test →"]
[null,null,"Data Validation Name",{"$f":"\"L_\"&SUBSTITUTE(D606,\" \",\"\")","v":"L_0"},{"$f":"\"L_\"&SUBSTITUTE(E606,\" \",\"\")","v":"L_0"}]
[]
[]
[]
[null,null,"Enter DEPENDENCIES","SELECTION OPTIONS","CONFIGURATIONS"]
[null,null,"Ref Position →",{"$f":"COUNTA(D617:D626)","v":3},{"$f":"SUM(COUNTIF(E617:E626,$C617:$C626))","v":0},{"$f":"SUM(COUNTIF(F617:F626,$C617:$C626))","v":0},{"$f":"SUM(COUNTIF(G617:G626,$C617:$C626))","v":0},{"$f":"SUM(COUNTIF(H617:H626,$C617:$C626))","v":0},{"$f":"SUM(COUNTIF(I617:I626,$C617:$C626))","v":0},{"$f":"SUM(COUNTIF(J617:J626,$C617:$C626))","v":0},{"$f":"SUM(COUNTIF(K617:K626,$C617:$C626))","v":0},{"$f":"SUM(COUNTIF(L617:L626,$C617:$C626))","v":0},{"$f":"SUM(COUNTIF(M617:M626,$C617:$C626))","v":0},{"$f":"SUM(COUNTIF(N617:N626,$C617:$C626))","v":0}]
[null,"Enter Selection 1 ->",{"$f":"i_Location","v":0},"Location","US","US"]
[]
[null,"Enter Selection 2->"]
[null,"Enter Selection 3->",{"$f":"i_InstallationType","v":0},"Installation Type","Open","Open"]
[]
[]
[]
[null,null,{"$f":"i_WeightBar","v":0},"Weight Bar","D30 Medium Bottom Rail","Fabric Wrap"]
[]
[null,"Enter Selection 4->"]
[]
[null,null,null,{"$f":"MAX(E628:N628)","v":0},{"$f":"IF(E616<>$D616,0,COUNTA(E629:E635))","v":0},{"$f":"IF(F616<>$D616,0,COUNTA(F629:F635))","v":0},{"$f":"IF(G616<>$D616,0,COUNTA(G629:G635))","v":0},0,0,0,0,0,0,0]
[null,"Dependent (Output List) 1 -> ",null,"wbSpline","15mm Flat Spline - NO TAPE","No Wrap"]
[null,null,null,null,"15mm Flat Spline - D/S MP-HR TAPE","Half or Full Wrap"]
[null,null,null,null,"15mm Flat Spline - D/S MP-HR TAPE B/SIDES"]
[]
[]
[]
[]
[null,null,null,"DO NOT FILL"]
[]
[null,null,null,{"$f":"D629","v":"wbSpline"}]
[null,null,"row",14]
[null,null,"column",{"$f":"MATCH(OFFSET($D616,MATCH(D638,$D616:$D637,0)-2,0),OFFSET($D616,MATCH(D638,$D616:$D637,0)-2,1,1,11),0)+1","v":2}]
[null,null,"Size",{"$f":"OFFSET($D616,MATCH(D638,$D616:$D637,0)-2,0,)","v":0}]
[null,null,"Test →","15mm Flat Spline - D/S MP-HR TAPE"]
[null,null,"Data Validation Name",{"$f":"\"L_\"&SUBSTITUTE(D638,\" \",\"\")","v":"L_wbSpline"}]
[]
[]
[]
[]
[null,null,"Enter DEPENDENCIES","SELECTION OPTIONS","CONFIGURATIONS"]
[null,null,"Ref Position →",{"$f":"COUNTA(D650:D658)","v":3},{"$f":"SUM(COUNTIF(E650:E658,$C650:$C658))","v":0},{"$f":"SUM(COUNTIF(F650:F658,$C650:$C658))","v":0},{"$f":"SUM(COUNTIF(G650:G658,$C650:$C658))","v":0},{"$f":"SUM(COUNTIF(H650:H658,$C650:$C658))","v":0},{"$f":"SUM(COUNTIF(I650:I658,$C650:$C658))","v":0},{"$f":"SUM(COUNTIF(J650:J658,$C650:$C658))","v":0},{"$f":"SUM(COUNTIF(K650:K658,$C650:$C658))","v":0},{"$f":"SUM(COUNTIF(L650:L658,$C650:$C658))","v":0},{"$f":"SUM(COUNTIF(M650:M658,$C650:$C658))","v":0},{"$f":"SUM(COUNTIF(N650:N658,$C650:$C658))","v":0}]
[null,"Enter Selection 1 ->",{"$f":"i_Location","v":0},"System Type","US","US"]
[]
[]
[null,"Enter Selection 2 ->",{"$f":"i_InstallationType","v":0},"Installation Type","Open","Open"]
[]
[]
[null,"Enter Selection 3 ->",{"$f":"i_WeightBar","v":0},"Weight Bar","D30 Medium Bottom Rail","Fabric Wrap"]
[]
[]
[]
[null,null,null,{"$f":"MAX(E660:N660)","v":0},{"$f":"IF(E649<>$D649,0,COUNTA(E661:E667))","v":0},{"$f":"IF(F649<>$D649,0,COUNTA(F661:F667))","v":0},null,null,null,{"$f":"IF(J649<>$D649,0,COUNTA(J661:J667))","v":0},{"$f":"IF(K649<>$D649,0,COUNTA(K661:K667))","v":0},{"$f":"IF(L649<>$D649,0,COUNTA(L661:L667))","v":0},{"$f":"IF(M649<>$D649,0,COUNTA(M661:M667))","v":0},{"$f":"IF(N649<>$D649,0,COUNTA(N661:N667))","v":0}]
[null,"Dependent (Output List) 1 -> ",null,"wbAccessories","No Accessories","No accessories"]
[null,null,null,null,"Ballast","Hem Bar Handle"]
[null,null,null,null,null,"Hem Bar Handle + Pull Hook"]
[null,null,null,null,null,"Ballast"]
[null,null,null,null,null,"Ballast + Handle"]
[null,null,null,null,null,"Ballast + Handle + Pull Hook"]
[]
[null,null,null,"DO NOT FILL"]
[]
[null,null,null,{"$f":"D661","v":"wbAccessories"},null,null,{"$f":"OFFSET($D$649,$D$671-1,$D$672-1,$D$673)","v":{"$error":"#REF!"}},{"$f":"IFERROR(INDEX(#REF!, MATCH(0, COUNTIF($D$445:G670,#REF!) + ( COUNTIF(#REF!,#REF!)<>1), 0)), \"\")","v":""},{"$f":"IFERROR(INDEX(#REF!, MATCH(0, COUNTIF($D$445:H670,#REF!) + ( COUNTIF(#REF!,#REF!)<>1), 0)), \"\")","v":""}]
[null,null,"row",{"$f":"MATCH(D670,$D649:$D669,0)","v":13}]
[null,null,"column",{"$f":"MATCH(OFFSET($D649,MATCH(D670,$D649:$D669,0)-2,0),OFFSET($D649,MATCH(D670,$D649:$D669,0)-2,1,1,11),0)+1","v":2}]
[null,null,"Size",{"$f":"OFFSET($D649,MATCH(D670,$D649:$D669,0)-2,0,)","v":0}]
[null,null,"Test →"]
[null,null,"Data Validation Name",{"$f":"\"L_\"&SUBSTITUTE(D670,\" \",\"\")","v":"L_wbAccessories"}]
[]
[]
[]
[null,null,"Enter DEPENDENCIES","SELECTION OPTIONS","CONFIGURATIONS"]
[null,null,"Ref Position →",{"$f":"COUNTA(D681:D685)","v":2},{"$f":"SUM(COUNTIF(E681:E685,$C681:$C685))","v":0},{"$f":"SUM(COUNTIF(F681:F685,$C681:$C685))","v":0},{"$f":"SUM(COUNTIF(G681:G685,$C681:$C685))","v":0},{"$f":"SUM(COUNTIF(H681:H685,$C681:$C685))","v":0},{"$f":"SUM(COUNTIF(I681:I685,$C681:$C685))","v":0},{"$f":"SUM(COUNTIF(J681:J685,$C681:$C685))","v":0},{"$f":"SUM(COUNTIF(K681:K685,$C681:$C685))","v":0},{"$f":"SUM(COUNTIF(L681:L685,$C681:$C685))","v":0},{"$f":"SUM(COUNTIF(M681:M685,$C681:$C685))","v":0},{"$f":"SUM(COUNTIF(N681:N685,$C681:$C685))","v":0}]
[null,"Enter Selection 1 ->",{"$f":"i_SystemType","v":0},"System Type","VEUE - Wire Guide","EXTREME - Wire Guide","EXTREME - Wire Guide"]
[]
[null,"Enter Selection 3 ->",{"$f":"i_WGBTOption","v":{"$error":"#REF!"}},"Wire Bottom Terminal","Wire Guide Swivel Bracket","Tensioning Terminal","Threaded Stud Terminal"]
[]
[]
[]
[null,null,null,{"$f":"MAX(E687:N687)","v":0},{"$f":"IF(E680<>$D680,0,COUNTA(E688:E692))","v":0},{"$f":"IF(F680<>$D680,0,COUNTA(F688:F692))","v":0},{"$f":"IF(G680<>$D680,0,COUNTA(G688:G692))","v":0},null,null,{"$f":"IF(J680<>$D680,0,COUNTA(J688:J692))","v":0},{"$f":"IF(K680<>$D680,0,COUNTA(K688:K692))","v":0},{"$f":"IF(L680<>$D680,0,COUNTA(L688:L692))","v":0},{"$f":"IF(M680<>$D680,0,COUNTA(M688:M692))","v":0},{"$f":"IF(N680<>$D680,0,COUNTA(N688:N692))","v":0}]
[null,"Dependent (Output List) 1 -> ",null,"WGBTBOption",null,"No Bracket","L Bracket (Face/Side Fix) + Tension Spring"]
[null,null,null,null,null,"L Bracket (Face/Side Fix)"]
[]
[]
[]
[null,null,null,"DO NOT FILL"]
[]
[null,null,null,{"$f":"D688","v":"WGBTBOption"},null,null,{"$f":"SUBSTITUTE(\" \",\"\",$D681)","v":" "},{"$f":"IFERROR(INDEX(#REF!, MATCH(0, COUNTIF($D$445:G695,#REF!) + ( COUNTIF(#REF!,#REF!)<>1), 0)), \"\")","v":""},{"$f":"IFERROR(INDEX(#REF!, MATCH(0, COUNTIF($D$445:H695,#REF!) + ( COUNTIF(#REF!,#REF!)<>1), 0)), \"\")","v":""}]
[null,null,"row",{"$f":"MATCH(D695,$D680:$D694,0)","v":9}]
[null,null,"column",{"$f":"MATCH(OFFSET($D680,MATCH(D695,$D680:$D694,0)-2,0),OFFSET($D680,MATCH(D695,$D680:$D694,0)-2,1,1,11),0)+1","v":2}]
[null,null,"Size",{"$f":"OFFSET($D680,MATCH(D695,$D680:$D694,0)-2,0,)","v":0}]
[null,null,"Test →"]
[null,null,"Data Validation Name",{"$f":"\"L_\"&SUBSTITUTE(D695,\" \",\"\")","v":"L_WGBTBOption"}]
[]
[null,null,null,{"$f":"OFFSET($D$680,$D$696-1,$D$697-1,$D$698)","v":{"$error":"#REF!"}}]
[]
[]
[null,null,"Enter DEPENDENCIES","SELECTION OPTIONS","CONFIGURATIONS"]
[null,null,"Ref Position →",{"$f":"COUNTA(D707:D710)","v":1},{"$f":"SUM(COUNTIF(E707:E710,$C707:$C710))","v":0},{"$f":"SUM(COUNTIF(F707:F710,$C707:$C710))","v":0},{"$f":"SUM(COUNTIF(G707:G710,$C707:$C710))","v":0},{"$f":"SUM(COUNTIF(H707:H710,$C707:$C710))","v":0},{"$f":"SUM(COUNTIF(I707:I710,$C707:$C710))","v":0},{"$f":"SUM(COUNTIF(J707:J710,$C707:$C710))","v":0},{"$f":"SUM(COUNTIF(K707:K710,$C707:$C710))","v":0},{"$f":"SUM(COUNTIF(L707:L710,$C707:$C710))","v":0},{"$f":"SUM(COUNTIF(M707:M710,$C707:$C710))","v":0},{"$f":"SUM(COUNTIF(N707:N710,$C707:$C710))","v":0}]
[null,"Enter Selection 1 ->",{"$f":"i_WeightBar","v":0},"Weight Bar","F56","F72"]
[]
[null,"Enter Selection 2->"]
[null,"Enter Selection 4->"]
[]
[null,null,null,{"$f":"MAX(E712:N712)","v":0},{"$f":"IF(E706<>$D706,0,COUNTA(E713:E717))","v":0},0,0,0,0,0,0,0,0,0]
[null,"Dependent (Output List) 1 -> ",null,"wbBallast","No Ballast","No Ballast"]
[null,null,null,null,"20 x 5 mm Flat Bar (x1) - 0.8 kg/m","25 x 8 mm Flat Bar (x1) - 1.6 kg/m"]
[null,null,null,null,"20 x 5 mm Flat Bar (x2) - 1.6 kg/m","25 x 8 mm Flat Bar (x2) - 3.2 kg/m"]
[]
[]
[null,null,null,"DO NOT FILL"]
[]
[null,null,null,{"$f":"D713","v":"wbBallast"},null,null,{"$f":"SUBSTITUTE(\" \",\"\",$D707)","v":" "},{"$f":"IFERROR(INDEX(#REF!, MATCH(0, COUNTIF($D$445:G720,#REF!) + ( COUNTIF(#REF!,#REF!)<>1), 0)), \"\")","v":""},{"$f":"IFERROR(INDEX(#REF!, MATCH(0, COUNTIF($D$445:H720,#REF!) + ( COUNTIF(#REF!,#REF!)<>1), 0)), \"\")","v":""}]
[null,null,"row",{"$f":"MATCH(D720,$D706:$D719,0)","v":8}]
[null,null,"column",{"$f":"MATCH(OFFSET($D706,MATCH(D720,$D706:$D719,0)-2,0),OFFSET($D706,MATCH(D720,$D706:$D719,0)-2,1,1,11),0)+1","v":2}]
[null,null,"Size",{"$f":"OFFSET($D706,MATCH(D720,$D706:$D719,0)-2,0,)","v":0}]
[null,null,"Test →"]
[null,null,"Data Validation Name",{"$f":"\"L_\"&SUBSTITUTE(D720,\" \",\"\")","v":"L_wbBallast"}]
[]
[]
[]
[]
[]
[]
[null,null,"Enter DEPENDENCIES","SELECTION OPTIONS","CONFIGURATIONS"]
[null,null,"Ref Position →",{"$f":"COUNTA(D734:D737)","v":0},{"$f":"SUM(COUNTIF(E734:E737,$C734:$C737))","v":0},{"$f":"SUM(COUNTIF(F734:F737,$C734:$C737))","v":0},{"$f":"SUM(COUNTIF(G734:G737,$C734:$C737))","v":0},{"$f":"SUM(COUNTIF(H734:H737,$C734:$C737))","v":0},{"$f":"SUM(COUNTIF(I734:I737,$C734:$C737))","v":0},{"$f":"SUM(COUNTIF(J734:J737,$C734:$C737))","v":0},{"$f":"SUM(COUNTIF(K734:K737,$C734:$C737))","v":0},{"$f":"SUM(COUNTIF(L734:L737,$C734:$C737))","v":0},{"$f":"SUM(COUNTIF(M734:M737,$C734:$C737))","v":0},{"$f":"SUM(COUNTIF(N734:N737,$C734:$C737))","v":0}]
[null,"Enter Selection 1 ->"]
[null,"Enter Selection 2->"]
[null,"Enter Selection 3->"]
[null,"Enter Selection 4->"]
[]
[null,null,null,{"$f":"MAX(E739:N739)","v":0},{"$f":"IF(E733<>$D733,0,COUNTA(E740:E744))","v":0},0,0,0,0,0,0,0,0,0]
[null,"Dependent (Output List) 1 -> ",null,"Option 1"]
[]
[]
[]
[]
[null,null,null,"DO NOT FILL"]
[]
[null,null,null,{"$f":"MAX(E747:N747)","v":0},{"$f":"IF(E733<>$D733,0,COUNTA(E748:E752))","v":0},{"$f":"IF(F733<>$D733,0,COUNTA(F748:F752))","v":0},0,0,0,0,0,0,0,0]
[null,"Dependent (Output List) 2 -> ",null,"Option 2"]
[]
[]
[]
[]
[null,null,null,"DO NOT FILL"]
[]
[null,null,null,{"$f":"MAX(E755:N755)","v":0},{"$f":"IF(E733<>$D733,0,COUNTA(E756:E760))","v":0},{"$f":"IF(F733<>$D733,0,COUNTA(F756:F760))","v":0},0,0,0,0,0,0,0,0]
[null,"Dependent (Output List) 3 -> ",null,"Option 3"]
[]
[]
[]
[]
[null,null,null,"DO NOT FILL"]
[]
[null,null,null,{"$f":"D740","v":"Option 1"},{"$f":"D748","v":"Option 2"},{"$f":"D756","v":"Option 3"},null,{"$f":"IFERROR(INDEX(#REF!, MATCH(0, COUNTIF($D$445:G763,#REF!) + ( COUNTIF(#REF!,#REF!)<>1), 0)), \"\")","v":""},{"$f":"IFERROR(INDEX(#REF!, MATCH(0, COUNTIF($D$445:H763,#REF!) + ( COUNTIF(#REF!,#REF!)<>1), 0)), \"\")","v":""}]
[null,null,"row",{"$f":"MATCH(D763,$D733:$D761,0)","v":8},{"$f":"MATCH(E763,$D733:$D761,0)","v":16},{"$f":"MATCH(F763,$D733:$D761,0)","v":24}]
[null,null,"column",{"$f":"MATCH(OFFSET($D733,MATCH(D763,$D733:$D761,0)-2,0),OFFSET($D733,MATCH(D763,$D733:$D761,0)-2,1,1,11),0)+1","v":2},{"$f":"MATCH(OFFSET($D733,MATCH(E763,$D733:$D761,0)-2,0),OFFSET($D733,MATCH(E763,$D733:$D761,0)-2,1,1,11),0)+1","v":2},{"$f":"MATCH(OFFSET($D733,MATCH(F763,$D733:$D761,0)-2,0),OFFSET($D733,MATCH(F763,$D733:$D761,0)-2,1,1,11),0)+1","v":2}]
[null,null,"Size",{"$f":"OFFSET($D733,MATCH(D763,$D733:$D761,0)-2,0,)","v":0},{"$f":"OFFSET($D733,MATCH(E763,$D733:$D761,0)-2,0,)","v":0},{"$f":"OFFSET($D733,MATCH(F763,$D733:$D761,0)-2,0,)","v":0}]
[null,null,"Test →"]
[null,null,"Data Validation Name",{"$f":"\"L_\"&SUBSTITUTE(D763,\" \",\"\")","v":"L_Option1"},{"$f":"\"L_\"&SUBSTITUTE(E763,\" \",\"\")","v":"L_Option2"},{"$f":"\"L_\"&SUBSTITUTE(F763,\" \",\"\")","v":"L_Option3"}]

{"sheet":"Ctrl_Deductions","index":5,"n_rows":76,"n_cols":47,"rows_kept":76,"cut":false,"hidden":true,"merged":[[14,23,18,23],[14,24,18,24],[1,25,1,26],[2,25,2,46],[9,23,13,23],[4,23,8,23],[9,24,13,24],[4,24,8,24]]}
[null,null,null,null,null,null,null,null,"LXSKYLINE",4.8899999999999997,4.8899999999999997,{"$f":"K1+K3","v":12.19},null,null,null,null,null,null,null,null,null,null,null,null,null,null,null,null,null,null,null,null,null,null,null,null,null,{"$f":"i_BktFixType","v":0}]
[null,null,null,"Does",null,"Apply to ",null,null,"SLB660",4.57,4.57,{"$f":"K2+K3","v":11.870000000000001},null,null,null,null,null,null,null,null,null,null,null,null,null,"assumes side fix baseline, top orien",null,"open assumes bracket covers used",null,null,null,null,null,null,null,"assumes top/face is BASELINE",null,{"$f":"i_ZipscreenSideGuideFix","v":{"$error":"#REF!"}}]
[null,null,null,null,null,null,null,null,"MINI",339.9,7.3,null,null,null,null,null,null,null,null,null,null,null,null,"Enter DEPENDENCIES","SELECTION OPTIONS","CONFIGURATIONS"]
[null,null,null,null,null,null,null,null,"LIGHT",541.9,7.3,null,null,null,null,null,null,null,null,null,null,null,null,null,{"$f":"MAX(Z4:AU4)","v":0},{"$f":"SUM(COUNTIF(Z5:Z19,$X$5:$X$19))","v":0},{"$f":"SUM(COUNTIF(AA5:AA19,$X$5:$X$19))","v":0},{"$f":"SUM(COUNTIF(AB5:AB19,$X$5:$X$19))","v":0},{"$f":"SUM(COUNTIF(AC5:AC19,$X$5:$X$19))","v":0},{"$f":"SUM(COUNTIF(AD5:AD19,$X$5:$X$19))","v":0},{"$f":"SUM(COUNTIF(AE5:AE19,$X$5:$X$19))","v":0},{"$f":"SUM(COUNTIF(AF5:AF14,$X$5:$X$14))","v":0},{"$f":"SUM(COUNTIF(AG5:AG14,$X$5:$X$14))","v":0},{"$f":"SUM(COUNTIF(AH5:AH14,$X$5:$X$14))","v":0},{"$f":"SUM(COUNTIF(AI5:AI14,$X$5:$X$14))","v":0},{"$f":"SUM(COUNTIF(AJ5:AJ14,$X$5:$X$14))","v":0},{"$f":"SUM(COUNTIF(AK5:AK14,$X$5:$X$14))","v":0},{"$f":"SUM(COUNTIF(AL5:AL14,$X$5:$X$14))","v":0},{"$f":"SUM(COUNTIF(AM5:AM14,$X$5:$X$14))","v":0},{"$f":"SUM(COUNTIF(AN5:AN14,$X$5:$X$14))","v":0},{"$f":"SUM(COUNTIF(AO5:AO14,$X$5:$X$14))","v":0},{"$f":"SUM(COUNTIF(AP5:AP14,$X$5:$X$14))","v":0},{"$f":"SUM(COUNTIF(AQ5:AQ14,$X$5:$X$14))","v":0},{"$f":"SUM(COUNTIF(AR5:AR14,$X$5:$X$14))","v":0},{"$f":"SUM(COUNTIF(AS5:AS14,$X$5:$X$14))","v":0},{"$f":"SUM(COUNTIF(AT5:AT14,$X$5:$X$14))","v":0},{"$f":"SUM(COUNTIF(AU5:AU14,$X$5:$X$14))","v":0}]
[null,null,null,null,null,null,null,null,"MED",851.9,7.3,null,null,null,null,null,null,null,null,null,null,null,null,{"$f":"INDIRECT(\"i_\"&SUBSTITUTE($Y5,\" \",\"\"))","v":0},"Installation Type","Open","Open","Open","Open","Open","Open"]
[null,null,null,null,null,null,null,null,"HEAVY",951.9,7.3]
[null,null,null,null,null,null,null,null,null,5]
[null,null,null,null,null,null,null,null,"SLB660",4.57,4.57,{"$f":"K8+K9","v":12.190000000000001}]
[null,null,null,null,null,null,null,null,"SLPEV653xx",41.15,7.62,{"$f":"K8+K11","v":18.57}]
[null,null,null,null,null,null,null,null,"SLPEHD53xx",78.34,9,null,null,null,null,null,null,null,null,null,null,null,null,{"$f":"INDIRECT(\"i_\"&SUBSTITUTE($Y10,\" \",\"\"))","v":0},"Open Bkt Style","Skyline 1.5\"","Skyline 1.5\"","Skyline 1.5\"","LX Skyline","LX Skyline","LX Skyline"]
[null,null,null,null,null,null,null,null,"Universal Limiter",142.69,14]
[null,null,null,null,null,null,null,{"$f":"J11-J12","v":17.739999999999995},"Short Limiter",124.95,14]
[null,null,null,null,null,null,null,null,"LXSKYLINE",4.8899999999999997,4.8899999999999997]
[]
[null,null,null,null,null,null,null,"SLB660","MINIMUM SHADE WIDTH","STD 1.5","HD 1.5","Universal","Short",null,null,null,null,null,null,null,null,null,null,{"$f":"INDIRECT(\"i_\"&SUBSTITUTE($Y15,\" \",\"\"))","v":0},"Idler Type","Skyline Pin End 1.5\"","Skyline Heavy Duty Pin End 1.5\"","Single Limiter | Universal 1.5\"","Skyline Pin End 1.5\"","Skyline Heavy Duty Pin End 1.5\"","Single Limiter | Universal 1.5\""]
[null,null,null,null,null,null,null,null,"MINI",{"$f":"$J$2+$J$3+$J$7+$J$8+$J$9","v":395.18999999999994},{"$f":"$J$2+$J$3+$J$7+$J$8+$J$10","v":432.38},{"$f":"$J$2+$J$3+$J$7+$J$8+$J$11","v":496.72999999999996},{"$f":"$J$2+$J$3+$J$7+$J$8+$J$12","v":478.98999999999995},null,null,null,null,null,null,null,null,null,null,null,null,null,null,"Single Stop Limiter | Short 1.5\"",null,null,"Single Stop Limiter | Short 1.5\""]
[null,null,null,null,null,null,null,null,"LIGHT",{"$f":"$J$2+$J$4+$J$7+$J$8+$J$9","v":597.19000000000005},{"$f":"$J$2+$J$4+$J$7+$J$8+$J$10","v":634.38000000000011},{"$f":"$J$2+$J$4+$J$7+$J$8+$J$11","v":698.73},{"$f":"$J$2+$J$4+$J$7+$J$8+$J$12","v":680.99000000000012}]
[null,null,null,null,null,null,null,null,"MEDIUM",{"$f":"$J$2+$J$5+$J$7+$J$8+$J$9","v":907.19},{"$f":"$J$2+$J$5+$J$7+$J$8+$J$10","v":944.38000000000011},{"$f":"$J$2+$J$5+$J$7+$J$8+$J$11","v":1008.73},{"$f":"$J$2+$J$5+$J$7+$J$8+$J$12","v":990.99000000000012}]
[null,null,null,null,null,null,null,null,"HEAVY",{"$f":"$J$2+$J$6+$J$7+$J$8+$J$9","v":1007.19},{"$f":"$J$2+$J$6+$J$7+$J$8+$J$10","v":1044.3800000000001},{"$f":"$J$2+$J$6+$J$7+$J$8+$J$11","v":1108.73},{"$f":"$J$2+$J$6+$J$7+$J$8+$J$12","v":1090.99}]
[]
[null,null,null,null,null,null,null,null,null,null,null,null,null,null,null,null,null,null,null,null,null,null,null,null,null,null,null,null,null,null,null,null,null,null,null,"open bkt assumes TOP FIX for heights, modifier for face fix"]
[null,null,null,null,null,null,null,"SLB660","TUBE DEDUCTION","STD 1.5","HD 1.5","Universal","Short",null,null,null,null,null,null,null,null,null,null,null,null,null,null,null,null,null,null,null,null,null,null,"assumes top/face is BASELINE for box190- modifier subtracts 6mm (accounts for L fixing side channels"]
[null,null,null,null,null,null,null,null,"ALL",{"$f":"$K$2+$K$3+$K$8+$K$9","v":24.060000000000002},{"$f":"$K$2+$K$3+$K$8+$K$10","v":25.44},{"$f":"$K$2+$K$3+$K$8+$K$11","v":30.44},{"$f":"$K$2+$K$3+$K$8+$K$12","v":30.44},null,null,null,null,null,null,null,null,null,null,null,null,24.06,25.44,30.44,24.7,26.08,31.08]
[null,null,null,null,null,null,null,null,null,null,null,null,null,null,null,null,null,null,null,null,null,null,null,"Type","Deduction",{"$f":"IF(Z4<>$Y$4,0,1)","v":1},1,1,1,1,1,1,1,1,1,1,1,1,1,1,1,1,1,1,1,1,1]
[null,null,null,null,null,null,null,null,null,null,null,null,null,null,null,null,null,null,null,null,null,null,null,"Fabric",{"$f":"INDEX(Z25:AU25,0,MATCH(1,$Z$24:$AU$24,0))","v":24},24,26,31,25,26,31]
[null,null,null,"HAS FORMULAS",null,null,null,"LXSKYLINE","MINIMUM SHADE WIDTH","STD 1.5","HD 1.5","Universal","Short",null,null,null,null,null,null,null,null,null,null,"Tube",24,24,26,31,25,26,31]
[null,null,null,null,null,null,null,null,"MINI",{"$f":"$J$1+$J$3+$J$7+$J$13+$J$9","v":395.82999999999993},{"$f":"$J$1+$J$3+$J$7+$J$13+$J$10","v":433.02},{"$f":"$J$1+$J$3+$J$7+$J$13+$J$11","v":497.36999999999995},{"$f":"$J$1+$J$3+$J$7+$J$13+$J$12","v":479.62999999999994},null,null,null,null,null,null,null,null,null,null,"Box",0]
[null,null,null,null,null,null,null,null,"LIGHT",{"$f":"$J$1+$J$4+$J$7+$J$13+$J$9","v":597.82999999999993},{"$f":"$J$1+$J$4+$J$7+$J$13+$J$10","v":635.02},{"$f":"$J$1+$J$4+$J$7+$J$13+$J$11","v":699.36999999999989},{"$f":"$J$1+$J$4+$J$7+$J$13+$J$12","v":681.63},null,null,null,null,null,null,null,null,null,null,"ControlType",0]
[null,null,null,null,null,null,null,null,"MEDIUM",{"$f":"$J$1+$J$5+$J$7+$J$13+$J$9","v":907.82999999999993},{"$f":"$J$1+$J$5+$J$7+$J$13+$J$10","v":945.02},{"$f":"$J$1+$J$5+$J$7+$J$13+$J$11","v":1009.3699999999999},{"$f":"$J$1+$J$5+$J$7+$J$13+$J$12","v":991.63},null,null,null,null,null,null,null,null,null,null,"Idler",0]
[null,null,null,null,null,null,null,null,"HEAVY",{"$f":"$J$1+$J$6+$J$7+$J$13+$J$9","v":1007.8299999999999},{"$f":"$J$1+$J$6+$J$7+$J$13+$J$10","v":1045.02},{"$f":"$J$1+$J$6+$J$7+$J$13+$J$11","v":1109.3699999999999},{"$f":"$J$1+$J$6+$J$7+$J$13+$J$12","v":1091.6299999999999},null,null,null,null,null,null,null,null,null,null,"wb",24,24,26,31,25,26,31]
[null,null,null,null,null,null,null,null,null,null,null,null,null,null,null,null,null,null,null,null,null,null,null,"Ballast",{"$f":"INDEX(Z31:AU31,0,MATCH(1,$Z$24:$AU$24,0))","v":0},{"$f":"(((($G$40*$G$37/1000)-($G$40*$G$38/1000))*1000)/$G$39)","v":0},{"$f":"(((($G$40*$G$37/1000)-($G$40*$G$38/1000))*1000)/$G$39)","v":0},0,0,0,0]
[null,null,null,null,null,null,null,null,null,null,null,null,null,null,null,null,null,null,null,null,null,null,null,"TubeSpline",24,24,26,31,25,26,31]
[null,null,null,null,null,null,null,"LXSKYLINE","TUBE DEDUCTION","STD 1.5","HD 1.5","Universal","Short",null,null,null,null,null,null,null,null,null,null,"wbSpline",24,24,26,31,25,26,31]
[null,null,null,{"$f":"COUNTA(D43:D52)","v":6},null,null,null,null,"ALL",{"$f":"$K$1+$K$3+$K$13+$K$9","v":24.7},{"$f":"$K$1+$K$3+$K$13+$K$10","v":26.08},{"$f":"$K$1+$K$3+$K$13+$K$11","v":31.08},{"$f":"$K$1+$K$3+$K$13+$K$12","v":31.08},null,null,null,null,null,null,null,null,null,null,"wbSeal",24,24,26,31,25,26,31]
[null,null,null,null,null,null,null,null,null,null,null,null,null,null,null,null,null,null,null,null,null,null,null,"Brush",0]
[null,null,null,null,null,null,"RA VAULT:","Ballast calculation for D30 weight bar on Rising Sun.xlsx | OPEN | WEB | BROWSE",null,null,null,null,null,null,null,null,null,null,null,null,null,null,null,"FabricDrop",{"$f":"INDEX(Z36:AU36,0,MATCH(1,$Z$24:$AU$24,0))","v":-150},-150,-150,-150,-150,-150,-150]
[null,null,null,null,null,null,0.35,"REQUIRED WEIGHT OF WEIGHT BAR (kg/m)"]
[null,null,null,null,null,null,0.30599999999999999,"D30 (kg/m)",null,null,null,null,null,null,null,null,null,null,null,null,null,null,null,null,null,null,null,null,null,null,null,null,null,null,null,"top/face vs. recess has diff rail HEIGHTS?"]
[null,null,null,null,null,null,0.23,"Ballast (kg/m)"]
[null,null,null,null,null,null,{"$f":"IF(i_Units=\"Metric\",i_Width,CONVERT(i_Width,\"in\",\"mm\"))","v":0},"Width (mm)",null,null,null,null,null,null,null,null,"Lookup"]
[null,null,null,null,null,null,null,null,null,null,null,null,null,null,null,null,"Deduction"]
[null,null,null,{"$f":"X25","v":"Fabric"},{"$f":"X26","v":"Tube"},{"$f":"X27","v":"Box"},{"$f":"X28","v":"ControlType"},{"$f":"X29","v":"Idler"},{"$f":"X30","v":"wb"},{"$f":"X31","v":"Ballast"},{"$f":"X32","v":"TubeSpline"},{"$f":"X33","v":"wbSpline"},{"$f":"X34","v":"wbSeal"},{"$f":"X35","v":"Brush"},{"$f":"X36","v":"FabricDrop"},null,"Modifiers",null,"QTY","ON/OFF",null,"Comments",null,null,null,{"$f":"IF(Z4<>$Y$4,0,1)","v":1},1,1,1,1,1,1,1,1,1,1,1,1,1,1,1,1,1,1,1,1,1]
[null,null,null,1,1,1,0,0,1,1,1,1,1,0,0,null,{"$f":"INDEX($Z$43:$AU$49,0,MATCH(1,$Z$42:$AU$42,0))","v":3},null,1,{"$f":"IFERROR(IF(ISBLANK(X43),\"\",IF(FIND(Y43,INDIRECT(\"i_\"&$X43))>0,1,0)),0)","v":0},null,null,null,"OpenBktCovers","Yes",3,3,3,2,2,2]
[null,null,null,0,0,0,0,0,0,0,0,0,0,0,1,null,{"$f":"INDEX($Z$43:$AU$49,0,MATCH(1,$Z$42:$AU$42,0))","v":-140},null,1,{"$f":"IFERROR(IF(ISBLANK(X44),\"\",IF(FIND(Y44,INDIRECT(\"i_\"&$X44))>0,1,0)),0)","v":0},null,null,null,"WeightBar","Fabric Wrap",-140,-140,-140,-140,-140,-140]
[null,null,null,0,0,0,1,1,0,0,0,0,0,0,0,null,0,null,0,{"$f":"IFERROR(IF(ISBLANK(X45),\"\",IF(FIND(Y45,INDIRECT(\"i_\"&$X45))>0,1,0)),0)","v":""}]
[null,null,null,1,1,0,0,0,1,1,1,1,1,0,0,null,0,null,0,""]
[null,null,null,1,1,0,0,0,1,1,1,1,1,0,0,null,0,null,0,""]
[null,null,null,1,1,1,0,0,1,1,1,1,1,0,0,null,0,null,0,{"$f":"IFERROR(IF(ISBLANK(X48),\"\",IF(FIND(Y48,INDIRECT(\"i_\"&$X48))>0,1,0)),0)","v":""}]
[]
[]
[]
[]
[null,null,null,null,null,null,null,null,null,null,null,null,null,null,null,null,null,null,null,null,null,null,null,"Type","Deduction",{"$f":"IF(Z4<>$Y$4,0,1)","v":1},1,1,1,1,1,1,1,1,1,1,1,1,1,1,1,1,1,1,1,1,1]
[null,null,null,null,null,null,null,null,null,null,null,null,null,null,null,null,null,null,null,null,null,null,null,"Fabric",{"$f":"INDEX(Z54:AU54,0,MATCH(1,$Z$24:$AU$24,0))","v":24},{"$f":"IFERROR(IF(Z$53=0,\"\",Z25+SUMPRODUCT($T$43:$T$48,$S$43:$S$48,$Q$43:$Q$48,OFFSET($D$42,1,MATCH($X54,$D$42:$O$42,0)-1,$D$34,1))),\"\")","v":24},26,31,25,26,31,0,0,0,0,0,0,0,0,0,0,0,0,0,0,0,0]
[null,null,null,null,null,null,null,null,null,null,null,null,null,null,null,null,null,null,null,null,null,null,null,"Tube",{"$f":"INDEX(Z55:AU55,0,MATCH(1,$Z$24:$AU$24,0))","v":24},{"$f":"IFERROR(IF(Z$53=0,\"\",Z26+SUMPRODUCT($T$43:$T$48,$S$43:$S$48,$Q$43:$Q$48,OFFSET($D$42,1,MATCH($X55,$D$42:$O$42,0)-1,$D$34,1))),\"\")","v":24},{"$f":"IFERROR(IF(AA$53=0,\"\",AA26+SUMPRODUCT($T$43:$T$48,$S$43:$S$48,$Q$43:$Q$48,OFFSET($D$42,1,MATCH($X55,$D$42:$O$42,0)-1,$D$34,1))),\"\")","v":26},31,25,26,31,0,0,0,0,0,0,0,0,0,0,0,0,0,0,0,0]
[null,null,null,null,null,null,null,null,null,null,null,null,null,null,null,null,null,null,null,null,null,null,null,"Box",{"$f":"INDEX(Z56:AU56,0,MATCH(1,$Z$24:$AU$24,0))","v":0},{"$f":"IFERROR(IF(Z$53=0,\"\",Z27+SUMPRODUCT($T$43:$T$48,$S$43:$S$48,$Q$43:$Q$48,OFFSET($D$42,1,MATCH($X56,$D$42:$O$42,0)-1,$D$34,1))),\"\")","v":0},0,0,0,0,0,0,0,0,0,0,0,0,0,0,0,0,0,0,0,0,0]
[null,null,null,null,null,null,null,null,null,null,null,null,null,null,null,null,null,null,null,null,null,null,null,"wb",{"$f":"INDEX(Z57:AU57,0,MATCH(1,$Z$24:$AU$24,0))","v":24},{"$f":"IFERROR(IF(Z$53=0,\"\",Z30+SUMPRODUCT($T$43:$T$48,$S$43:$S$48,$Q$43:$Q$48,OFFSET($D$42,1,MATCH($X57,$D$42:$O$42,0)-1,$D$34,1))),\"\")","v":24},26,31,25,26,31,0,0,0,0,0,0,0,0,0,0,0,0,0,0,0,0]
[null,null,null,null,null,null,null,null,null,null,null,null,null,null,null,null,null,null,null,null,null,null,null,"Ballast",{"$f":"INDEX(Z58:AU58,0,MATCH(1,$Z$24:$AU$24,0))","v":0},{"$f":"IFERROR(IF(Z$53=0,\"\",Z31+SUMPRODUCT($T$43:$T$48,$S$43:$S$48,$Q$43:$Q$48,OFFSET($D$42,1,MATCH($X58,$D$42:$O$42,0)-1,$D$34,1))),\"\")","v":0},0,0,0,0,0,0,0,0,0,0,0,0,0,0,0,0,0,0,0,0,0]
[null,null,null,null,null,null,null,null,null,null,null,null,null,null,null,null,null,null,null,null,null,null,null,"TubeSpline",{"$f":"INDEX(Z59:AU59,0,MATCH(1,$Z$24:$AU$24,0))","v":24},{"$f":"IFERROR(IF(Z$53=0,\"\",Z32+SUMPRODUCT($T$43:$T$48,$S$43:$S$48,$Q$43:$Q$48,OFFSET($D$42,1,MATCH($X59,$D$42:$O$42,0)-1,$D$34,1))),\"\")","v":24},26,31,25,26,31,0,0,0,0,0,0,0,0,0,0,0,0,0,0,0,0]
[null,null,null,null,null,null,null,null,null,null,null,null,null,null,null,null,null,null,null,null,null,null,null,"wbSpline",{"$f":"INDEX(Z60:AU60,0,MATCH(1,$Z$24:$AU$24,0))","v":24},{"$f":"IFERROR(IF(Z$53=0,\"\",Z33+SUMPRODUCT($T$43:$T$48,$S$43:$S$48,$Q$43:$Q$48,OFFSET($D$42,1,MATCH($X60,$D$42:$O$42,0)-1,$D$34,1))),\"\")","v":24},26,31,25,26,31,0,0,0,0,0,0,0,0,0,0,0,0,0,0,0,0]
[null,null,null,null,null,null,null,null,null,null,null,null,null,null,null,null,null,null,null,null,null,null,null,"wbSeal",{"$f":"INDEX(Z61:AU61,0,MATCH(1,$Z$24:$AU$24,0))","v":24},{"$f":"IFERROR(IF(Z$53=0,\"\",Z34+SUMPRODUCT($T$43:$T$48,$S$43:$S$48,$Q$43:$Q$48,OFFSET($D$42,1,MATCH($X61,$D$42:$O$42,0)-1,$D$34,1))),\"\")","v":24},26,31,25,26,31,0,0,0,0,0,0,0,0,0,0,0,0,0,0,0,0]
[null,null,null,null,null,null,null,null,null,null,null,null,null,null,null,null,null,null,null,null,null,null,null,"Brush",{"$f":"INDEX(Z62:AU62,0,MATCH(1,$Z$24:$AU$24,0))","v":0},null,null,null,null,null,null,null,null,null,null,{"$f":"IFERROR(IF(AJ$53=0,\"\",AJ35+SUMPRODUCT($T$43:$T$48,$S$43:$S$48,$Q$43:$Q$48,OFFSET($D$42,1,MATCH($X62,$D$42:$O$42,0)-1,$D$34,1))),\"\")","v":0},0,0,0,0,0,0,0,0,0,0,0]
[null,null,null,null,null,null,null,null,null,null,null,null,null,null,null,null,null,null,null,null,null,null,null,"FabricDrop",{"$f":"INDEX(Z63:AU63,0,MATCH(1,$Z$24:$AU$24,0))","v":-150},{"$f":"IFERROR(IF(Z$53=0,\"\",Z36+SUMPRODUCT($T$43:$T$48,$S$43:$S$48,$Q$43:$Q$48,OFFSET($D$42,1,MATCH($X63,$D$42:$O$42,0)-1,$D$34,1))),\"\")","v":-150},{"$f":"IFERROR(IF(AA$53=0,\"\",AA36+SUMPRODUCT($T$43:$T$48,$S$43:$S$48,$Q$43:$Q$48,OFFSET($D$42,1,MATCH($X63,$D$42:$O$42,0)-1,$D$34,1))),\"\")","v":-150},-150,-150,-150,-150,0,0,0,0,{"$f":"IFERROR(IF(AJ$53=0,\"\",AJ36+SUMPRODUCT($T$43:$T$48,$S$43:$S$48,$Q$43:$Q$48,OFFSET($D$42,1,MATCH($X63,$D$42:$O$42,0)-1,$D$34,1))),\"\")","v":0},0,0,0,0,0,0,0,0,0,0,0]
[]
[]
[]
[]
[]
[]
[]
[]
[null,null,null,null,null,null,null,null,null,null,null,null,null,null,null,null,null,null,null,null,null,null,null,null,"removed 19-Apr-20; changed everything to base mm"]
[null,null,null,null,null,null,null,null,null,null,null,null,null,null,null,null,null,null,null,null,null,null,null,null,"=IFERROR(CONVERT(INDEX(AA71:AT71,0,MATCH(1,$AA$24:$AT$24,0)),\"mm\",INDEX(T_UnitSelection[Units],MATCH(i_Units,T_UnitSelection[UnitSelection],0))),\"\")"]
[]
[]
[null,null,null,null,null,null,null,null,null,null,null,null,null,null,null,null,null,null,null,null,null,null,null,"=IFERROR(CONVERT(IF(AO22=\"Y\",i_Width-INDEX(INDIRECT(\"T_DeductionCovers\"&i_BracketCovers&\"[Deduction]\"),MATCH(AP22,INDIRECT(\"T_DeductionCovers\"&i_BracketCovers&\"[Type]\"),0)),\"\"),\"mm\",AM22),\"\")/(o_nScreens)"]

{"sheet":"Ctrl_Recommendations","index":6,"n_rows":151,"n_cols":23,"rows_kept":151,"cut":false,"hidden":true,"merged":[[1,6,2,6],[1,7,2,7],[1,2,1,3],[1,4,1,5],[19,1,20,1],[12,2,12,3],[6,1,6,3],[72,1,72,2],[53,1,53,2],[60,1,60,3],[16,1,17,1],[29,2,29,3],[30,2,30,3],[22,1,23,1],[20,10,20,21],[38,10,38,12],[38,13,38,15],[38,16,38,18],[38,19,38,21]]}
[]
[null,null,"Absolute Min",null,"Absolute Max",null,{"$f":"\"Current Value (\"&i_Units&\")\"","v":"Current Value ()"},"Outside Specs\n(0 = No, 1 = Yes)",null,null,null,null,null,null,null,null,null,null,null,null,null,"sorted by priority"]
[null,null,"mm",{"$f":"\"Min (\"&i_Units&\")\"","v":"Min ()"},"mm",{"$f":"\"Max (\"&i_Units&\")\"","v":"Max ()"},null,null,null,null,null,null,"FORMULA drive min-max",null,null,null,null,null,null,null,null,"Warning cells are NAMED."]
[null,"Width",{"$f":"o_MinWidthReqd","v":{"$error":"#N/A"}},{"$f":"IF(i_Units=\"Metric\",C4,CONVERT(C4,\"mm\",\"in\"))","v":{"$error":"#N/A"}},3000,{"$f":"IF(i_Units=\"Metric\",E4,CONVERT(E4,\"mm\",\"in\"))","v":118.11023622047243},{"$f":"i_Width","v":0},{"$f":"IF(AND(AND(i_Width<>\"\",i_Width>=0),OR(i_Width<MinWidth,i_Width>MaxWidth)),1,0)","v":{"$error":"#N/A"}}]
[null,"Drop",500,{"$f":"IF(i_Units=\"Metric\",C5,CONVERT(C5,\"mm\",\"in\"))","v":19.685039370078741},3000,{"$f":"IF(i_Units=\"Metric\",E5,CONVERT(E5,\"mm\",\"in\"))","v":118.11023622047243},{"$f":"i_Drop","v":0},{"$f":"IF(AND(AND(i_Drop<>\"\",i_Drop>=0),OR(i_Drop<MinDrop,i_Drop>MaxDrop)),1,0)","v":0},null,null,"#","Dim","Min","Max",null,"i_installationType",null,null,null,null,null,"on / off","Warning"]
[null,null,null,null,null,null,null,null,null,null,"w_BlindDrop","o_dropmm",null,3000,null,null,null,null,null,{"$f":"IFERROR(PRODUCT(IF(o_Dropmm>N6,\"1\",\"0\"),Q6),\"-\")","v":0},null,{"$f":"IFERROR(IF(T6>0,\"on\",\"off\"),\"-\")","v":"off"},{"$f":"\"Warning! Blind Drop is too large, recommended limit is \"&IF(i_Units=\"Metric\",ROUND(E5/1000,2) &\" m\", ROUND(CONVERT(E5,\"mm\",\"in\"),0)&\" in\")&\". Refer Specifications Manual.\"","v":"Warning! Blind Drop is too large, recommended limit is 118 in. Refer Specifications Manual."}]
[null,null,null,null,null,null,null,null,null,null,"w_BlindDrop","o_dropmm",null,3000,null,"Open",{"$f":"IFERROR(IF(ISBLANK(P7),\"\",IF(FIND(P7,INDIRECT($P$5))>0,0,1)),1)","v":1},null,null,{"$f":"IFERROR(PRODUCT(IF(o_Dropmm>N7,\"1\",\"0\"),Q7),\"-\")","v":0},null,{"$f":"IFERROR(IF(T7>0,\"on\",\"off\"),\"-\")","v":"off"},{"$f":"\"Warning! Blind Drop is greater than \"&IF(i_Units=\"Metric\",ROUND(N7/1000,2) &\" m\", ROUND(CONVERT(N7,\"mm\",\"in\"),0)&\" in\")","v":"Warning! Blind Drop is greater than 118 in"}]
[null,null,null,null,null,null,null,null,null,null,"w_BlindDrop","o_dropmm",{"$f":"C5","v":500},null,null,null,null,null,null,{"$f":"IFERROR(PRODUCT(IF(AND(o_Dropmm<>0,o_Dropmm<M8),\"1\",\"0\"),Q8),\"-\")","v":0},null,{"$f":"IFERROR(IF(T8>0,\"on\",\"off\"),\"-\")","v":"off"},{"$f":"\"Warning! Blind drop recommended to be greater than \"&IF(i_Units=\"Metric\",ROUND(M8,2) &\" mm\", ROUND(CONVERT(M8,\"mm\",\"in\"),1)&\" in\")&\".\"","v":"Warning! Blind drop recommended to be greater than 19.7 in."}]
[null,null,null,null,null,null,null,null,null,null,null,null,null,null,null,null,null,null,null,{"$f":"SUM($T$6:$T$8)","v":0},null,"w_BlindDrop"]
[]
[]
[null,null,null,null,null,null,null,null,null,null,"w_BlindWidth","o_widthmm",null,{"$f":"IFERROR(INDEX(T_Limit[Limit],MATCH(\"Width_Max\",T_Limit[Type],0),0),\"\")","v":3000},null,null,{"$f":"IFERROR(IF(ISBLANK(P12),\"\",IF(FIND(P12,INDIRECT($P$5))>0,0,1)),1)","v":""},null,null,{"$f":"IFERROR(PRODUCT(IF(o_Widthmm>N12,\"1\",\"0\")),\"-\")","v":0},null,{"$f":"IFERROR(IF(o_Widthmm>N12,\"on\",\"off\"),\"-\")","v":"off"},{"$f":"\"Warning! Blind Width is too wide, recommended limit is \"&IF(i_Units=\"Metric\",ROUND(N12/1000,2) &\" m\", ROUND(CONVERT(N12,\"mm\",\"in\"),1)&\" in\")&\". Refer Specifications Manual.\"","v":"Warning! Blind Width is too wide, recommended limit is 118.1 in. Refer Specifications Manual."}]
[null,null,null,null,null,null,null,null,null,null,"w_ControlWidth","o_widthmm",{"$f":"o_MinWidthReqd","v":{"$error":"#N/A"}},null,null,null,{"$f":"IFERROR(IF(ISBLANK(P13),\"\",IF(FIND(P13,INDIRECT($P$5))>0,0,1)),1)","v":""},null,null,{"$f":"IFERROR(PRODUCT(IF(o_Widthmm<M13,\"1\",\"0\")),\"-\")","v":"-"},null,{"$f":"IFERROR(IF(AND(i_ControlType<>\"\",o_Widthmm<M13),\"on\",\"off\"),\"-\")","v":"-"},{"$f":"\"Warning! Blind width too small for selected Control Type. Minimum Width: \"&IF(i_Units=\"Imperial\",ROUND(CONVERT(o_MinWidthReqd,\"mm\",\"in\"),1)&\" in\",o_MinWidthReqd&\" mm\")","v":{"$error":"#N/A"}}]
[null,"Width Range","400mm - 2400mm","15.75in - 94.49in",null,null,null,null,null,null,null,null,null,null,null,null,null,null,null,{"$f":"SUM(T12:T13)","v":0}]
[null,"Drop Range","500mm - 3400mm","19.69in - 133.86in"]
[]
[null,"Blind Width","mm","in"]
[null,null,{"$f":"IF(i_Units=\"Metric\",i_Width,CONVERT(i_Width,\"in\",\"mm\"))","v":0},{"$f":"IF(i_Units=\"Imperial\",i_Width,CONVERT(i_Width,\"mm\",\"in\"))","v":0}]
[]
[null,"Blind Drop","mm","in"]
[null,null,{"$f":"IF(i_Units=\"Metric\",i_Drop,CONVERT(i_Drop,\"in\",\"mm\"))","v":0},{"$f":"IF(i_Units=\"Imperial\",i_Drop,CONVERT(i_Drop,\"mm\",\"in\"))","v":0},null,null,null,null,null,null,"Removed from inputs page, Control Type:",null,null,null,null,null,null,null,null,null,null,null,{"$f":"IFERROR(IF(o_SystemSpecChart=\"X\", \"Outside Spring specifications.\", \"Recommended Spring: \"&o_SpringSize),\"\")","v":""}]
[]
[null,"Blind Area","m²","yd²"]
[null,null,{"$f":"ROUND((o_Widthmm*o_Dropmm)/(1000*1000),2)","v":0},{"$f":"ROUND((D18*D21)*0.000772,2)","v":0}]
[]
[]
[null,"Min Width Required",{"$f":"INDEX(H40:H63,MATCH(1,J40:J63,0))","v":{"$error":"#N/A"}},"mm"]
[]
[]
[null,"Control Selection",{"$f":"i_ControlType","v":0}]
[null,"Tube Selection",{"$f":"i_Tube","v":0}]
[null,"Width Input",{"$f":"ROUND((IF(i_Units=\"Metric\",i_Width,CONVERT(i_Width,\"in\",\"mm\"))),-2)/1000","v":0},"m","*round up 100mm"]
[null,"Drop Input",{"$f":"ROUND((IF(i_Units=\"Metric\",i_Drop,CONVERT(i_Drop,\"in\",\"mm\"))),-2)/1000","v":0},"m"]
[]
[]
[]
[]
[null,"T_MinWidth"]
[null,"Description","Booster_In","BoosterID","MinWidth","System",null,"Min Width",null,null,"i_ControlType",null,null,"i_IdlerType",null,null,"i_OpenBktStyle",null,null,"i_OpenBktCovers"]
[null,null,{"$f":"IFERROR(IF(AND(T_MinWidth[[#This Row],[System]]=1,FIND(T_MinWidth[[#This Row],[Description]],i_Booster)>0),1,\"\"),\"\")","v":""},null,null,null,null,{"$f":"ROUND(SUM(M40+P40+S40+V40+I40),0)","v":395},5,{"$f":"L40*O40","v":0},"MINI",{"$f":"IFERROR(IF(ISBLANK(K40),\"\",IF(FIND(K40,INDIRECT($K$39))>0,1,0)),0)","v":0},340,null,{"$f":"IF(i_IdlerType=\"Skyline Pin End 1.5\"\"\",1,0)","v":0},41.15,"LX",{"$f":"IFERROR(IF(ISBLANK(Q40),\"\",IF(FIND(Q40,INDIRECT($Q$39))>0,1,0)),0)","v":0},{"$f":"IF(R40=1,4.89,4.57)*2","v":9.14},"Yes",{"$f":"IFERROR(IF(ISBLANK(T40),\"\",IF(FIND(T40,INDIRECT($T$39))>0,1,0)),0)","v":0},{"$f":"IF(AND(R40=1,U40=1),2,IF(AND(R40=0,U40=1),3,0))","v":0}]
[null,null,{"$f":"IFERROR(IF(AND(T_MinWidth[[#This Row],[System]]=1,FIND(T_MinWidth[[#This Row],[Description]],i_Booster)>0),1,\"\"),\"\")","v":""},null,null,null,null,{"$f":"ROUND(SUM(M41+P41+S41+V41+I41),0)","v":432},5,{"$f":"L41*O41","v":0},"MINI",0,340,"Heavy",{"$f":"IFERROR(IF(ISBLANK(N41),\"\",IF(FIND(N41,INDIRECT($N$39))>0,1,0)),0)","v":0},78.34,"LX",0,{"$f":"IF(R41=1,4.89,4.57)*2","v":9.14},"Yes",{"$f":"IFERROR(IF(ISBLANK(T41),\"\",IF(FIND(T41,INDIRECT($T$39))>0,1,0)),0)","v":0},{"$f":"IF(AND(R41=1,U41=1),2,IF(AND(R41=0,U41=1),3,0))","v":0}]
[null,null,{"$f":"IFERROR(IF(AND(T_MinWidth[[#This Row],[System]]=1,FIND(T_MinWidth[[#This Row],[Description]],i_Booster)>0),1,\"\"),\"\")","v":""},null,null,null,null,497,5,0,"MINI",0,340,"Universal",{"$f":"IFERROR(IF(ISBLANK(N42),\"\",IF(FIND(N42,INDIRECT($N$39))>0,1,0)),0)","v":0},142.69,"LX",0,9.14,"Yes",0,0]
[null,null,{"$f":"IFERROR(IF(AND(T_MinWidth[[#This Row],[System]]=1,FIND(T_MinWidth[[#This Row],[Description]],i_Booster)>0),1,\"\"),\"\")","v":""},null,null,null,null,479,5,0,"MINI",0,340,"Short",{"$f":"IFERROR(IF(ISBLANK(N43),\"\",IF(FIND(N43,INDIRECT($N$39))>0,1,0)),0)","v":0},124.95,"LX",0,9.14,"Yes",0,0]
[null,null,{"$f":"IFERROR(IF(AND(T_MinWidth[[#This Row],[System]]=1,FIND(T_MinWidth[[#This Row],[Description]],i_Booster)>0),1,\"\"),\"\")","v":""},null,null,null,null,{"$f":"ROUND(SUM(M44+P44+S44+V44+I44),0)","v":395},5,{"$f":"L44*O44","v":0},"MICRO",0,340,null,{"$f":"IF(i_IdlerType=\"Skyline Pin End 1.5\"\"\",1,0)","v":0},41.15,"LX",{"$f":"IFERROR(IF(ISBLANK(Q44),\"\",IF(FIND(Q44,INDIRECT($Q$39))>0,1,0)),0)","v":0},{"$f":"IF(R44=1,4.89,4.57)*2","v":9.14},"Yes",{"$f":"IFERROR(IF(ISBLANK(T44),\"\",IF(FIND(T44,INDIRECT($T$39))>0,1,0)),0)","v":0},{"$f":"IF(AND(R44=1,U44=1),2,IF(AND(R44=0,U44=1),3,0))","v":0}]
[null,null,{"$f":"IFERROR(IF(AND(T_MinWidth[[#This Row],[System]]=1,FIND(T_MinWidth[[#This Row],[Description]],i_Booster)>0),1,\"\"),\"\")","v":""},null,null,null,null,432,5,0,"MICRO",0,340,"Heavy",{"$f":"IFERROR(IF(ISBLANK(N45),\"\",IF(FIND(N45,INDIRECT($N$39))>0,1,0)),0)","v":0},78.34,"LX",0,{"$f":"IF(R45=1,4.89,4.57)*2","v":9.14},"Yes",{"$f":"IFERROR(IF(ISBLANK(T45),\"\",IF(FIND(T45,INDIRECT($T$39))>0,1,0)),0)","v":0},{"$f":"IF(AND(R45=1,U45=1),2,IF(AND(R45=0,U45=1),3,0))","v":0}]
[null,null,{"$f":"IFERROR(IF(AND(T_MinWidth[[#This Row],[System]]=1,FIND(T_MinWidth[[#This Row],[Description]],i_Booster)>0),1,\"\"),\"\")","v":""},null,null,null,null,497,5,0,"MICRO",0,340,"Universal",{"$f":"IFERROR(IF(ISBLANK(N46),\"\",IF(FIND(N46,INDIRECT($N$39))>0,1,0)),0)","v":0},142.69,"LX",0,9.14,"Yes",0,0]
[null,null,{"$f":"IFERROR(IF(AND(i_SystemType=T_MinWidth[[#This Row],[System]],FIND(T_MinWidth[[#This Row],[Description]],i_Control)>0),1,\"\"),\"\")","v":""},null,null,null,null,479,5,0,"MICRO",0,340,"Short",{"$f":"IFERROR(IF(ISBLANK(N47),\"\",IF(FIND(N47,INDIRECT($N$39))>0,1,0)),0)","v":0},124.95,"LX",0,9.14,"Yes",0,0]
[null,null,{"$f":"IFERROR(IF(AND(i_SystemType=T_MinWidth[[#This Row],[System]],FIND(T_MinWidth[[#This Row],[Description]],i_Control)>0),1,\"\"),\"\")","v":""},null,null,null,null,597,5,0,"SMALL",0,542,null,{"$f":"IF(i_IdlerType=\"Skyline Pin End 1.5\"\"\",1,0)","v":0},41.15,"LX",0,{"$f":"IF(R48=1,4.89,4.57)*2","v":9.14},"Yes",{"$f":"IFERROR(IF(ISBLANK(T48),\"\",IF(FIND(T48,INDIRECT($T$39))>0,1,0)),0)","v":0},{"$f":"IF(AND(R48=1,U48=1),2,IF(AND(R48=0,U48=1),3,0))","v":0}]
[null,null,{"$f":"IFERROR(IF(AND(i_SystemType=T_MinWidth[[#This Row],[System]],FIND(T_MinWidth[[#This Row],[Description]],i_Control)>0),1,\"\"),\"\")","v":""},null,null,null,null,634,5,0,"SMALL",0,542,"Heavy",{"$f":"IFERROR(IF(ISBLANK(N49),\"\",IF(FIND(N49,INDIRECT($N$39))>0,1,0)),0)","v":0},78.34,"LX",0,{"$f":"IF(R49=1,4.89,4.57)*2","v":9.14},"Yes",{"$f":"IFERROR(IF(ISBLANK(T49),\"\",IF(FIND(T49,INDIRECT($T$39))>0,1,0)),0)","v":0},{"$f":"IF(AND(R49=1,U49=1),2,IF(AND(R49=0,U49=1),3,0))","v":0}]
[null,null,null,null,null,null,null,699,5,0,"SMALL",0,542,"Universal",{"$f":"IFERROR(IF(ISBLANK(N50),\"\",IF(FIND(N50,INDIRECT($N$39))>0,1,0)),0)","v":0},142.69,"LX",0,9.14,"Yes",0,0]
[null,null,{"$f":"IFERROR(IF(AND(i_SystemType=T_MinWidth[[#This Row],[System]],FIND(T_MinWidth[[#This Row],[Description]],i_Control)>0),1,\"\"),\"\")","v":""},null,null,null,null,681,5,0,"SMALL",0,542,"Short",{"$f":"IFERROR(IF(ISBLANK(N51),\"\",IF(FIND(N51,INDIRECT($N$39))>0,1,0)),0)","v":0},124.95,"LX",0,9.14,"Yes",0,0]
[null,null,null,null,null,null,null,597,5,0,"LIGHT",0,542,null,{"$f":"IF(i_IdlerType=\"Skyline Pin End 1.5\"\"\",1,0)","v":0},41.15,"LX",0,9.14,"Yes",0,0]
[null,null,null,null,null,null,null,634,5,{"$f":"L53*O53","v":0},"LIGHT",0,542,"Heavy",{"$f":"IFERROR(IF(ISBLANK(N53),\"\",IF(FIND(N53,INDIRECT($N$39))>0,1,0)),0)","v":0},78.34,"LX",0,9.14,"Yes",0,0]
[null,"T_ConvertTube",null,null,null,null,null,699,5,0,"LIGHT",0,542,"Universal",{"$f":"IFERROR(IF(ISBLANK(N54),\"\",IF(FIND(N54,INDIRECT($N$39))>0,1,0)),0)","v":0},142.69,"LX",0,9.14,"Yes",0,0]
[null,"Input","Output",null,null,null,null,681,5,0,"LIGHT",0,542,"Short",{"$f":"IFERROR(IF(ISBLANK(N55),\"\",IF(FIND(N55,INDIRECT($N$39))>0,1,0)),0)","v":0},124.95,"LX",0,9.14,"Yes",0,0]
[null,null,null,null,null,null,null,907,5,0,"MEDIUM",0,852,null,{"$f":"IF(i_IdlerType=\"Skyline Pin End 1.5\"\"\",1,0)","v":0},41.15,"LX",0,9.14,"Yes",0,0]
[null,null,null,null,null,null,null,944,5,0,"MEDIUM",0,852,"Heavy",{"$f":"IFERROR(IF(ISBLANK(N57),\"\",IF(FIND(N57,INDIRECT($N$39))>0,1,0)),0)","v":0},78.34,"LX",0,9.14,"Yes",0,0]
[null,null,null,null,null,null,null,1009,5,0,"MEDIUM",0,852,"Universal",{"$f":"IFERROR(IF(ISBLANK(N58),\"\",IF(FIND(N58,INDIRECT($N$39))>0,1,0)),0)","v":0},142.69,"LX",0,9.14,"Yes",0,0]
[null,null,null,null,null,null,null,991,5,0,"MEDIUM",0,852,"Short",{"$f":"IFERROR(IF(ISBLANK(N59),\"\",IF(FIND(N59,INDIRECT($N$39))>0,1,0)),0)","v":0},124.95,"LX",0,9.14,"Yes",0,0]
[null,null,null,null,null,null,null,1007,5,0,"HEAVY",0,952,null,{"$f":"IF(i_IdlerType=\"Skyline Pin End 1.5\"\"\",1,0)","v":0},41.15,"LX",0,9.14,"Yes",0,0]
[null,"T_ConvertBooster",null,null,null,null,null,1044,5,0,"HEAVY",0,952,"Heavy",{"$f":"IFERROR(IF(ISBLANK(N61),\"\",IF(FIND(N61,INDIRECT($N$39))>0,1,0)),0)","v":0},78.34,"LX",0,9.14,"Yes",0,0]
[null,"ID","D_Show","D_Booster",null,null,null,1109,5,0,"HEAVY",0,952,"Universal",{"$f":"IFERROR(IF(ISBLANK(N62),\"\",IF(FIND(N62,INDIRECT($N$39))>0,1,0)),0)","v":0},142.69,"LX",0,9.14,"Yes",0,0]
[null,"X","Compact","Compact",null,null,null,1091,5,0,"HEAVY",0,952,"Short",{"$f":"IFERROR(IF(ISBLANK(N63),\"\",IF(FIND(N63,INDIRECT($N$39))>0,1,0)),0)","v":0},124.95,"LX",0,9.14,"Yes",0,0]
[null,"A","Short","Short",null,null,"=\"Charts\"&\"_\"&i_SystemType&\"_\"&i_WeightBar&\"_\"&\"b\"&i_wbBallast"]
[null,"B","Light","Light"]
[null,"C","Standard","Standard"]
[null,"D","Heavy","Heavy"]
[null,"E","Extra Heavy","Extra Heavy"]
[null,"F","Dual Heavy","Dual Heavy"]
[null,"G"]
[null,"H"]
[]
[null,"T_ConvertSystemType"]
[null,"Input","Output"]
[null,"Zipscreen","_Zipscreen_"]
[]
[]
[]
[null,"o_BoosterTextRec","=\"Recommended Spring Size: \"&o_BoosterRec&\", Estimated Pre-turns: \"&o_BoosterPreturnRec"]
[]
[null,"=Indirect(\"Chart\"&INDEX(T_ConvertControlType[Output],MATCH(i_ControlType,T_ConvertControlType[Input],0))&INDEX(T_ConvertTube[Output],MATCH(i_Tube,T_ConvertTube[Input],0)))"]
[null,{"$f":"\"Chart\"&INDEX(T_ConvertSystemType[Output],MATCH(i_ControlType,T_ConvertSystemType[Input],0))&INDEX(T_ConvertTube[Output],MATCH(i_Tube,T_ConvertTube[Input],0))","v":{"$error":"#N/A"}}]
[]
[null,"=IF(i_Units=\"\",\"Blind Width\",\"Blind Width (\"&IFERROR(INDIRECT(\"o_WidthRange\"&i_Units)&\")\",\"\"))"]
[]
[null,"Fabric roll diameter"]
[null,"=((-Tube_OD+SQRT(Tube_OD^2-4*Fabric_Thickness*-Z6*1000/PI()))/(2*Fabric_Thickness)+IF(pwa=\"Yes\",1,0))*Fabric_Thickness*2+Tube_OD"]
[]
[]
[null,"Rec booster"]
[null,"'=INDEX(T_ConvertBooster[D_Show],MATCH(LEFT(INDEX(INDIRECT(\"Chart\"&INDEX(T_ConvertControlType[Output],MATCH(i_ControlType,T_ConvertControlType[Input],0))&INDEX(T_ConvertTube[Output],MATCH(i_Tube,T_ConvertTube[Input],0))),MATCH(C23,W12:W46,0),MATCH(C22,X11:BX11,0)),1),T_ConvertBooster[ID],0))"]
[]
[null,"rec preturns"]
[null,"=MID(INDEX(INDIRECT(\"Chart\"&INDEX(T_ConvertControlType[Output],MATCH(i_ControlType,T_ConvertControlType[Input],0))&INDEX(T_ConvertTube[Output],MATCH(i_Tube,T_ConvertTube[Input],0))),MATCH(C23,W12:W46,0),MATCH(C22,X11:BX11,0)),3,2)"]
[]
[null,"=INDEX(T_ConvertBooster[D_Booster],MATCH(o_BoosterRec,T_ConvertBooster[D_Show],0))"]
[]
[]
[]
[]
[]
[]
[null,"Max Width F56 <=",4000,"mm",{"$f":"IF(o_Widthmm<=C103,TRUE,FALSE)","v":true}]
[null,"SystemType","Zipscreen",null,{"$f":"IF(i_SystemType=C104,TRUE,FALSE)","v":false}]
[null,null,"F56",null,{"$f":"IF(AND(E103=TRUE,E104=TRUE),\"Preferred\",0)","v":0}]
[null,null,"F72",null,{"$f":"IF(AND(E103=FALSE,E104=TRUE),\"Preferred\",0)","v":0}]
[]
[null,null,{"$f":"IF(i_Location=\"US\",\"Recommended Hem Bar: \",\"Recommended Weight Bar: \")&INDEX(C105:C106,MATCH(\"Preferred\",E105:E106,0))","v":{"$error":"#N/A"}}]
[]
[]
[]
[]
[]
[null,null,null,"&\"Width Range: \"&INDIRECT(\"o_WidthRange\"&i_Units)&\"; \"&\"Drop Range: \"&INDIRECT(\"o_DropRange\"&i_Units)"]
[]
[]
[]
[null,null,null,"width drop"]
[null,null,null,"=IF(SUM(o_SizeWarningTrigger)>0, Warning2, IF(AND(o_BlindOutOfSpec=\"Yes\",i_Tube<>\"\",i_Width<>\"\",i_Drop<>\"\"),Warning1,\"\"))"]
[]
[]
[null,null,null,"weight bar rec:"]
[null,null,null,"=IFERROR(o_wbRec,\"\")"]
[]
[]
[null,null,null,"for booster rec"]
[null,null,null,"=IFERROR(IF(o_BoosterWarningTrigger1=1,o_BoosterWarning,o_BoosterTextRec),IFERROR(o_BoosterTextRec,\"If no booster recommendation is made, the blind may be outside specifications.\"))"]
[]
[]
[]
[]
[]
[null,"SLB660",null,null,"IDLER","SLB660"]
[null,4.57,952,5,41.58,4.57,{"$f":"SUM(B134:F134)","v":1007.7200000000001}]
[null,4.57,{"$f":"C134","v":952},5,78.34,4.57,{"$f":"SUM(B135:F135)","v":1044.48}]
[null,4.57,{"$f":"C134","v":952},5,142.69,4.57,1108.83]
[null,4.57,{"$f":"C134","v":952},5,124.95,4.57,1091.0899999999999]
[]
[null,"LX Skyline"]
[null,4.8899999999999997,{"$f":"(B140-B134)*2","v":0.63999999999999879}]
[]
[null,"HEAVY",952]
[null,"LIGHT",542]
[null,"MED",852]
[null,"MINI",340]
[]
[]
[null,"STD 1.5\"",41.15]
[null,"HD 1.5\"",78.34]
[null,"Universal Limiter",142.69]
[null,"Short Limiter",124.95]

{"sheet":"Calc_Torque","index":7,"n_rows":26,"n_cols":16,"rows_kept":26,"cut":false,"hidden":true,"merged":[]}
[]
[]
[]
[null,"Fabric Density",0.39,"kg/m²",null,"Total Fabric Length",{"$f":"IF(C17=\"Yes\",C7+PI()*C8/1000,C7)","v":4.1358738822677585},"m",null,null,null,"mm","Nm",null,"Nm"]
[null,"Fabric Thickness",0.6,"mm",null,"Fabric mass per metre of drop",{"$f":"C6*C4","v":1.56},"kg/m",null,null,null,"Diameter","Holding Capacity","Gear Ratio","Friction"]
[null,"Width",4,"m",null,"Blind mass per metre of width",{"$f":"C10+C11","v":0.28999999999999998},"kg/m",null,null,"RB09",46,1,1,0.2]
[null,"Drop",4,"m",null,"TOTAL Fabric + Weight Bar mass",{"$f":"((C4*G4)+G6)*C6*g","v":74.673359544672877},"N"]
[null,"Tube OD",43.25,"mm",null,null,{"$f":"G7/g","v":7.6119632563377033},"kg"]
[null,"Tube Mass",0.41,"kg/m",null,"Tube Rotations",{"$f":"(-C8+SQRT(C8^2+4*C5*C7*1000/PI()))/(2*C5)","v":22.448226853522343},"Turns",null,null,null,"mm","kg/m","(mm⁴)","(Nm²)"]
[null,"Weight Bar Mass",0.28999999999999998,"kg/m",null,"TOTAL Fabric + wb + tube mass",{"$f":"((C4*G4)+G6+C9)*C6*g","v":90.76175954467287},"N",null,null,null,"OD","Mass/m","I_min","EI"]
[null,"Ballast Mass",0,"kg/m",null,null,{"$f":"G10/g","v":9.251963256337703},"kg",null,null,"S45 LIGHT",43.25,0.41,33442,2274]
[null,"Booster",0,"Nm",null,null,{"$f":"CONVERT(G11,\"kg\",\"lbm\")","v":20.397087491435766},"lbs"]
[null,"Control Capacity",1,"Nm",null,"Drop (function of # turns)",{"$f":"G9*PI()*C8+PI()*C5*G9^2","v":3999.9999999999986},"mm"]
[null,null,null,null,null,"Control Capacity",{"$f":"ROUND(((C13+C12)/((C8/2/1000)))/g,2)","v":4.71},"kg",null,null,null,"(mm²)","kg/m","(mm⁴)","(mm⁴)","(Nm²)"]
[null,null,null,null,null,"Friction",null,null,null,null,null,"CSA","Mass/m","I_y","I_x","EI"]
[null,null,null,null,null,"Friction additive",null,"Nm",null,null,"D30",107,0.28999999999999998,9647,2486,656]
[null,"Pre-wrap","Yes",null,null,"T_Max",null,"Nm"]
[]
[null,"Max Roll Diameter",105,"mm",null,null,null,null,null,null,null,null,"kg/m"]
[null,"Max Area",50,"m²",null,null,null,null,null,null,null,null,"Mass/m"]
[null,"Link System Capacity",3,"Nm",null,null,null,null,null,null,"BALLAST",null,0.97]
[]
[]
[null,null,null,null,null,null,null,null,null,null,null,null,"T_Max"]
[null,null,null,null,null,null,null,null,null,null,null,null,"Nm"]
[null,null,null,null,null,null,null,null,null,null,"BOOSTER",null,0]

{"sheet":"Ctrl_SpringData","index":8,"n_rows":40,"n_cols":25,"rows_kept":40,"cut":false,"hidden":true,"merged":[]}
[]
[]
[null,null,null,null,{"$f":"IF(AND(o_Widthmm>D4,o_Widthmm<=E4),1,0)","v":0},0,0,0,0,0,0,0,0,0,0,0,0,0,0,0,0,0,0,0,0]
[null,null,"Up to",400,500,600,700,800,900,1000,1100,1200,1300,1400,1500,1600,1700,1800,1900,2000,2100,2200,2300,2400,4000]
[null,null,800,"8/3/Mini","8/3/Mini","14/8/L","14/8/L","14/7/L","16/7/L","15/6/L","10/6/M","10/6/M","10/6/M","11/6/M","12/6/M","12/6/M","12/6/M","13/6/M","13/6/M","14/7/M","14/7/M","14/7/M","16/9/M","16/9/M"]
[null,{"$f":"IF(AND(o_Dropmm>C5,o_Dropmm<=C6),1,0)","v":0},1000,"8/4/Mini","8/3/Mini","14/8/L","14/8/L","15/7/L","17/7/L","17/7/L","10/8/M","11/8/M","11/8/M","11/8/M","12/8/M","12/8/M","12/8/M","13/8/M","13/8/M","14/8/M","14/8/M","14/8/M","16/9/M","16/9/M"]
[null,0,1200,"9/5/Mini","9/4/Mini","15/9/L","15/9/L","16/8/L","17/8/L","17/7/L","10/12/M","11/10/M","11/10/M","11/10/M","12/10/M","12/10/M","12/10/M","14/10/M","14/10/M","14/9/M","14/9/M","15/9/M","16/10/M","16/10/M"]
[null,0,1400,"X","9/4/Mini","15/9/L","15/9/L","17/8/L","18/8/L","18/8/L","10/14/M","11/12/M","11/12/M","11/12/M","12/12/M","14/12/M","14/12/M","16/12/M","16/12/M","14/10/M","14/10/M","16/10/M","16/10/M","16/10/M"]
[null,0,1600,"X","9/5/Mini","16/10/L","16/10/L","17/9/L","18/9/L","18/8/L","11/16/M","11/14/M","11/14/M","11/14/M","12/14/M","15/14/M","15/14/M","16/14/M","16/14/M","14/11/M","14/11/M","16/11/M","17/11/M","17/11/M"]
[null,0,1800,"X","9/5/Mini","16/10/L","16/10/L","17/9/L","18/9/L","19/9/L","11/18/M","11/16/M","11/16/M","11/16/M","12/16/M","16/16/M","16/16/M","17/16/M","17/16/M","16/12/M","16/12/M","17/12/M","17/11/M","17/11/M"]
[null,0,2000,"X","X","17/11/L","17/11/L","17/10/L","19/10/L","19/9/L","11/20/M","12/18/M","12/18/M","14/18/M","14/18/M","17/18/M","17/18/M","17/18/M","17/18/M","17/13/M","17/13/M","17/13/M","18/12/M","18/12/M"]
[null,0,2200,"X","X","18/11/L","18/11/L","17/10/L","20/10/L","20/10/L","12/22/M","12/20/M","12/20/M","15/20/M","15/20/M","17/20/M","17/20/M","19/20/M","19/20/M","18/14/M","18/14/M","17/14/M","18/12/M","18/12/M"]
[null,0,2400,"X","X","18/12/L","18/12/L","18/11/L","20/11/L","20/10/L","12/23/M","13/22/M","13/22/M","15/22/M","15/22/M","19/22/M","19/22/M","19/22/M","19/22/M","18/15/M","18/15/M","18/15/M","18/13/M","18/13/M"]
[null,0,2600,"X","X","18/12/L","18/12/L","18/11/L","22/11/L","22/11/L","12/24/M","13/24/M","13/24/M","15/22/M","15/22/M","19/22/M","19/22/M","19/22/M","19/22/M","19/16/M","19/16/M","18/16/M","18/13/M","18/13/M"]
[null,0,2800,"X","X","18/13/L","18/13/L","19/12/L","22/12/L","22/11/L","12/25/M","13/24/M","13/24/M","15/24/M","15/24/M","20/24/M","20/24/M","19/24/M","21/24/M","19/17/M","19/17/M","18/17/M","18/14/M","18/14/M"]
[null,0,3000,"X","X","X","18/13/L","19/12/L","22/12/L","22/12/L","X","14/25/M","14/25/M","15/24/M","15/24/M","21/24/M","20/24/M","20/24/M","21/24/M","19/18/M","19/18/M","20/18/M","18/14/M","18/14/M"]
[null,0,3200,"X","X","X","X","19/13/L","22/13/L","22/13/L","X","X","X","X","15/25/M","21/25/M","21/25/M","20/25/M","21/25/M","19/19/M","19/19/M","20/19/M","18/14/M","18/14/M"]
[null,0,3400,"X","X","X","X","19/13/L","X","X","X","X","X","X","15/25/M","21/25/M","21/25/M","21/25/M","21/25/M","20/20/M","20/20/M","21/20/M","X","X"]
[]
[null,null,"Weight Bar requirement (g/m)",500,500,350,350,350,350,350,350,350,350,350,350,350,350,350,350,350,350,350,350,350,350]
[]
[null,null,"Cell Out",{"$f":"IFERROR(IF(AND(i_Width<>\"\",i_Drop<>\"\",SUM(BlindSize)>0),INDEX(D5:X18,MATCH(1,B5:B18,0),MATCH(1,D3:X3,0))),\"X\")","v":false}]
[]
[null,null,"Position",{"$f":"_xlfn.TEXTSPLIT(o_SystemSpecChart,,\"/\")","v":"FALSE"},null,"Warning: ",{"$f":"IF(o_SystemSpecChart=\"X\",\"Outside Spring Capacity, refer system specifications.\",\"\")","v":""},null,null,null,null,"Mini","MINI"]
[null,null,"Preturns",null,null,null,null,null,null,null,null,"L","LIGHT"]
[null,null,"Spring",null,null,null,{"$f":"INDEX($M$24:$M$26,MATCH($D$26,$L$24:$L$26,0))","v":{"$error":"#N/A"}},null,null,null,null,"M","MEDIUM"]
[]
[null,null,"Weight lookup",{"$f":"IFERROR(INDEX($D$20:$Y$20,,MATCH(1,$D$3:$Y$3,0))/1000,\"\")","v":""},"kg/m",null,null,"grams:pounds"]
[null,null,"Total Rec wb mass",{"$f":"(D28/1000)*o_Widthmm","v":{"$error":"#VALUE!"}},"kg",null,null,2.2040000000000002]
[null,null,"Total Rec wb mass",{"$f":"(D29)*c_kgPounds","v":{"$error":"#VALUE!"}},"lbs"]
[]
[null,null,"D30 is 306 g / m"]
[null,null,null,null,null,null,null,{"$f":"IF(o_SystemSpecChart=\"X\", \"Outside spring specifications.\", \"Recommended Spring: \"&o_SpringSize)","v":{"$error":"#N/A"}}]
[]
[]
[]
[]
[]
[]
[null,"NOTES FOR BOM",{"$f":"IF(o_SystemSpecChart=\"X\", \"Spring outside specifications.\", \"Recommended Spring Position: \"&o_SpringPosn&\"; Recommended Spring Pre-turns: \"&o_SpringPreturns)","v":"Recommended Spring Position: FALSE; Recommended Spring Pre-turns: "}]

{"sheet":"Ctrl_Limitations","index":9,"n_rows":76,"n_cols":42,"rows_kept":76,"cut":false,"hidden":true,"merged":[[2,26,2,41],[4,24,8,24],[4,25,8,25],[9,24,13,24],[9,25,13,25]]}
[]
[null,null,null,"Does",null,"Apply to "]
[null,null,null,null,null,null,null,null,null,null,null,null,null,null,null,null,null,null,null,null,null,null,null,null,"Enter DEPENDENCIES","SELECTION OPTIONS","CONFIGURATIONS"]
[null,null,null,null,null,null,null,null,null,null,null,null,null,null,null,null,null,null,null,null,null,null,null,null,null,{"$f":"MAX(AA4:AP4)","v":1},1,{"$f":"SUM(COUNTIF(AB5:AB19,$Y$5:$Y$19))","v":0},{"$f":"SUM(COUNTIF(AC5:AC19,$Y$5:$Y$19))","v":0},{"$f":"SUM(COUNTIF(AD5:AD19,$Y$5:$Y$19))","v":0},{"$f":"SUM(COUNTIF(AE5:AE19,$Y$5:$Y$19))","v":0},{"$f":"SUM(COUNTIF(AF5:AF19,$Y$5:$Y$19))","v":0},{"$f":"SUM(COUNTIF(AG5:AG19,$Y$5:$Y$19))","v":0},{"$f":"SUM(COUNTIF(AH5:AH19,$Y$5:$Y$19))","v":0},{"$f":"SUM(COUNTIF(AI5:AI19,$Y$5:$Y$19))","v":0},{"$f":"SUM(COUNTIF(AJ5:AJ19,$Y$5:$Y$19))","v":0},{"$f":"SUM(COUNTIF(AK5:AK19,$Y$5:$Y$19))","v":0},{"$f":"SUM(COUNTIF(AL5:AL19,$Y$5:$Y$19))","v":0},{"$f":"SUM(COUNTIF(AM5:AM19,$Y$5:$Y$19))","v":0},{"$f":"SUM(COUNTIF(AN5:AN19,$Y$5:$Y$19))","v":0},{"$f":"SUM(COUNTIF(AO5:AO19,$Y$5:$Y$19))","v":0},{"$f":"SUM(COUNTIF(AP5:AP19,$Y$5:$Y$19))","v":0}]
[null,null,null,null,null,null,null,null,null,null,null,null,null,null,null,null,null,null,null,null,null,null,null,null,{"$f":"INDIRECT(\"i_\"&SUBSTITUTE($Z5,\" \",\"\"))","v":0},"System Type"]
[]
[]
[]
[]
[null,null,null,null,null,null,null,null,null,null,null,null,null,null,null,null,null,null,null,null,null,null,null,null,{"$f":"INDIRECT(\"i_\"&SUBSTITUTE($Z10,\" \",\"\"))","v":0},"Installation Type"]
[]
[]
[]
[]
[]
[]
[]
[]
[]
[]
[]
[]
[]
[null,null,null,null,null,null,null,null,null,null,null,null,null,null,null,null,null,null,null,null,null,null,null,null,"Type","Limitation Value",{"$f":"IF(AA4<>$Z$4,0,1)","v":1},0,0,0,0,0,0,0,0,0,0,0,0,0,0,0]
[null,null,null,null,null,null,null,null,null,null,null,null,null,null,null,null,null,null,null,null,null,null,null,null,"Width_Max",{"$f":"INDEX(AA25:AP25,0,MATCH(1,$AA$24:$AP$24,0))","v":3000},{"$f":"Ctrl_Recommendations!E4","v":3000}]
[null,null,null,null,null,null,null,null,null,null,null,null,null,null,null,null,null,null,null,null,null,null,null,null,"Drop_Max",3000,{"$f":"Ctrl_Recommendations!E5","v":3000}]
[null,null,null,null,null,null,null,null,null,null,null,null,null,null,null,null,null,null,null,null,null,null,null,null,"Area_Max",0]
[null,null,null,null,null,null,null,null,null,null,null,null,null,null,null,null,null,null,null,null,null,null,null,null,"Drop_Max_hard",3000,{"$f":"AA26","v":3000}]
[null,null,null,null,null,null,null,null,null,null,null,null,null,null,null,null,null,null,null,null,null,null,null,null,null,0]
[null,null,null,null,null,null,null,null,null,null,null,null,null,null,null,null,null,null,null,null,null,null,null,null,null,0]
[null,null,null,null,null,null,null,null,null,null,null,null,null,null,null,null,null,null,null,null,null,null,null,null,null,0]
[null,null,null,null,null,null,null,null,null,null,null,null,null,null,null,null,null,null,null,null,null,null,null,null,null,0]
[null,null,null,null,null,null,null,null,null,null,null,null,null,null,null,null,null,null,null,null,null,null,null,null,null,0]
[null,null,null,{"$f":"COUNTA($D$44:$D$69)","v":16},null,null,null,null,null,null,null,null,null,null,null,null,null,null,null,null,null,null,null,null,null,0]
[null,null,null,null,null,null,null,null,null,null,null,null,null,null,null,null,null,null,null,null,null,null,null,null,null,0]
[null,null,null,null,null,null,null,null,null,null,null,null,null,null,null,null,null,null,null,null,null,null,null,null,null,0]
[null,null,null,null,null,null,null,null,null,null,null,null,null,null,null,null,null,null,null,null,null,null,"weight bar, ",null,null,0]
[null,null,null,null,null,null,null,null,null,null,null,null,null,null,null,null,null,null,null,null,null,null,"tubes?"]
[]
[]
[null,null,null,null,null,null,null,null,null,null,null,null,null,null,null,null,null,"Lookup",null,null,null,null,null,null,"Recommendations?"]
[null,null,null,null,null,null,null,null,null,null,null,null,null,null,null,null,null,"Deduction"]
[null,null,null,{"$f":"Y25","v":"Width_Max"},{"$f":"Y26","v":"Drop_Max"},{"$f":"Y27","v":"Area_Max"},{"$f":"Y28","v":"Drop_Max_hard"},{"$f":"Y29","v":0},{"$f":"Y30","v":0},{"$f":"Y31","v":0},{"$f":"Y32","v":0},{"$f":"Y33","v":0},{"$f":"Y34","v":0},{"$f":"Y35","v":0},{"$f":"Y36","v":0},{"$f":"Y37","v":0},null,"Modifiers",null,"QTY","ON/OFF",null,"Comments",null,null,null,{"$f":"IF(AA4<>$Z$4,0,1)","v":1},0,0,0,0,0,0,0,0,0,0,0,0,0,0,0]
[null,null,null,0,0,1,0,0,0,0,0,0,0,0,0,0,null,{"$f":"INDEX($AA$44:$AP$59,0,MATCH(1,$AA$43:$AP$43,0))","v":0},null,1,{"$f":"IFERROR(IF(ISBLANK(Y44),\"\",IF(FIND(Z44,INDIRECT(\"i_\"&$Y44))>0,1,0)),0)","v":0},null,null,null,"Tube","AL HD"]
[null,null,null,0,1,0,0,0,0,0,0,0,0,0,0,0,null,0,null,1,0,null,"if box120 cover",null,"InstallationType","Cover"]
[null,null,null,0,1,0,0,0,0,0,0,0,0,0,0,0,null,0,null,1,0,null,null,null,"InstallationType","Box 190"]
[null,null,null,0,1,0,0,0,0,0,0,0,0,0,0,0,null,0,null,1,0,null,null,null,"InstallationType","Box 190"]
[null,null,null,0,0,0,0,0,0,0,0,0,0,0,0,0,null,0,null,1,""]
[null,null,null,0,0,0,0,0,0,0,0,0,0,0,0,0,null,0,null,1,""]
[null,null,null,0,0,0,0,0,0,0,0,0,0,0,0,0,null,0,null,1,""]
[null,null,null,0,0,0,0,0,0,0,0,0,0,0,0,0,null,0,null,1,""]
[null,null,null,0,0,0,0,0,0,0,0,0,0,0,0,0,null,0,null,1,""]
[null,null,null,0,0,0,0,0,0,0,0,0,0,0,0,0,null,0,null,1,""]
[null,null,null,0,0,0,0,0,0,0,0,0,0,0,0,0,null,0,null,1,""]
[null,null,null,0,0,0,0,0,0,0,0,0,0,0,0,0,null,0,null,1,""]
[null,null,null,0,0,0,0,0,0,0,0,0,0,0,0,0,null,0,null,1,""]
[null,null,null,0,0,0,0,0,0,0,0,0,0,0,0,0,null,0,null,1,""]
[null,null,null,0,0,0,0,0,0,0,0,0,0,0,0,0,null,0,null,1,""]
[null,null,null,0,0,0,0,0,0,0,0,0,0,0,0,0,null,0,null,1,""]
[]
[]
[]
[null,null,null,null,null,null,null,null,null,null,null,null,null,null,null,null,null,null,null,null,null,null,null,null,"Type","Limit",{"$f":"IF(AA4<>$Z$4,0,1)","v":1},0,0,0,0,0,0,0,0,0,0,0,0,0,0,0]
[null,null,null,null,null,null,null,null,null,null,null,null,null,null,null,null,null,null,null,null,null,null,null,null,{"$f":"Y25","v":"Width_Max"},{"$f":"INDEX(AA64:AP64,0,MATCH(1,$AA$24:$AP$24,0))","v":3000},{"$f":"IFERROR(IF(AA$63=0,\"\",AA25+SUMPRODUCT($U$44:$U$59,$T$44:$T$59,$R$44:$R$59,OFFSET($D$43,1,MATCH($Y64,$D$43:$P$43,0)-1,$D$34,1))),\"\")","v":3000},"","","","","","","","","","","","","","",""]
[null,null,null,null,null,null,null,null,null,null,null,null,null,null,null,null,null,null,null,null,null,null,null,null,"Drop_Max",{"$f":"INDEX(AA65:AP65,0,MATCH(1,$AA$24:$AP$24,0))","v":3000},{"$f":"IFERROR(IF(AA$63=0,\"\",AA26+SUMPRODUCT($U$44:$U$59,$T$44:$T$59,$R$44:$R$59,OFFSET($D$43,1,MATCH($Y65,$D$43:$P$43,0)-1,$D$34,1))),\"\")","v":3000},"","","","","","","","","","","","","","",""]
[null,null,null,null,null,null,null,null,null,null,null,null,null,null,null,null,null,null,null,null,null,null,null,null,"Area_Max",{"$f":"INDEX(AA66:AP66,0,MATCH(1,$AA$24:$AP$24,0))","v":0},{"$f":"IFERROR(IF(AA$63=0,\"\",AA27+SUMPRODUCT($U$44:$U$59,$T$44:$T$59,$R$44:$R$59,OFFSET($D$43,1,MATCH($Y66,$D$43:$P$43,0)-1,$D$34,1))),\"\")","v":0},"","","","","","","","","","","","","","",""]
[null,null,null,null,null,null,null,null,null,null,null,null,null,null,null,null,null,null,null,null,null,null,null,null,"Drop_Max_hard",{"$f":"INDEX(AA67:AP67,0,MATCH(1,$AA$24:$AP$24,0))","v":3000},{"$f":"IFERROR(IF(AA$63=0,\"\",AA28+SUMPRODUCT($U$44:$U$59,$T$44:$T$59,$R$44:$R$59,OFFSET($D$43,1,MATCH($Y67,$D$43:$P$43,0)-1,$D$34,1))),\"\")","v":3000},"","","","","","","","","","","","","","",""]
[null,null,null,null,null,null,null,null,null,null,null,null,null,null,null,null,null,null,null,null,null,null,null,null,0,{"$f":"INDEX(AA68:AP68,0,MATCH(1,$AA$24:$AP$24,0))","v":0},{"$f":"IFERROR(IF(AA$63=0,\"\",AA29+SUMPRODUCT($U$44:$U$59,$T$44:$T$59,$R$44:$R$59,OFFSET($D$43,1,MATCH($Y68,$D$43:$P$43,0)-1,$D$34,1))),\"\")","v":0},"","","","","","","","","","","","","","",""]
[null,null,null,null,null,null,null,null,null,null,null,null,null,null,null,null,null,null,null,null,null,null,null,null,0,{"$f":"INDEX(AA69:AP69,0,MATCH(1,$AA$24:$AP$24,0))","v":0},{"$f":"IFERROR(IF(AA$63=0,\"\",AA30+SUMPRODUCT($U$44:$U$59,$T$44:$T$59,$R$44:$R$59,OFFSET($D$43,1,MATCH($Y69,$D$43:$P$43,0)-1,$D$34,1))),\"\")","v":0},"","","","","","","","","","","","","","",""]
[null,null,null,null,null,null,null,null,null,null,null,null,null,null,null,null,null,null,null,null,null,null,null,null,0,{"$f":"INDEX(AA70:AP70,0,MATCH(1,$AA$24:$AP$24,0))","v":0},{"$f":"IFERROR(IF(AA$63=0,\"\",AA31+SUMPRODUCT($U$44:$U$59,$T$44:$T$59,$R$44:$R$59,OFFSET($D$43,1,MATCH($Y70,$D$43:$P$43,0)-1,$D$34,1))),\"\")","v":0},"","","","","","","","","","","","","","",""]
[null,null,null,null,null,null,null,null,null,null,null,null,null,null,null,null,null,null,null,null,null,null,null,null,0,{"$f":"INDEX(AA71:AP71,0,MATCH(1,$AA$24:$AP$24,0))","v":0},{"$f":"IFERROR(IF(AA$63=0,\"\",AA32+SUMPRODUCT($U$44:$U$59,$T$44:$T$59,$R$44:$R$59,OFFSET($D$43,1,MATCH($Y71,$D$43:$P$43,0)-1,$D$34,1))),\"\")","v":0},"","","","","","","","","","","","","","",""]
[null,null,null,null,null,null,null,null,null,null,null,null,null,null,null,null,null,null,null,null,null,null,null,null,0,{"$f":"INDEX(AA72:AP72,0,MATCH(1,$AA$24:$AP$24,0))","v":0},{"$f":"IFERROR(IF(AA$63=0,\"\",AA33+SUMPRODUCT($U$44:$U$59,$T$44:$T$59,$R$44:$R$59,OFFSET($D$43,1,MATCH($Y72,$D$43:$P$43,0)-1,$D$34,1))),\"\")","v":0},"","","","","","","","","","","","","","",""]
[null,null,null,null,null,null,null,null,null,null,null,null,null,null,null,null,null,null,null,null,null,null,null,null,0,{"$f":"INDEX(AA73:AP73,0,MATCH(1,$AA$24:$AP$24,0))","v":0},{"$f":"IFERROR(IF(AA$63=0,\"\",AA34+SUMPRODUCT($U$44:$U$59,$T$44:$T$59,$R$44:$R$59,OFFSET($D$43,1,MATCH($Y73,$D$43:$P$43,0)-1,$D$34,1))),\"\")","v":0},"","","","","","","","","","","","","","",""]
[null,null,null,null,null,null,null,null,null,null,null,null,null,null,null,null,null,null,null,null,null,null,null,null,{"$f":"Y36","v":0},{"$f":"INDEX(AA74:AP74,0,MATCH(1,$AA$24:$AP$24,0))","v":0},{"$f":"IFERROR(IF(AA$63=0,\"\",AA36+SUMPRODUCT($U$44:$U$59,$T$44:$T$59,$R$44:$R$59,OFFSET($D$43,1,MATCH($Y74,$D$43:$P$43,0)-1,$D$34,1))),\"\")","v":0},"","","","","","","","","","","","","","",""]
[null,null,null,null,null,null,null,null,null,null,null,null,null,null,null,null,null,null,null,null,null,null,null,null,{"$f":"Y37","v":0},{"$f":"INDEX(AA75:AP75,0,MATCH(1,$AA$24:$AP$24,0))","v":0},{"$f":"IFERROR(IF(AA$63=0,\"\",AA37+SUMPRODUCT($U$44:$U$59,$T$44:$T$59,$R$44:$R$59,OFFSET($D$43,1,MATCH($Y75,$D$43:$P$43,0)-1,$D$34,1))),\"\")","v":0},"","","","","","","","","","","","","","",""]
[null,null,null,null,null,null,null,null,null,null,null,null,null,null,null,null,null,null,null,null,null,null,null,null,{"$f":"Y38","v":0}]

{"sheet":"Calc_Reference","index":10,"n_rows":54,"n_cols":65,"rows_kept":54,"cut":false,"hidden":true,"merged":[[47,51,48,51],[44,51,45,51],[6,45,6,46],[30,1,30,3],[45,1,45,3],[52,1,52,3],[6,25,6,27],[6,29,6,32],[6,34,6,38],[6,40,6,43],[10,1,10,3],[11,1,11,3],[13,1,13,3],[6,20,6,23],[1,1,1,3],[6,16,6,18],[6,13,6,14],[8,1,8,3],[9,1,9,3]]}
[]
[null,"Input Constants"]
[null,"Maximum User Effort",null,"kg",null,null,null,null,null,null,null,null,null,null,null,null,null,null,null,null,null,null,null,null,null,null,null,null,null,null,null,null,null,null,null,null,null,null,null,null,null,null,null,null,null,null,null,null,null,null,null,"Selected Fabric",{"$f":"i_FabricSelection","v":0}]
[null,"Tube Deflection Limit (internal)",null,"mm/m",null,null,null,null,null,null,null,null,null,null,null,null,null,null,null,null,null,null,null,null,null,null,null,null,null,null,null,null,null,null,null,null,null,null,null,null,null,null,null,null,null,null,null,null,null,null,null,"lookup thickness",{"$f":"INDEX(T_FabricData[Thickness],MATCH(i_FabricSelection,T_FabricData[DESCRIPTION],0))","v":{"$error":"#N/A"}},"mm",null,null,null,null,null,null,null,null,"#6 zip",1.45,"mm"]
[null,"Tube Deflection Limit (external)",null,"mm/m",null,null,null,null,null,null,null,null,null,null,null,null,null,null,null,null,null,null,null,null,null,null,null,null,null,null,null,null,null,null,null,null,null,null,null,null,null,null,null,null,null,null,null,null,null,null,null,"lookup density",{"$f":"INDEX(T_FabricData[Density],MATCH(i_FabricSelection,T_FabricData[DESCRIPTION],0))","v":{"$error":"#N/A"}},"gsm"]
[null,"Zip Thickness",null,"mm"]
[null,null,null,null,null,null,null,null,null,null,null,null,null,"Live Data",null,null,"Bottom Tube",null,null,null,"Top Tube",null,null,null,null,"Boosters",null,null,null,"No Boosters",null,null,null,null,"Bottom Booster Only (motor)",null,null,null,null,null,"Including Both Boosters \n(as nominated in inputs)",null,null,null,null,"* Safety Factor",null,null,null,null,null,"Deflection Limit internal",{"$f":"o_BlindWidthm*Deflection_Limit_Int","v":0},"mm"]
[null,null,null,null,null,null,null,null,null,null,null,null,null,"Bottom Tube # Rotations","Lift Height \n(m)",null,"Load \n(N)","Active Diameter (mm)","Radius \n(mm)",null,"Top Tube # Rotations","Load \n(N)","Active Spool Diameter\n(mm)","Spool Radius\n(mm)",null,"Spring Booster Top Torque (Nm)","Spring Booster Bottom Torque (Nm)","Booster Equivalent Force \n(N)",null,"Top Tube/Spool Torque Required \n(Nm)","Control Torque Required @ Ratio + FRICTION\n(Nm)","User Effort\nLIFTING\n(kg)","User Effort\nLOWERING\n(kg)",null,"Top Tube Load \n(N)","Top Tube Torque\n(Nm)","Control Torque Required (Nm)","User Effort\nLIFTING\n(kg)","User Effort\nLOWERING\n(kg)",null,"Top Tube/Spool Torque Required \n(Nm)","Control Torque Required @ Ratio\n(Nm)","User Effort\nLIFTING\n(kg)","User Effort\nLOWERING\n(kg)",null,"User Effort\nLIFTING\n(kg)","User Effort\nLOWERING\n(kg)",null,null,null,null,"Deflection Limit external",{"$f":"o_BlindWidthm*Deflection_Limit_Ext","v":0},"mm"]
[null,"Material Data",null,null,"kg/m³","GPa",null,null,null,null,null,null,null,0,0,null,{"$f":"9.81*((BT_UnitMass*o_BlindWidthm)+Fabric_TotalMass-Fabric_UnitMassLift*N9)","v":{"$error":"#NAME?"}},{"$f":"S9*2","v":{"$error":"#N/A"}},{"$f":"(Fabric_Roll_Diameter*0.5)-Fabric_Thickness*N9","v":{"$error":"#N/A"}},null,{"$f":"N9*(Spool_OD/R9)","v":{"$error":"#NAME?"}},{"$f":"9.81*((wb_UnitMass*o_BlindWidthm)+Fabric_UnitMassLift*N9)","v":{"$error":"#N/A"}},{"$f":"IF(D12>2.14,Spool_OD+8.4,IF(D12>1.38,Spool_OD+5.6,IF(D12>0.67,Spool_OD+2.8,Spool_OD)))","v":{"$error":"#NAME?"}},{"$f":"W9/2","v":{"$error":"#NAME?"}},null,{"$f":"(BoosterTop_Preturns+Rotations_Max-U9)*Booster_k","v":{"$error":"#NAME?"}},{"$f":"(Booster_PreTurns+N9)*BoosterBottom_k","v":{"$error":"#VALUE!"}},{"$f":"(Z9/(X9/1000)-(AA9/(S9/1000)))","v":{"$error":"#NAME?"}},null,{"$f":"V9*X9/1000","v":{"$error":"#N/A"}},{"$f":"(AD9/Control_Ratio)+Control_Friction","v":{"$error":"#N/A"}},{"$f":"(AE9/((Control_D/1000)/2))/9.81","v":{"$error":"#N/A"}},{"$f":"(Control_Friction/(Control_D/2/1000))/9.81","v":{"$error":"#NAME?"}},null,{"$f":"(V9+((Booster_PreTurns+N9)*BoosterBottom_k/(S9/1000)))","v":{"$error":"#N/A"}},{"$f":"(AI9*X9/1000)","v":{"$error":"#N/A"}},{"$f":"IF(AJ9<0,Control_Friction,(AJ9/Control_Ratio)+Control_Friction)","v":{"$error":"#N/A"}},{"$f":"(AJ9/((Control_D/1000)/2))/9.81","v":{"$error":"#N/A"}},{"$f":"(Control_Friction/(Control_D/2/1000))/9.81","v":{"$error":"#NAME?"}},null,{"$f":"(V9-AB9)*X9/1000","v":{"$error":"#N/A"}},{"$f":"IF(AO9<0,Control_Friction,(AO9/Control_Ratio)+Control_Friction)","v":{"$error":"#N/A"}},{"$f":"(AP9/((Control_D/1000)/2))/9.81","v":{"$error":"#N/A"}},{"$f":"IF((((Control_Friction-(AO9/Control_Ratio))/(Control_D/2/1000)))/9.81<(Control_Friction/(Control_D/2/1000))/9.81,(Control_Friction/(Control_D/2/1000))/9.81,(((Control_Friction-(AO9/Control_Ratio))/(Control_D/2/1000)))/9.81)","v":{"$error":"#NAME?"}},null,null,null,null,null,null,null,"Fabric Thickness",{"$f":"IF(i_Units=\"Metric\",i_FabricThickness,CONVERT(i_FabricThickness,\"in\",\"mm\"))","v":{"$error":"#N/A"}},"mm"]
[null,"Material",null,null,"Density","Young's Modulus",null,null,null,null,null,null,null,{"$f":"Rotations_Bottom_Max","v":{"$error":"#NAME?"}},{"$f":"(PI()/1000)*($N$10*BT_OD+Fabric_Thickness*$N$10^2)","v":{"$error":"#NAME?"}},null,{"$f":"9.81*((BT_UnitMass*o_BlindWidthm)+Fabric_TotalMass-Fabric_UnitMassLift*O10)","v":{"$error":"#NAME?"}},{"$f":"S10*2","v":{"$error":"#N/A"}},{"$f":"(Fabric_Roll_Diameter*0.5)-Fabric_Thickness*N10","v":{"$error":"#N/A"}},null,{"$f":"N10*(Spool_OD/R10)","v":{"$error":"#NAME?"}},{"$f":"9.81*((wb_UnitMass*o_BlindWidthm)+Fabric_UnitMassLift*O10)","v":{"$error":"#N/A"}},{"$f":"IF(O10>2.14,Spool_OD+8.4,IF(O10>1.38,Spool_OD+5.6,IF(O10>0.67,Spool_OD+2.8,Spool_OD)))","v":{"$error":"#NAME?"}},{"$f":"W10/2","v":{"$error":"#NAME?"}},null,{"$f":"(BoosterTop_Preturns+Rotations_Max-U10)*Booster_k","v":{"$error":"#NAME?"}},{"$f":"(Booster_PreTurns+N10)*BoosterBottom_k","v":{"$error":"#VALUE!"}},{"$f":"(Z10/(X10/1000)-(AA10/(S10/1000)))","v":{"$error":"#NAME?"}},null,{"$f":"V10*X10/1000","v":{"$error":"#N/A"}},{"$f":"(AD10/Control_Ratio)+Control_Friction","v":{"$error":"#N/A"}},{"$f":"(AE10/((Control_D/1000)/2))/9.81","v":{"$error":"#N/A"}},{"$f":"(Control_Friction/(Control_D/2/1000))/9.81","v":{"$error":"#NAME?"}},null,{"$f":"(V10+((Booster_PreTurns+N10)*BoosterBottom_k/(S10/1000)))","v":{"$error":"#N/A"}},{"$f":"(AI10*X10/1000)","v":{"$error":"#N/A"}},{"$f":"IF(AJ10<0,Control_Friction,(AJ10/Control_Ratio)+Control_Friction)","v":{"$error":"#N/A"}},{"$f":"(AJ10/((Control_D/1000)/2))/9.81","v":{"$error":"#N/A"}},{"$f":"(Control_Friction/(Control_D/2/1000))/9.81","v":{"$error":"#NAME?"}},null,{"$f":"(V10-AB10)*X10/1000","v":{"$error":"#N/A"}},{"$f":"IF(AB12<0,Control_Friction,(AO10/Control_Ratio)+Control_Friction)","v":{"$error":"#N/A"}},{"$f":"(AP10/((Control_D/1000)/2))/9.81","v":{"$error":"#N/A"}},{"$f":"IF((((Control_Friction-(AO10/Control_Ratio))/(Control_D/2/1000)))/9.81<(Control_Friction/(Control_D/2/1000))/9.81,(Control_Friction/(Control_D/2/1000))/9.81,(((Control_Friction-(AO10/Control_Ratio))/(Control_D/2/1000)))/9.81)","v":{"$error":"#NAME?"}},null,null,null,null,null,null,null,"Fabric Density",{"$f":"i_FabricDensity/1000","v":{"$error":"#N/A"}},"kg/m²"]
[null,"Aluminium",null,null,2710,{"$f":"68*10^9","v":68000000000},null,null,null,null,null,null,null,null,null,null,null,null,null,null,null,null,null,null,null,null,null,null,null,null,null,null,null,null,null,null,null,null,null,null,null,null,null,null,null,null,null,null,null,null,null,null,null,null,null,null,null,null,"Tube"]
[null,"Steel",null,null,7860,{"$f":"2*10^11","v":200000000000},null,null,null,null,null,null,null,null,null,null,null,null,null,null,null,null,null,null,null,null,null,null,null,null,null,null,null,null,null,null,null,null,null,null,null,null,null,null,null,null,null,null,null,null,null,null,null,null,null,null,null,null,"Unit Mass",{"$f":"INDEX(T_refTubes[Mass/m],MATCH(i_Tube,T_refTubes[OptionCode],0))","v":{"$error":"#N/A"}},"kg/m"]
[null,null,null,null,null,null,null,null,null,null,null,null,null,null,null,null,null,null,null,null,null,null,null,null,null,null,null,null,null,null,null,null,null,null,null,null,null,null,null,null,null,null,null,null,null,null,null,null,null,null,null,"Blind width (m)",{"$f":"o_Widthmm/1000","v":0},"m",null,null,null,null,"OD",{"$f":"INDEX(T_refTubes[Tube OD],MATCH(i_Tube,T_refTubes[OptionCode],0))","v":{"$error":"#N/A"}},"mm"]
[null,"Tubes",null,null,"mm","kg/m","(mm⁴)","(Nm²)",null,null,null,null,null,null,null,null,null,null,null,null,null,null,null,null,null,null,null,null,null,null,null,null,null,null,null,null,null,null,null,null,null,null,null,null,null,null,null,null,null,null,null,"Blind Drop (m)",{"$f":"o_Dropmm/1000","v":0},"m",null,null,null,null,"IE",{"$f":"INDEX(T_refTubes[EI],MATCH(i_Tube,T_refTubes[OptionCode],0))","v":{"$error":"#N/A"}},"Nm²"]
[null,"OptionCode","Codes","Description","Tube OD","Mass/m","I_min","EI"]
[null,"63 AL","RE01-0363","63 STD Aluminium Tube"]
[null,"63 STEEL"]
[null,"78 AL STD","RE01-0378","78 STD Aluminium Tube - 80mm",null,null,null,null,null,null,null,null,null,null,null,null,null,null,null,null,null,null,null,null,null,null,null,null,null,null,null,null,null,null,null,null,null,null,null,null,null,null,null,null,null,null,null,null,null,null,null,"Tube Max Rotations",{"$f":"(-Tube_OD+SQRT(Tube_OD^2+4*Fabric_Thickness*o_BlindDropm*1000/PI()))/(2*Fabric_Thickness)","v":{"$error":"#N/A"}}]
[null,"78 AL HD","RE01-0379","78 HD Aluminium Tube - 81.6mm",null,null,null,null,null,null,null,null,null,null,null,null,null,null,null,null,null,null,null,null,null,null,null,null,null,null,null,null,null,null,null,null,null,null,null,null,null,null,null,null,null,null,null,null,null,null,null,"Max Roll Diameter",{"$f":"(Rotations_Max)*Fabric_Thickness*2+Tube_OD","v":{"$error":"#N/A"}},"mm","no prewrap"]
[null,"78 STEEL","AW92-0901","78 STEEL Tube - 78mm",null,null,null,null,null,null,null,null,null,null,null,null,null,null,null,null,null,null,null,null,null,null,null,null,null,null,null,null,null,null,null,null,null,null,null,null,null,null,null,null,null,null,null,null,null,null,null,"Max Zip Diameter",{"$f":"((-Tube_OD+SQRT(Tube_OD^2+4*ZipThickness*o_BlindDropm*1000/PI()))/(2*ZipThickness))*ZipThickness*2+Tube_OD","v":{"$error":"#N/A"}},"mm"]
[null,"S100 110 STD","RB93-0110","S100 Aluminium Tube - 110 STD"]
[null,"S100 130 HD","RB93-0130","S100 Aluminium Tube - 130 HD",null,null,null,null,null,null,null,null,null,null,null,null,null,null,null,null,null,null,null,null,null,null,null,null,null,null,null,null,null,null,null,null,null,null,null,null,null,null,null,null,null,null,null,null,null,null,null,null,null,null,null,null,null,null,"Weight Bar & Ballast"]
[null,null,null,null,null,null,null,null,null,null,null,null,null,null,null,null,null,null,null,null,null,null,null,null,null,null,null,null,null,null,null,null,null,null,null,null,null,null,null,null,null,null,null,null,null,null,null,null,null,null,null,"Booster Max Preturns",{"$f":"ROUNDDOWN(BH28-Rotations_Max,0)","v":{"$error":"#N/A"}},"Turns",null,null,null,null,"Unit Mass",{"$f":"IFERROR(INDEX(T_refWeightBar[Mass/m],MATCH(1,T_refWeightBar[Codes],0)),0.00001)","v":1.0000000000000001E-5},"kg/m"]
[]
[]
[null,null,null,null,null,null,null,null,null,null,null,null,null,null,null,null,null,null,null,null,null,null,null,null,null,null,null,null,null,null,null,null,null,null,null,null,null,null,null,null,null,null,null,null,null,null,null,null,null,null,null,null,null,null,null,null,null,null,"Booster"]
[null,null,null,null,null,null,null,null,null,null,null,null,null,null,null,null,null,null,null,null,null,null,null,null,null,null,null,null,null,null,null,null,null,null,null,null,null,null,null,null,null,null,null,null,null,null,null,null,null,null,null,null,null,null,null,null,null,null,"k",{"$f":"IFERROR(INDEX(T_refBoosters[Spring Rate],MATCH(i_Booster,T_refBoosters[Input],0)),0.00001)","v":1.0000000000000001E-5},"Nm/Turn"]
[null,null,null,null,null,null,null,null,null,null,null,null,null,null,null,null,null,null,null,null,null,null,null,null,null,null,null,null,null,null,null,null,null,null,null,null,null,null,null,null,null,null,null,null,null,null,null,null,null,null,null,"Fabric Lift Unit Mass",{"$f":"o_BlindWidthm*Fabric_Density","v":{"$error":"#N/A"}},"kg/m",null,null,null,null,"Max Turns",{"$f":"IFERROR(INDEX(T_refBoosters[Max Turns],MATCH(i_Booster,T_refBoosters[Input],0)),0.00001)","v":1.0000000000000001E-5},"Turns"]
[null,null,null,null,null,null,null,null,null,null,null,null,null,null,null,null,null,null,null,null,null,null,null,null,null,null,null,null,null,null,null,null,null,null,null,null,null,null,null,null,null,null,null,null,null,null,null,null,null,null,null,"Fabric Total Mass",{"$f":"Fabric_UnitMassLift*o_BlindDropm","v":{"$error":"#N/A"}},"kg"]
[]
[null,"Boosters",null,null,"(Nm/Turn)",null,"(Nm)"]
[null,"Input","Codes","Description","Spring Rate","Max Turns","T_Max","MinWidth","BoosterCount",null,null,null,null,null,null,null,null,null,null,null,null,null,null,null,null,null,null,null,null,null,null,null,null,null,null,null,null,null,null,null,null,null,null,null,null,null,null,null,null,null,null,"Fabric Area Mass",{"$f":"Fabric_Density*(o_Dropmm/1000)*(o_Widthmm/1000)","v":{"$error":"#N/A"}},"kg/m²"]
[null,"Short",null,"Short RE01 Spring"]
[null,null,null,"X-Light RE01 Spring"]
[null,"Light",null,"Light RE01 Spring"]
[null,null,null,"Medium Light RE01 Spring",null,null,null,null,null,null,null,null,null,null,null,null,null,null,null,null,null,null,null,null,null,null,null,null,null,null,null,null,null,null,null,null,null,null,null,null,null,null,null,null,null,null,null,null,null,null,null,"Torque @ Midpoint",{"$f":"(((((g*(wb_UnitMass*o_BlindWidthm+Fabric_Density*o_BlindWidthm*((o_BlindDropm-((PI()/1000)*((Rotations_Max/2)*Tube_OD+Fabric_Thickness*(Rotations_Max/2)^2)))))*((((Fabric_Roll_Diameter*0.5)-Fabric_Thickness*(Rotations_Max/2)))/1000))))))","v":{"$error":"#N/A"}},"Nm"]
[null,"Standard","RB10-6040-xxx031/2","Standard RE01 Spring"]
[null,"Heavy","RB10-6040-xxx041/2","Heavy Duty RE01 Spring",null,null,null,null,null,null,null,null,null,null,null,null,null,null,null,null,null,null,null,null,null,null,null,null,null,null,null,null,null,null,null,null,null,null,null,null,null,null,null,null,null,null,null,null,null,null,null,"# preturns recommended",{"$f":"ROUNDUP((BA36-(Booster_k*(Rotations_Max/2)))/Booster_k,0)","v":{"$error":"#N/A"}},"Turns"]
[null,"Extra Heavy",null,"X-Heavy RE01 Spring"]
[null,"Dual Heavy",null,"Dual Heavy RE01 Springs"]
[null,null,null,"Dual X-Heavy RE01 Springs"]
[]
[]
[]
[]
[null,"Weight Bar",null,null,"(mm²)","kg/m","(mm⁴)","(mm⁴)","(Nm²)"]
[null,"Column1","Codes","Description","CSA","Mass/m","I_y","I_x","EI"]
[null,null,{"$f":"IF(AND(i_WeightBar=\"F56\",i_wbBallast=\"No\"),1,\"\")","v":{"$error":"#REF!"}},"F56 HD External Weight Bar"]
[null,null,{"$f":"IF(AND(i_WeightBar=\"F56\",i_wbBallast=\"Yes\"),1,\"\")","v":{"$error":"#REF!"}},"F56 HD External Weight Bar + 1x12mm Ballast"]
[null,null,{"$f":"IF(AND(i_WeightBar=\"F72\",i_wbBallast=\"No\"),1,\"\")","v":{"$error":"#REF!"}},"F72 HD External Weight Bar"]
[null,null,{"$f":"IF(AND(i_WeightBar=\"F72\",i_wbBallast=\"Yes\"),1,\"\")","v":{"$error":"#REF!"}},"F72 HD External Weight Bar + 1x12mm Ballast"]
[]
[null,"Controls",null,null,"(mm)","(Nm)",null,"(Nm)"]
[null,"Selection","Codes","Description","Diameter","Holding Capacity","Gear Ratio","Friction"]

{"sheet":"Calc_Fabric","index":11,"n_rows":130,"n_cols":15,"rows_kept":130,"cut":false,"hidden":true,"merged":[[14,1,128,1]]}
[]
[null,null,"DESCRIPTION","Thickness","Density","Weight (kg/m²)","Code"]
[null,null,{"$f":"IF(i_Location=\"US\",\"Default (16.90 oz/yd², 0.033'')\",\"Default 573 gsm, 0.85 mm Thick\")","v":"Default 573 gsm, 0.85 mm Thick"},0.85,573,{"$f":"E3/1000","v":0.57299999999999995},"NOT SUPPLIED"]
[null,null,"X-Weave Exterior Screen 5% 126\" Graphite",null,null,null,"066003200GRA",null,null,null,null,"PVC (1000 gsm, 0.75 mm Thick)",0.75,1000,{"$f":"N4/1000","v":1}]
[null,null,"X-Weave Exterior Screen 5% 126\" Mahogany",null,null,null,"066003200MAH"]
[null,null,"X-Weave Exterior Screen 5% 126\" Onyx",null,null,null,"066003200ONY"]
[null,null,"X-Weave Exterior Screen 5% 126\" Sand",null,null,null,"066003200SAN"]
[null,null,"X-Weave Exterior Screen 5% 126\" Slate",null,null,null,"066003200SLA"]
[null,null,"X-Weave Exterior Screen 5% 126\" Stone Gray",null,null,null,"066003200STO"]
[]
[]
[]
[]
[]
[]
[]
[]
[]
[]
[]
[]
[]
[]
[]
[]
[]
[]
[]
[]
[]
[]
[]
[]
[]
[]
[]
[]
[]
[]
[]
[]
[]
[]
[]
[]
[]
[]
[]
[]
[]
[]
[]
[]
[]
[]
[]
[]
[]
[]
[]
[]
[]
[]
[]
[]
[]
[]
[]
[]
[]
[]
[]
[]
[]
[]
[]
[]
[]
[]
[]
[]
[]
[]
[]
[]
[]
[]
[]
[]
[]
[]
[]
[]
[]
[]
[]
[]
[]
[]
[]
[]
[]
[]
[]
[]
[]
[]
[]
[]
[]
[]
[]
[]
[]
[]
[]
[]
[]
[]
[]
[]
[]
[]
[]
[]
[]
[]
[]
[]
[null,null,null,null,null,null,null,"← Manually type in \"Custom\" Fabric Density in red cell"]

{"sheet":"PriceList_AU","index":12,"n_rows":185,"n_cols":19,"rows_kept":185,"cut":false,"hidden":true,"merged":[]}
[null,null,null,null,null,null,null,null,null,null,"Custom Currency:"]
[null,"No.","ColourOptions","Part Number","Description","Colour Code","Colour Description","Colour","Base Unit of Measure","AU","AUD_Original","CustomPricing","QTY_Inner","QTY_Outer",null,null,null,"Last Update:","2022-06-29"]
[null,"AW05-0701-069160","Y",{"$f":"IF(AND(OR(T_NAV_AU[[#This Row],[ColourOptions]]=\"M\",T_NAV_AU[[#This Row],[ColourOptions]]=\"Y\"),MID(T_NAV_AU[[#This Row],[No.]],11,3)=\"069\"),REPLACE(T_NAV_AU[[#This Row],[No.]],11,3,\"xxx\"),T_NAV_AU[[#This Row],[No.]])","v":"AW05-0701-xxx160"},"Pivot Arms - 1.6m | 2 Arms LH + RH","069","Pure White",{"$f":"IF(T_NAV_AU[[#This Row],[ColourOptions]]=\"M\",\"as per catalogue\",IF(T_NAV_AU[[#This Row],[Colour Description]]=\"Pure White\", \"Powdercoat, as per catalogue\", T_NAV_AU[[#This Row],[Colour Description]]))","v":"Powdercoat, as per catalogue"},"PAIR",{"$f":"IF(T_NAV_AU[[#This Row],[CustomPricing]]<>\"\",T_NAV_AU[[#This Row],[CustomPricing]],T_NAV_AU[[#This Row],[AUD_Original]])","v":373.41},373.41,null,1,0]
[null,"AW05-0801-050000","N",{"$f":"IF(AND(OR(T_NAV_AU[[#This Row],[ColourOptions]]=\"M\",T_NAV_AU[[#This Row],[ColourOptions]]=\"Y\"),MID(T_NAV_AU[[#This Row],[No.]],11,3)=\"069\"),REPLACE(T_NAV_AU[[#This Row],[No.]],11,3,\"xxx\"),T_NAV_AU[[#This Row],[No.]])","v":"AW05-0801-050000"},"Pivot Arm Cover Cap for Terminal Bar","055","Black, Shadelab",{"$f":"IF(T_NAV_AU[[#This Row],[ColourOptions]]=\"M\",\"as per catalogue\",IF(T_NAV_AU[[#This Row],[Colour Description]]=\"Pure White\", \"Powdercoat, as per catalogue\", T_NAV_AU[[#This Row],[Colour Description]]))","v":"Black, Shadelab"},"KIT",{"$f":"IF(T_NAV_AU[[#This Row],[CustomPricing]]<>\"\",T_NAV_AU[[#This Row],[CustomPricing]],T_NAV_AU[[#This Row],[AUD_Original]])","v":6.43},6.43,null,1,0]
[null,"AW91-1501-050000","N",{"$f":"IF(AND(OR(T_NAV_AU[[#This Row],[ColourOptions]]=\"M\",T_NAV_AU[[#This Row],[ColourOptions]]=\"Y\"),MID(T_NAV_AU[[#This Row],[No.]],11,3)=\"069\"),REPLACE(T_NAV_AU[[#This Row],[No.]],11,3,\"xxx\"),T_NAV_AU[[#This Row],[No.]])","v":"AW91-1501-050000"},"Fabric Brush T Slot Fit - 7 x 4.8mm | 350m Roll","050","Black, Satin",{"$f":"IF(T_NAV_AU[[#This Row],[ColourOptions]]=\"M\",\"as per catalogue\",IF(T_NAV_AU[[#This Row],[Colour Description]]=\"Pure White\", \"Powdercoat, as per catalogue\", T_NAV_AU[[#This Row],[Colour Description]]))","v":"Black, Satin"},"METRE",{"$f":"IF(T_NAV_AU[[#This Row],[CustomPricing]]<>\"\",T_NAV_AU[[#This Row],[CustomPricing]],T_NAV_AU[[#This Row],[AUD_Original]])","v":1.59},1.59,null,350,1400]
[null,"AW92-0901-000700","N",{"$f":"IF(AND(OR(T_NAV_AU[[#This Row],[ColourOptions]]=\"M\",T_NAV_AU[[#This Row],[ColourOptions]]=\"Y\"),MID(T_NAV_AU[[#This Row],[No.]],11,3)=\"069\"),REPLACE(T_NAV_AU[[#This Row],[No.]],11,3,\"xxx\"),T_NAV_AU[[#This Row],[No.]])","v":"AW92-0901-000700"},"78mm Awning Tube - 7m","000","Mill Finish",{"$f":"IF(T_NAV_AU[[#This Row],[ColourOptions]]=\"M\",\"as per catalogue\",IF(T_NAV_AU[[#This Row],[Colour Description]]=\"Pure White\", \"Powdercoat, as per catalogue\", T_NAV_AU[[#This Row],[Colour Description]]))","v":"Mill Finish"},"LENGTH",{"$f":"IF(T_NAV_AU[[#This Row],[CustomPricing]]<>\"\",T_NAV_AU[[#This Row],[CustomPricing]],T_NAV_AU[[#This Row],[AUD_Original]])","v":140.15},140.15,null,0,28]
[null,"HD82-2366-010008","N",{"$f":"IF(AND(OR(T_NAV_AU[[#This Row],[ColourOptions]]=\"M\",T_NAV_AU[[#This Row],[ColourOptions]]=\"Y\"),MID(T_NAV_AU[[#This Row],[No.]],11,3)=\"069\"),REPLACE(T_NAV_AU[[#This Row],[No.]],11,3,\"xxx\"),T_NAV_AU[[#This Row],[No.]])","v":"HD82-2366-010008"},"Channel Lock Screw Set","010","S/S 304, Natural",{"$f":"IF(T_NAV_AU[[#This Row],[ColourOptions]]=\"M\",\"as per catalogue\",IF(T_NAV_AU[[#This Row],[Colour Description]]=\"Pure White\", \"Powdercoat, as per catalogue\", T_NAV_AU[[#This Row],[Colour Description]]))","v":"S/S 304, Natural"},"PIECE",{"$f":"IF(T_NAV_AU[[#This Row],[CustomPricing]]<>\"\",T_NAV_AU[[#This Row],[CustomPricing]],T_NAV_AU[[#This Row],[AUD_Original]])","v":0.43},0.43,null,100,10000]
[null,"HD82-2366-010016","N",{"$f":"IF(AND(OR(T_NAV_AU[[#This Row],[ColourOptions]]=\"M\",T_NAV_AU[[#This Row],[ColourOptions]]=\"Y\"),MID(T_NAV_AU[[#This Row],[No.]],11,3)=\"069\"),REPLACE(T_NAV_AU[[#This Row],[No.]],11,3,\"xxx\"),T_NAV_AU[[#This Row],[No.]])","v":"HD82-2366-010016"},"Screw Self Tapper, Thread Cutting Type 25 Phillips","010","S/S 304, Natural",{"$f":"IF(T_NAV_AU[[#This Row],[ColourOptions]]=\"M\",\"as per catalogue\",IF(T_NAV_AU[[#This Row],[Colour Description]]=\"Pure White\", \"Powdercoat, as per catalogue\", T_NAV_AU[[#This Row],[Colour Description]]))","v":"S/S 304, Natural"},"PIECE",{"$f":"IF(T_NAV_AU[[#This Row],[CustomPricing]]<>\"\",T_NAV_AU[[#This Row],[CustomPricing]],T_NAV_AU[[#This Row],[AUD_Original]])","v":0.38},0.38,null,1000,10000]
[null,"HD86-0332-010009","N",{"$f":"IF(AND(OR(T_NAV_AU[[#This Row],[ColourOptions]]=\"M\",T_NAV_AU[[#This Row],[ColourOptions]]=\"Y\"),MID(T_NAV_AU[[#This Row],[No.]],11,3)=\"069\"),REPLACE(T_NAV_AU[[#This Row],[No.]],11,3,\"xxx\"),T_NAV_AU[[#This Row],[No.]])","v":"HD86-0332-010009"},"Blind Rivet, S/S 4.0mm OD, Grip range 3.2-4.8mm","010","S/S 304, Natural",{"$f":"IF(T_NAV_AU[[#This Row],[ColourOptions]]=\"M\",\"as per catalogue\",IF(T_NAV_AU[[#This Row],[Colour Description]]=\"Pure White\", \"Powdercoat, as per catalogue\", T_NAV_AU[[#This Row],[Colour Description]]))","v":"S/S 304, Natural"},"PIECE",{"$f":"IF(T_NAV_AU[[#This Row],[CustomPricing]]<>\"\",T_NAV_AU[[#This Row],[CustomPricing]],T_NAV_AU[[#This Row],[AUD_Original]])","v":0.67},0.67,null,100,1000]
[null,"MT01-1145-050001","N",{"$f":"IF(AND(OR(T_NAV_AU[[#This Row],[ColourOptions]]=\"M\",T_NAV_AU[[#This Row],[ColourOptions]]=\"Y\"),MID(T_NAV_AU[[#This Row],[No.]],11,3)=\"069\"),REPLACE(T_NAV_AU[[#This Row],[No.]],11,3,\"xxx\"),T_NAV_AU[[#This Row],[No.]])","v":"MT01-1145-050001"},"AUTOMATE | FT 15Nm Motor [Ø45/240V/15rpm]","050","Black, Satin",{"$f":"IF(T_NAV_AU[[#This Row],[ColourOptions]]=\"M\",\"as per catalogue\",IF(T_NAV_AU[[#This Row],[Colour Description]]=\"Pure White\", \"Powdercoat, as per catalogue\", T_NAV_AU[[#This Row],[Colour Description]]))","v":"Black, Satin"},"PIECE",{"$f":"IF(T_NAV_AU[[#This Row],[CustomPricing]]<>\"\",T_NAV_AU[[#This Row],[CustomPricing]],T_NAV_AU[[#This Row],[AUD_Original]])","v":263.72000000000003},263.72000000000003,null,1,10]
[null,"MT01-1145-050012","N",{"$f":"IF(AND(OR(T_NAV_AU[[#This Row],[ColourOptions]]=\"M\",T_NAV_AU[[#This Row],[ColourOptions]]=\"Y\"),MID(T_NAV_AU[[#This Row],[No.]],11,3)=\"069\"),REPLACE(T_NAV_AU[[#This Row],[No.]],11,3,\"xxx\"),T_NAV_AU[[#This Row],[No.]])","v":"MT01-1145-050012"},"AUTOMATE | FT 15Nm Motor LC [Ø45/240V/15rpm]","050","Black, Satin",{"$f":"IF(T_NAV_AU[[#This Row],[ColourOptions]]=\"M\",\"as per catalogue\",IF(T_NAV_AU[[#This Row],[Colour Description]]=\"Pure White\", \"Powdercoat, as per catalogue\", T_NAV_AU[[#This Row],[Colour Description]]))","v":"Black, Satin"},"PIECE",{"$f":"IF(T_NAV_AU[[#This Row],[CustomPricing]]<>\"\",T_NAV_AU[[#This Row],[CustomPricing]],T_NAV_AU[[#This Row],[AUD_Original]])","v":263.72000000000003},263.72000000000003,null,1,10]
[null,"MT01-1145-069013","N",{"$f":"IF(AND(OR(T_NAV_AU[[#This Row],[ColourOptions]]=\"M\",T_NAV_AU[[#This Row],[ColourOptions]]=\"Y\"),MID(T_NAV_AU[[#This Row],[No.]],11,3)=\"069\"),REPLACE(T_NAV_AU[[#This Row],[No.]],11,3,\"xxx\"),T_NAV_AU[[#This Row],[No.]])","v":"MT01-1145-069013"},"AUTOMATE | AX30 30Nm Motor AU [Ø45/240V/15rpm]","069","Pure White",{"$f":"IF(T_NAV_AU[[#This Row],[ColourOptions]]=\"M\",\"as per catalogue\",IF(T_NAV_AU[[#This Row],[Colour Description]]=\"Pure White\", \"Powdercoat, as per catalogue\", T_NAV_AU[[#This Row],[Colour Description]]))","v":"Powdercoat, as per catalogue"},"PIECE",{"$f":"IF(T_NAV_AU[[#This Row],[CustomPricing]]<>\"\",T_NAV_AU[[#This Row],[CustomPricing]],T_NAV_AU[[#This Row],[AUD_Original]])","v":256.62},256.62,null,1,10]
[null,"MT01-1145-069015","N",{"$f":"IF(AND(OR(T_NAV_AU[[#This Row],[ColourOptions]]=\"M\",T_NAV_AU[[#This Row],[ColourOptions]]=\"Y\"),MID(T_NAV_AU[[#This Row],[No.]],11,3)=\"069\"),REPLACE(T_NAV_AU[[#This Row],[No.]],11,3,\"xxx\"),T_NAV_AU[[#This Row],[No.]])","v":"MT01-1145-069015"},"AUTOMATE | AX50 50Nm Motor AU [Ø45/240V/12rpm]","069","Pure White",{"$f":"IF(T_NAV_AU[[#This Row],[ColourOptions]]=\"M\",\"as per catalogue\",IF(T_NAV_AU[[#This Row],[Colour Description]]=\"Pure White\", \"Powdercoat, as per catalogue\", T_NAV_AU[[#This Row],[Colour Description]]))","v":"Powdercoat, as per catalogue"},"PIECE",{"$f":"IF(T_NAV_AU[[#This Row],[CustomPricing]]<>\"\",T_NAV_AU[[#This Row],[CustomPricing]],T_NAV_AU[[#This Row],[AUD_Original]])","v":325.42},325.42,null,1,10]
[null,"MT02-0101-050004","N",{"$f":"IF(AND(OR(T_NAV_AU[[#This Row],[ColourOptions]]=\"M\",T_NAV_AU[[#This Row],[ColourOptions]]=\"Y\"),MID(T_NAV_AU[[#This Row],[No.]],11,3)=\"069\"),REPLACE(T_NAV_AU[[#This Row],[No.]],11,3,\"xxx\"),T_NAV_AU[[#This Row],[No.]])","v":"MT02-0101-050004"},"AUTOMATE | PUSH 5 Channel Remote | Black","050","Black, Satin",{"$f":"IF(T_NAV_AU[[#This Row],[ColourOptions]]=\"M\",\"as per catalogue\",IF(T_NAV_AU[[#This Row],[Colour Description]]=\"Pure White\", \"Powdercoat, as per catalogue\", T_NAV_AU[[#This Row],[Colour Description]]))","v":"Black, Satin"},"PIECE",{"$f":"IF(T_NAV_AU[[#This Row],[CustomPricing]]<>\"\",T_NAV_AU[[#This Row],[CustomPricing]],T_NAV_AU[[#This Row],[AUD_Original]])","v":60.06},60.06,null,1,100]
[null,"MT02-0101-050008","N",{"$f":"IF(AND(OR(T_NAV_AU[[#This Row],[ColourOptions]]=\"M\",T_NAV_AU[[#This Row],[ColourOptions]]=\"Y\"),MID(T_NAV_AU[[#This Row],[No.]],11,3)=\"069\"),REPLACE(T_NAV_AU[[#This Row],[No.]],11,3,\"xxx\"),T_NAV_AU[[#This Row],[No.]])","v":"MT02-0101-050008"},"AUTOMATE | PUSH 15 Channel Remote | Black","050","Black, Satin",{"$f":"IF(T_NAV_AU[[#This Row],[ColourOptions]]=\"M\",\"as per catalogue\",IF(T_NAV_AU[[#This Row],[Colour Description]]=\"Pure White\", \"Powdercoat, as per catalogue\", T_NAV_AU[[#This Row],[Colour Description]]))","v":"Black, Satin"},"PIECE",{"$f":"IF(T_NAV_AU[[#This Row],[CustomPricing]]<>\"\",T_NAV_AU[[#This Row],[CustomPricing]],T_NAV_AU[[#This Row],[AUD_Original]])","v":67.05},67.05,null,1,100]
[null,"MT02-0101-067004","N",{"$f":"IF(AND(OR(T_NAV_AU[[#This Row],[ColourOptions]]=\"M\",T_NAV_AU[[#This Row],[ColourOptions]]=\"Y\"),MID(T_NAV_AU[[#This Row],[No.]],11,3)=\"069\"),REPLACE(T_NAV_AU[[#This Row],[No.]],11,3,\"xxx\"),T_NAV_AU[[#This Row],[No.]])","v":"MT02-0101-067004"},"AUTOMATE | PUSH 5 Channel Remote | White","067","White / Platinum",{"$f":"IF(T_NAV_AU[[#This Row],[ColourOptions]]=\"M\",\"as per catalogue\",IF(T_NAV_AU[[#This Row],[Colour Description]]=\"Pure White\", \"Powdercoat, as per catalogue\", T_NAV_AU[[#This Row],[Colour Description]]))","v":"White / Platinum"},"PIECE",{"$f":"IF(T_NAV_AU[[#This Row],[CustomPricing]]<>\"\",T_NAV_AU[[#This Row],[CustomPricing]],T_NAV_AU[[#This Row],[AUD_Original]])","v":60.06},60.06,null,1,100]
[null,"MT02-0101-067008","N",{"$f":"IF(AND(OR(T_NAV_AU[[#This Row],[ColourOptions]]=\"M\",T_NAV_AU[[#This Row],[ColourOptions]]=\"Y\"),MID(T_NAV_AU[[#This Row],[No.]],11,3)=\"069\"),REPLACE(T_NAV_AU[[#This Row],[No.]],11,3,\"xxx\"),T_NAV_AU[[#This Row],[No.]])","v":"MT02-0101-067008"},"AUTOMATE | PUSH 15 Channel Remote | White","067","White / Platinum",{"$f":"IF(T_NAV_AU[[#This Row],[ColourOptions]]=\"M\",\"as per catalogue\",IF(T_NAV_AU[[#This Row],[Colour Description]]=\"Pure White\", \"Powdercoat, as per catalogue\", T_NAV_AU[[#This Row],[Colour Description]]))","v":"White / Platinum"},"PIECE",{"$f":"IF(T_NAV_AU[[#This Row],[CustomPricing]]<>\"\",T_NAV_AU[[#This Row],[CustomPricing]],T_NAV_AU[[#This Row],[AUD_Original]])","v":67.05},67.05,null,1,100]
[null,"MT02-0301-072001","N",{"$f":"IF(AND(OR(T_NAV_AU[[#This Row],[ColourOptions]]=\"M\",T_NAV_AU[[#This Row],[ColourOptions]]=\"Y\"),MID(T_NAV_AU[[#This Row],[No.]],11,3)=\"069\"),REPLACE(T_NAV_AU[[#This Row],[No.]],11,3,\"xxx\"),T_NAV_AU[[#This Row],[No.]])","v":"MT02-0301-072001"},"AUTOMATE | Solar Powered Sun & Wind Sensor","072","Vivid White",{"$f":"IF(T_NAV_AU[[#This Row],[ColourOptions]]=\"M\",\"as per catalogue\",IF(T_NAV_AU[[#This Row],[Colour Description]]=\"Pure White\", \"Powdercoat, as per catalogue\", T_NAV_AU[[#This Row],[Colour Description]]))","v":"Vivid White"},"PIECE",{"$f":"IF(T_NAV_AU[[#This Row],[CustomPricing]]<>\"\",T_NAV_AU[[#This Row],[CustomPricing]],T_NAV_AU[[#This Row],[AUD_Original]])","v":183.46},183.46,null,1,10]
[null,"MT02-0301-050002","N",{"$f":"IF(AND(OR(T_NAV_AU[[#This Row],[ColourOptions]]=\"M\",T_NAV_AU[[#This Row],[ColourOptions]]=\"Y\"),MID(T_NAV_AU[[#This Row],[No.]],11,3)=\"069\"),REPLACE(T_NAV_AU[[#This Row],[No.]],11,3,\"xxx\"),T_NAV_AU[[#This Row],[No.]])","v":"MT02-0301-050002"},"AUTOMATE | Motion Sensor | Black","050","Black, Satin",{"$f":"IF(T_NAV_AU[[#This Row],[ColourOptions]]=\"M\",\"as per catalogue\",IF(T_NAV_AU[[#This Row],[Colour Description]]=\"Pure White\", \"Powdercoat, as per catalogue\", T_NAV_AU[[#This Row],[Colour Description]]))","v":"Black, Satin"},"PIECE",{"$f":"IF(T_NAV_AU[[#This Row],[CustomPricing]]<>\"\",T_NAV_AU[[#This Row],[CustomPricing]],T_NAV_AU[[#This Row],[AUD_Original]])","v":113.52},113.52,null,1,25]
[null,"MT03-0198-025008","N",{"$f":"IF(AND(OR(T_NAV_AU[[#This Row],[ColourOptions]]=\"M\",T_NAV_AU[[#This Row],[ColourOptions]]=\"Y\"),MID(T_NAV_AU[[#This Row],[No.]],11,3)=\"069\"),REPLACE(T_NAV_AU[[#This Row],[No.]],11,3,\"xxx\"),T_NAV_AU[[#This Row],[No.]])","v":"MT03-0198-025008"},"Drive AX Motor Adaptor kit for Extreme","025","Silver ZINC Plated",{"$f":"IF(T_NAV_AU[[#This Row],[ColourOptions]]=\"M\",\"as per catalogue\",IF(T_NAV_AU[[#This Row],[Colour Description]]=\"Pure White\", \"Powdercoat, as per catalogue\", T_NAV_AU[[#This Row],[Colour Description]]))","v":"Silver ZINC Plated"},"SET",{"$f":"IF(T_NAV_AU[[#This Row],[CustomPricing]]<>\"\",T_NAV_AU[[#This Row],[CustomPricing]],T_NAV_AU[[#This Row],[AUD_Original]])","v":7.64},7.64,null,1,100]
[null,"RB05-9101-340100","N",{"$f":"IF(AND(OR(T_NAV_AU[[#This Row],[ColourOptions]]=\"M\",T_NAV_AU[[#This Row],[ColourOptions]]=\"Y\"),MID(T_NAV_AU[[#This Row],[No.]],11,3)=\"069\"),REPLACE(T_NAV_AU[[#This Row],[No.]],11,3,\"xxx\"),T_NAV_AU[[#This Row],[No.]])","v":"RB05-9101-340100"},"Crank Control Arm | 100cm","340","GREY AC",{"$f":"IF(T_NAV_AU[[#This Row],[ColourOptions]]=\"M\",\"as per catalogue\",IF(T_NAV_AU[[#This Row],[Colour Description]]=\"Pure White\", \"Powdercoat, as per catalogue\", T_NAV_AU[[#This Row],[Colour Description]]))","v":"GREY AC"},"PIECE",{"$f":"IF(T_NAV_AU[[#This Row],[CustomPricing]]<>\"\",T_NAV_AU[[#This Row],[CustomPricing]],T_NAV_AU[[#This Row],[AUD_Original]])","v":44.64},44.64,null,5,100]
[null,"RB05-9101-340150","N",{"$f":"IF(AND(OR(T_NAV_AU[[#This Row],[ColourOptions]]=\"M\",T_NAV_AU[[#This Row],[ColourOptions]]=\"Y\"),MID(T_NAV_AU[[#This Row],[No.]],11,3)=\"069\"),REPLACE(T_NAV_AU[[#This Row],[No.]],11,3,\"xxx\"),T_NAV_AU[[#This Row],[No.]])","v":"RB05-9101-340150"},"Crank Control Arm | 150cm","340","GREY AC",{"$f":"IF(T_NAV_AU[[#This Row],[ColourOptions]]=\"M\",\"as per catalogue\",IF(T_NAV_AU[[#This Row],[Colour Description]]=\"Pure White\", \"Powdercoat, as per catalogue\", T_NAV_AU[[#This Row],[Colour Description]]))","v":"GREY AC"},"PIECE",{"$f":"IF(T_NAV_AU[[#This Row],[CustomPricing]]<>\"\",T_NAV_AU[[#This Row],[CustomPricing]],T_NAV_AU[[#This Row],[AUD_Original]])","v":48.8},48.8,null,5,100]
[null,"RB05-9101-340200","N",{"$f":"IF(AND(OR(T_NAV_AU[[#This Row],[ColourOptions]]=\"M\",T_NAV_AU[[#This Row],[ColourOptions]]=\"Y\"),MID(T_NAV_AU[[#This Row],[No.]],11,3)=\"069\"),REPLACE(T_NAV_AU[[#This Row],[No.]],11,3,\"xxx\"),T_NAV_AU[[#This Row],[No.]])","v":"RB05-9101-340200"},"Crank Control Arm | 200cm","340","GREY AC",{"$f":"IF(T_NAV_AU[[#This Row],[ColourOptions]]=\"M\",\"as per catalogue\",IF(T_NAV_AU[[#This Row],[Colour Description]]=\"Pure White\", \"Powdercoat, as per catalogue\", T_NAV_AU[[#This Row],[Colour Description]]))","v":"GREY AC"},"PIECE",{"$f":"IF(T_NAV_AU[[#This Row],[CustomPricing]]<>\"\",T_NAV_AU[[#This Row],[CustomPricing]],T_NAV_AU[[#This Row],[AUD_Original]])","v":55.83},55.83,null,5,100]
[null,"RB05-9102-069000","M",{"$f":"IF(AND(OR(T_NAV_AU[[#This Row],[ColourOptions]]=\"M\",T_NAV_AU[[#This Row],[ColourOptions]]=\"Y\"),MID(T_NAV_AU[[#This Row],[No.]],11,3)=\"069\"),REPLACE(T_NAV_AU[[#This Row],[No.]],11,3,\"xxx\"),T_NAV_AU[[#This Row],[No.]])","v":"RB05-9102-xxx000"},"Crank Arm Support","069","Pure White",{"$f":"IF(T_NAV_AU[[#This Row],[ColourOptions]]=\"M\",\"as per catalogue\",IF(T_NAV_AU[[#This Row],[Colour Description]]=\"Pure White\", \"Powdercoat, as per catalogue\", T_NAV_AU[[#This Row],[Colour Description]]))","v":"as per catalogue"},"PIECE",{"$f":"IF(T_NAV_AU[[#This Row],[CustomPricing]]<>\"\",T_NAV_AU[[#This Row],[CustomPricing]],T_NAV_AU[[#This Row],[AUD_Original]])","v":3.37},3.37,null,5,100]
[null,"RB56-0762-014050","N",{"$f":"IF(AND(OR(T_NAV_AU[[#This Row],[ColourOptions]]=\"M\",T_NAV_AU[[#This Row],[ColourOptions]]=\"Y\"),MID(T_NAV_AU[[#This Row],[No.]],11,3)=\"069\"),REPLACE(T_NAV_AU[[#This Row],[No.]],11,3,\"xxx\"),T_NAV_AU[[#This Row],[No.]])","v":"RB56-0762-014050"},"Univ Zamak Adap & Lock Ring & M8 x 16mm S/Screws","014","Cast Silver",{"$f":"IF(T_NAV_AU[[#This Row],[ColourOptions]]=\"M\",\"as per catalogue\",IF(T_NAV_AU[[#This Row],[Colour Description]]=\"Pure White\", \"Powdercoat, as per catalogue\", T_NAV_AU[[#This Row],[Colour Description]]))","v":"Cast Silver"},"SET",{"$f":"IF(T_NAV_AU[[#This Row],[CustomPricing]]<>\"\",T_NAV_AU[[#This Row],[CustomPricing]],T_NAV_AU[[#This Row],[AUD_Original]])","v":45.64},45.64,null,1,20]
[null,"RB56-0763-014050","N",{"$f":"IF(AND(OR(T_NAV_AU[[#This Row],[ColourOptions]]=\"M\",T_NAV_AU[[#This Row],[ColourOptions]]=\"Y\"),MID(T_NAV_AU[[#This Row],[No.]],11,3)=\"069\"),REPLACE(T_NAV_AU[[#This Row],[No.]],11,3,\"xxx\"),T_NAV_AU[[#This Row],[No.]])","v":"RB56-0763-014050"},"Univ Zamak Adap & Lock Ring & M6 x 10mm S/Screws","014","Cast Silver",{"$f":"IF(T_NAV_AU[[#This Row],[ColourOptions]]=\"M\",\"as per catalogue\",IF(T_NAV_AU[[#This Row],[Colour Description]]=\"Pure White\", \"Powdercoat, as per catalogue\", T_NAV_AU[[#This Row],[Colour Description]]))","v":"Cast Silver"},"SET",{"$f":"IF(T_NAV_AU[[#This Row],[CustomPricing]]<>\"\",T_NAV_AU[[#This Row],[CustomPricing]],T_NAV_AU[[#This Row],[AUD_Original]])","v":45.64},45.64,null,1,20]
[null,"RB56-0764-014050","N",{"$f":"IF(AND(OR(T_NAV_AU[[#This Row],[ColourOptions]]=\"M\",T_NAV_AU[[#This Row],[ColourOptions]]=\"Y\"),MID(T_NAV_AU[[#This Row],[No.]],11,3)=\"069\"),REPLACE(T_NAV_AU[[#This Row],[No.]],11,3,\"xxx\"),T_NAV_AU[[#This Row],[No.]])","v":"RB56-0764-014050"},"Univ Zamak Adap & Lock Ring & M6 x 12mm S/Screws","014","Cast Silver",{"$f":"IF(T_NAV_AU[[#This Row],[ColourOptions]]=\"M\",\"as per catalogue\",IF(T_NAV_AU[[#This Row],[Colour Description]]=\"Pure White\", \"Powdercoat, as per catalogue\", T_NAV_AU[[#This Row],[Colour Description]]))","v":"Cast Silver"},"SET",{"$f":"IF(T_NAV_AU[[#This Row],[CustomPricing]]<>\"\",T_NAV_AU[[#This Row],[CustomPricing]],T_NAV_AU[[#This Row],[AUD_Original]])","v":45.64},45.64,null,1,20]
[null,"RB80-0202-073100","N",{"$f":"IF(AND(OR(T_NAV_AU[[#This Row],[ColourOptions]]=\"M\",T_NAV_AU[[#This Row],[ColourOptions]]=\"Y\"),MID(T_NAV_AU[[#This Row],[No.]],11,3)=\"069\"),REPLACE(T_NAV_AU[[#This Row],[No.]],11,3,\"xxx\"),T_NAV_AU[[#This Row],[No.]])","v":"RB80-0202-073100"},"Extreme Bearing Idler | Universal | S100","073","Grey Cloud",{"$f":"IF(T_NAV_AU[[#This Row],[ColourOptions]]=\"M\",\"as per catalogue\",IF(T_NAV_AU[[#This Row],[Colour Description]]=\"Pure White\", \"Powdercoat, as per catalogue\", T_NAV_AU[[#This Row],[Colour Description]]))","v":"Grey Cloud"},"PIECE",{"$f":"IF(T_NAV_AU[[#This Row],[CustomPricing]]<>\"\",T_NAV_AU[[#This Row],[CustomPricing]],T_NAV_AU[[#This Row],[AUD_Original]])","v":91.66},91.66,null,1,12]
[null,"RB80-0301-073100","N",{"$f":"IF(AND(OR(T_NAV_AU[[#This Row],[ColourOptions]]=\"M\",T_NAV_AU[[#This Row],[ColourOptions]]=\"Y\"),MID(T_NAV_AU[[#This Row],[No.]],11,3)=\"069\"),REPLACE(T_NAV_AU[[#This Row],[No.]],11,3,\"xxx\"),T_NAV_AU[[#This Row],[No.]])","v":"RB80-0301-073100"},"Extreme Universal Drive Wheel | S100","073","Grey Cloud",{"$f":"IF(T_NAV_AU[[#This Row],[ColourOptions]]=\"M\",\"as per catalogue\",IF(T_NAV_AU[[#This Row],[Colour Description]]=\"Pure White\", \"Powdercoat, as per catalogue\", T_NAV_AU[[#This Row],[Colour Description]]))","v":"Grey Cloud"},"PIECE",{"$f":"IF(T_NAV_AU[[#This Row],[CustomPricing]]<>\"\",T_NAV_AU[[#This Row],[CustomPricing]],T_NAV_AU[[#This Row],[AUD_Original]])","v":15.37},15.37,null,1,8]
[null,"RB80-0411-025050","N",{"$f":"IF(AND(OR(T_NAV_AU[[#This Row],[ColourOptions]]=\"M\",T_NAV_AU[[#This Row],[ColourOptions]]=\"Y\"),MID(T_NAV_AU[[#This Row],[No.]],11,3)=\"069\"),REPLACE(T_NAV_AU[[#This Row],[No.]],11,3,\"xxx\"),T_NAV_AU[[#This Row],[No.]])","v":"RB80-0411-025050"},"Zamak Adaptor Spacer","025","Silver ZINC Plated",{"$f":"IF(T_NAV_AU[[#This Row],[ColourOptions]]=\"M\",\"as per catalogue\",IF(T_NAV_AU[[#This Row],[Colour Description]]=\"Pure White\", \"Powdercoat, as per catalogue\", T_NAV_AU[[#This Row],[Colour Description]]))","v":"Silver ZINC Plated"},"PIECE",{"$f":"IF(T_NAV_AU[[#This Row],[CustomPricing]]<>\"\",T_NAV_AU[[#This Row],[CustomPricing]],T_NAV_AU[[#This Row],[AUD_Original]])","v":16.75},16.75,null,1,20]
[null,"RB80-0476-025100","N",{"$f":"IF(AND(OR(T_NAV_AU[[#This Row],[ColourOptions]]=\"M\",T_NAV_AU[[#This Row],[ColourOptions]]=\"Y\"),MID(T_NAV_AU[[#This Row],[No.]],11,3)=\"069\"),REPLACE(T_NAV_AU[[#This Row],[No.]],11,3,\"xxx\"),T_NAV_AU[[#This Row],[No.]])","v":"RB80-0476-025100"},"MOTOR Ext Wire Guide Brkt. Adap Kit - Top/Face Fix","025","Silver ZINC Plated",{"$f":"IF(T_NAV_AU[[#This Row],[ColourOptions]]=\"M\",\"as per catalogue\",IF(T_NAV_AU[[#This Row],[Colour Description]]=\"Pure White\", \"Powdercoat, as per catalogue\", T_NAV_AU[[#This Row],[Colour Description]]))","v":"Silver ZINC Plated"},"KIT",{"$f":"IF(T_NAV_AU[[#This Row],[CustomPricing]]<>\"\",T_NAV_AU[[#This Row],[CustomPricing]],T_NAV_AU[[#This Row],[AUD_Original]])","v":51.66},51.66,null,1,20]
[null,"RB80-0476-069100","Y",{"$f":"IF(AND(OR(T_NAV_AU[[#This Row],[ColourOptions]]=\"M\",T_NAV_AU[[#This Row],[ColourOptions]]=\"Y\"),MID(T_NAV_AU[[#This Row],[No.]],11,3)=\"069\"),REPLACE(T_NAV_AU[[#This Row],[No.]],11,3,\"xxx\"),T_NAV_AU[[#This Row],[No.]])","v":"RB80-0476-xxx100"},"MOTOR Ext Wire Guide Brkt. Adap Kit - Top/Face Fix","069","Pure White",{"$f":"IF(T_NAV_AU[[#This Row],[ColourOptions]]=\"M\",\"as per catalogue\",IF(T_NAV_AU[[#This Row],[Colour Description]]=\"Pure White\", \"Powdercoat, as per catalogue\", T_NAV_AU[[#This Row],[Colour Description]]))","v":"Powdercoat, as per catalogue"},"KIT",{"$f":"IF(T_NAV_AU[[#This Row],[CustomPricing]]<>\"\",T_NAV_AU[[#This Row],[CustomPricing]],T_NAV_AU[[#This Row],[AUD_Original]])","v":58.69},58.69,null,1,20]
[null,"RB80-0478-025100","N",{"$f":"IF(AND(OR(T_NAV_AU[[#This Row],[ColourOptions]]=\"M\",T_NAV_AU[[#This Row],[ColourOptions]]=\"Y\"),MID(T_NAV_AU[[#This Row],[No.]],11,3)=\"069\"),REPLACE(T_NAV_AU[[#This Row],[No.]],11,3,\"xxx\"),T_NAV_AU[[#This Row],[No.]])","v":"RB80-0478-025100"},"Motor Extreme Recess Fix Bracket Kit | S100","025","Silver ZINC Plated",{"$f":"IF(T_NAV_AU[[#This Row],[ColourOptions]]=\"M\",\"as per catalogue\",IF(T_NAV_AU[[#This Row],[Colour Description]]=\"Pure White\", \"Powdercoat, as per catalogue\", T_NAV_AU[[#This Row],[Colour Description]]))","v":"Silver ZINC Plated"},"KIT",{"$f":"IF(T_NAV_AU[[#This Row],[CustomPricing]]<>\"\",T_NAV_AU[[#This Row],[CustomPricing]],T_NAV_AU[[#This Row],[AUD_Original]])","v":94.04},94.04,null,1,10]
[null,"RB80-0478-069100","N",{"$f":"IF(AND(OR(T_NAV_AU[[#This Row],[ColourOptions]]=\"M\",T_NAV_AU[[#This Row],[ColourOptions]]=\"Y\"),MID(T_NAV_AU[[#This Row],[No.]],11,3)=\"069\"),REPLACE(T_NAV_AU[[#This Row],[No.]],11,3,\"xxx\"),T_NAV_AU[[#This Row],[No.]])","v":"RB80-0478-069100"},"Motor Extreme Recess Fix Bracket Kit | S100","069","Pure White",{"$f":"IF(T_NAV_AU[[#This Row],[ColourOptions]]=\"M\",\"as per catalogue\",IF(T_NAV_AU[[#This Row],[Colour Description]]=\"Pure White\", \"Powdercoat, as per catalogue\", T_NAV_AU[[#This Row],[Colour Description]]))","v":"Powdercoat, as per catalogue"},"KIT",{"$f":"IF(T_NAV_AU[[#This Row],[CustomPricing]]<>\"\",T_NAV_AU[[#This Row],[CustomPricing]],T_NAV_AU[[#This Row],[AUD_Original]])","v":110.7},110.7,null,1,10]
[null,"RB80-0481-012000","N",{"$f":"IF(AND(OR(T_NAV_AU[[#This Row],[ColourOptions]]=\"M\",T_NAV_AU[[#This Row],[ColourOptions]]=\"Y\"),MID(T_NAV_AU[[#This Row],[No.]],11,3)=\"069\"),REPLACE(T_NAV_AU[[#This Row],[No.]],11,3,\"xxx\"),T_NAV_AU[[#This Row],[No.]])","v":"RB80-0481-012000"},"Box 190 Wire Guide Adaptor Plate with Screws","012","S/S 304, Satin",{"$f":"IF(T_NAV_AU[[#This Row],[ColourOptions]]=\"M\",\"as per catalogue\",IF(T_NAV_AU[[#This Row],[Colour Description]]=\"Pure White\", \"Powdercoat, as per catalogue\", T_NAV_AU[[#This Row],[Colour Description]]))","v":"S/S 304, Satin"},"SET",{"$f":"IF(T_NAV_AU[[#This Row],[CustomPricing]]<>\"\",T_NAV_AU[[#This Row],[CustomPricing]],T_NAV_AU[[#This Row],[AUD_Original]])","v":14.28},14.28,null,2,100]
[null,"RB80-0501-050110","N",{"$f":"IF(AND(OR(T_NAV_AU[[#This Row],[ColourOptions]]=\"M\",T_NAV_AU[[#This Row],[ColourOptions]]=\"Y\"),MID(T_NAV_AU[[#This Row],[No.]],11,3)=\"069\"),REPLACE(T_NAV_AU[[#This Row],[No.]],11,3,\"xxx\"),T_NAV_AU[[#This Row],[No.]])","v":"RB80-0501-050110"},"Extreme Zipscreen Reducer Set + Screws | 110mm","050","Black, Satin",{"$f":"IF(T_NAV_AU[[#This Row],[ColourOptions]]=\"M\",\"as per catalogue\",IF(T_NAV_AU[[#This Row],[Colour Description]]=\"Pure White\", \"Powdercoat, as per catalogue\", T_NAV_AU[[#This Row],[Colour Description]]))","v":"Black, Satin"},"SET",{"$f":"IF(T_NAV_AU[[#This Row],[CustomPricing]]<>\"\",T_NAV_AU[[#This Row],[CustomPricing]],T_NAV_AU[[#This Row],[AUD_Original]])","v":9.2899999999999991},9.2899999999999991,null,2,100]
[null,"RB80-0501-050130","N",{"$f":"IF(AND(OR(T_NAV_AU[[#This Row],[ColourOptions]]=\"M\",T_NAV_AU[[#This Row],[ColourOptions]]=\"Y\"),MID(T_NAV_AU[[#This Row],[No.]],11,3)=\"069\"),REPLACE(T_NAV_AU[[#This Row],[No.]],11,3,\"xxx\"),T_NAV_AU[[#This Row],[No.]])","v":"RB80-0501-050130"},"Extreme Zipscreen Reducer Set + Screws | 130mm","050","Black, Satin",{"$f":"IF(T_NAV_AU[[#This Row],[ColourOptions]]=\"M\",\"as per catalogue\",IF(T_NAV_AU[[#This Row],[Colour Description]]=\"Pure White\", \"Powdercoat, as per catalogue\", T_NAV_AU[[#This Row],[Colour Description]]))","v":"Black, Satin"},"SET",{"$f":"IF(T_NAV_AU[[#This Row],[CustomPricing]]<>\"\",T_NAV_AU[[#This Row],[CustomPricing]],T_NAV_AU[[#This Row],[AUD_Original]])","v":11.28},11.28,null,2,100]
[null,"RB80-0501-050160","N",{"$f":"IF(AND(OR(T_NAV_AU[[#This Row],[ColourOptions]]=\"M\",T_NAV_AU[[#This Row],[ColourOptions]]=\"Y\"),MID(T_NAV_AU[[#This Row],[No.]],11,3)=\"069\"),REPLACE(T_NAV_AU[[#This Row],[No.]],11,3,\"xxx\"),T_NAV_AU[[#This Row],[No.]])","v":"RB80-0501-050160"},"Extreme Zipscreen Reducer Set + Screws | 160mm","050","Black, Satin",{"$f":"IF(T_NAV_AU[[#This Row],[ColourOptions]]=\"M\",\"as per catalogue\",IF(T_NAV_AU[[#This Row],[Colour Description]]=\"Pure White\", \"Powdercoat, as per catalogue\", T_NAV_AU[[#This Row],[Colour Description]]))","v":"Black, Satin"},"SET",{"$f":"IF(T_NAV_AU[[#This Row],[CustomPricing]]<>\"\",T_NAV_AU[[#This Row],[CustomPricing]],T_NAV_AU[[#This Row],[AUD_Original]])","v":13.25},13.25,null,2,100]
[null,"RB80-0601-073110","N",{"$f":"IF(AND(OR(T_NAV_AU[[#This Row],[ColourOptions]]=\"M\",T_NAV_AU[[#This Row],[ColourOptions]]=\"Y\"),MID(T_NAV_AU[[#This Row],[No.]],11,3)=\"069\"),REPLACE(T_NAV_AU[[#This Row],[No.]],11,3,\"xxx\"),T_NAV_AU[[#This Row],[No.]])","v":"RB80-0601-073110"},"Extreme W/G Tube End Plate Set + Screws | 110mm","073","Grey Cloud",{"$f":"IF(T_NAV_AU[[#This Row],[ColourOptions]]=\"M\",\"as per catalogue\",IF(T_NAV_AU[[#This Row],[Colour Description]]=\"Pure White\", \"Powdercoat, as per catalogue\", T_NAV_AU[[#This Row],[Colour Description]]))","v":"Grey Cloud"},"SET",{"$f":"IF(T_NAV_AU[[#This Row],[CustomPricing]]<>\"\",T_NAV_AU[[#This Row],[CustomPricing]],T_NAV_AU[[#This Row],[AUD_Original]])","v":5.58},5.58,null,1,40]
[null,"RB80-0601-073130","N",{"$f":"IF(AND(OR(T_NAV_AU[[#This Row],[ColourOptions]]=\"M\",T_NAV_AU[[#This Row],[ColourOptions]]=\"Y\"),MID(T_NAV_AU[[#This Row],[No.]],11,3)=\"069\"),REPLACE(T_NAV_AU[[#This Row],[No.]],11,3,\"xxx\"),T_NAV_AU[[#This Row],[No.]])","v":"RB80-0601-073130"},"Extreme W/G Tube End Plate Set + Screws | 130mm","073","Grey Cloud",{"$f":"IF(T_NAV_AU[[#This Row],[ColourOptions]]=\"M\",\"as per catalogue\",IF(T_NAV_AU[[#This Row],[Colour Description]]=\"Pure White\", \"Powdercoat, as per catalogue\", T_NAV_AU[[#This Row],[Colour Description]]))","v":"Grey Cloud"},"SET",{"$f":"IF(T_NAV_AU[[#This Row],[CustomPricing]]<>\"\",T_NAV_AU[[#This Row],[CustomPricing]],T_NAV_AU[[#This Row],[AUD_Original]])","v":8.36},8.36,null,1,40]
[null,"RB80-0601-073160","N",{"$f":"IF(AND(OR(T_NAV_AU[[#This Row],[ColourOptions]]=\"M\",T_NAV_AU[[#This Row],[ColourOptions]]=\"Y\"),MID(T_NAV_AU[[#This Row],[No.]],11,3)=\"069\"),REPLACE(T_NAV_AU[[#This Row],[No.]],11,3,\"xxx\"),T_NAV_AU[[#This Row],[No.]])","v":"RB80-0601-073160"},"Extreme W/G Tube End Plate Set + Screws | 160mm","073","Grey Cloud",{"$f":"IF(T_NAV_AU[[#This Row],[ColourOptions]]=\"M\",\"as per catalogue\",IF(T_NAV_AU[[#This Row],[Colour Description]]=\"Pure White\", \"Powdercoat, as per catalogue\", T_NAV_AU[[#This Row],[Colour Description]]))","v":"Grey Cloud"},"SET",{"$f":"IF(T_NAV_AU[[#This Row],[CustomPricing]]<>\"\",T_NAV_AU[[#This Row],[CustomPricing]],T_NAV_AU[[#This Row],[AUD_Original]])","v":11.14},11.14,null,1,40]
[null,"RB80-0701-073100","N",{"$f":"IF(AND(OR(T_NAV_AU[[#This Row],[ColourOptions]]=\"M\",T_NAV_AU[[#This Row],[ColourOptions]]=\"Y\"),MID(T_NAV_AU[[#This Row],[No.]],11,3)=\"069\"),REPLACE(T_NAV_AU[[#This Row],[No.]],11,3,\"xxx\"),T_NAV_AU[[#This Row],[No.]])","v":"RB80-0701-073100"},"Extreme Universal Crown Wheel | S100","073","Grey Cloud",{"$f":"IF(T_NAV_AU[[#This Row],[ColourOptions]]=\"M\",\"as per catalogue\",IF(T_NAV_AU[[#This Row],[Colour Description]]=\"Pure White\", \"Powdercoat, as per catalogue\", T_NAV_AU[[#This Row],[Colour Description]]))","v":"Grey Cloud"},"PIECE",{"$f":"IF(T_NAV_AU[[#This Row],[CustomPricing]]<>\"\",T_NAV_AU[[#This Row],[CustomPricing]],T_NAV_AU[[#This Row],[AUD_Original]])","v":28.62},28.62,null,1,12]
[null,"RB80-1201-000109","N",{"$f":"IF(AND(OR(T_NAV_AU[[#This Row],[ColourOptions]]=\"M\",T_NAV_AU[[#This Row],[ColourOptions]]=\"Y\"),MID(T_NAV_AU[[#This Row],[No.]],11,3)=\"069\"),REPLACE(T_NAV_AU[[#This Row],[No.]],11,3,\"xxx\"),T_NAV_AU[[#This Row],[No.]])","v":"RB80-1201-000109"},"Extreme Top/Face Fix Brkt Set 2pc + Adapter | S100","000","Mill Finish",{"$f":"IF(T_NAV_AU[[#This Row],[ColourOptions]]=\"M\",\"as per catalogue\",IF(T_NAV_AU[[#This Row],[Colour Description]]=\"Pure White\", \"Powdercoat, as per catalogue\", T_NAV_AU[[#This Row],[Colour Description]]))","v":"Mill Finish"},"SET",{"$f":"IF(T_NAV_AU[[#This Row],[CustomPricing]]<>\"\",T_NAV_AU[[#This Row],[CustomPricing]],T_NAV_AU[[#This Row],[AUD_Original]])","v":94.09},94.09,null,1,12]
[null,"RB80-1201-069109","Y",{"$f":"IF(AND(OR(T_NAV_AU[[#This Row],[ColourOptions]]=\"M\",T_NAV_AU[[#This Row],[ColourOptions]]=\"Y\"),MID(T_NAV_AU[[#This Row],[No.]],11,3)=\"069\"),REPLACE(T_NAV_AU[[#This Row],[No.]],11,3,\"xxx\"),T_NAV_AU[[#This Row],[No.]])","v":"RB80-1201-xxx109"},"Extreme Top/Face Fix Brkt Set 2pc + Adapter | S100","069","Pure White",{"$f":"IF(T_NAV_AU[[#This Row],[ColourOptions]]=\"M\",\"as per catalogue\",IF(T_NAV_AU[[#This Row],[Colour Description]]=\"Pure White\", \"Powdercoat, as per catalogue\", T_NAV_AU[[#This Row],[Colour Description]]))","v":"Powdercoat, as per catalogue"},"SET",{"$f":"IF(T_NAV_AU[[#This Row],[CustomPricing]]<>\"\",T_NAV_AU[[#This Row],[CustomPricing]],T_NAV_AU[[#This Row],[AUD_Original]])","v":121.3},121.3,null,1,12]
[null,"RB80-1503-025110","N",{"$f":"IF(AND(OR(T_NAV_AU[[#This Row],[ColourOptions]]=\"M\",T_NAV_AU[[#This Row],[ColourOptions]]=\"Y\"),MID(T_NAV_AU[[#This Row],[No.]],11,3)=\"069\"),REPLACE(T_NAV_AU[[#This Row],[No.]],11,3,\"xxx\"),T_NAV_AU[[#This Row],[No.]])","v":"RB80-1503-025110"},"Extreme Bracket Adaptor Kit (Motor & Idler Plate)","025","Silver ZINC Plated",{"$f":"IF(T_NAV_AU[[#This Row],[ColourOptions]]=\"M\",\"as per catalogue\",IF(T_NAV_AU[[#This Row],[Colour Description]]=\"Pure White\", \"Powdercoat, as per catalogue\", T_NAV_AU[[#This Row],[Colour Description]]))","v":"Silver ZINC Plated"},"KIT",{"$f":"IF(T_NAV_AU[[#This Row],[CustomPricing]]<>\"\",T_NAV_AU[[#This Row],[CustomPricing]],T_NAV_AU[[#This Row],[AUD_Original]])","v":96.7},96.7,null,1,10]
[null,"RB80-1503-069110","Y",{"$f":"IF(AND(OR(T_NAV_AU[[#This Row],[ColourOptions]]=\"M\",T_NAV_AU[[#This Row],[ColourOptions]]=\"Y\"),MID(T_NAV_AU[[#This Row],[No.]],11,3)=\"069\"),REPLACE(T_NAV_AU[[#This Row],[No.]],11,3,\"xxx\"),T_NAV_AU[[#This Row],[No.]])","v":"RB80-1503-xxx110"},"Extreme Bracket Adaptor Kit (Motor & Idler Plate)","069","Pure White",{"$f":"IF(T_NAV_AU[[#This Row],[ColourOptions]]=\"M\",\"as per catalogue\",IF(T_NAV_AU[[#This Row],[Colour Description]]=\"Pure White\", \"Powdercoat, as per catalogue\", T_NAV_AU[[#This Row],[Colour Description]]))","v":"Powdercoat, as per catalogue"},"KIT",{"$f":"IF(T_NAV_AU[[#This Row],[CustomPricing]]<>\"\",T_NAV_AU[[#This Row],[CustomPricing]],T_NAV_AU[[#This Row],[AUD_Original]])","v":112.46},112.46,null,1,10]
[null,"RB91-3602-006040","N",{"$f":"IF(AND(OR(T_NAV_AU[[#This Row],[ColourOptions]]=\"M\",T_NAV_AU[[#This Row],[ColourOptions]]=\"Y\"),MID(T_NAV_AU[[#This Row],[No.]],11,3)=\"069\"),REPLACE(T_NAV_AU[[#This Row],[No.]],11,3,\"xxx\"),T_NAV_AU[[#This Row],[No.]])","v":"RB91-3602-006040"},"Wire Tensioning Guide (1x19) - 4mm | 50m Roll","006","S/S 316, Natural",{"$f":"IF(T_NAV_AU[[#This Row],[ColourOptions]]=\"M\",\"as per catalogue\",IF(T_NAV_AU[[#This Row],[Colour Description]]=\"Pure White\", \"Powdercoat, as per catalogue\", T_NAV_AU[[#This Row],[Colour Description]]))","v":"S/S 316, Natural"},"METRE",{"$f":"IF(T_NAV_AU[[#This Row],[CustomPricing]]<>\"\",T_NAV_AU[[#This Row],[CustomPricing]],T_NAV_AU[[#This Row],[AUD_Original]])","v":4.9000000000000004},4.9000000000000004,null,50,300]
[null,"RB91-3602-006041","N",{"$f":"IF(AND(OR(T_NAV_AU[[#This Row],[ColourOptions]]=\"M\",T_NAV_AU[[#This Row],[ColourOptions]]=\"Y\"),MID(T_NAV_AU[[#This Row],[No.]],11,3)=\"069\"),REPLACE(T_NAV_AU[[#This Row],[No.]],11,3,\"xxx\"),T_NAV_AU[[#This Row],[No.]])","v":"RB91-3602-006041"},"Wire Tensioning Guide (7x7) - 4mm PVC | 50m Roll","006","S/S 316, Natural",{"$f":"IF(T_NAV_AU[[#This Row],[ColourOptions]]=\"M\",\"as per catalogue\",IF(T_NAV_AU[[#This Row],[Colour Description]]=\"Pure White\", \"Powdercoat, as per catalogue\", T_NAV_AU[[#This Row],[Colour Description]]))","v":"S/S 316, Natural"},"METRE",{"$f":"IF(T_NAV_AU[[#This Row],[CustomPricing]]<>\"\",T_NAV_AU[[#This Row],[CustomPricing]],T_NAV_AU[[#This Row],[AUD_Original]])","v":8.81},8.81,null,50,300]
[null,"RB91-3602-010032","N",{"$f":"IF(AND(OR(T_NAV_AU[[#This Row],[ColourOptions]]=\"M\",T_NAV_AU[[#This Row],[ColourOptions]]=\"Y\"),MID(T_NAV_AU[[#This Row],[No.]],11,3)=\"069\"),REPLACE(T_NAV_AU[[#This Row],[No.]],11,3,\"xxx\"),T_NAV_AU[[#This Row],[No.]])","v":"RB91-3602-010032"},"Wire Tensioning Guide (1x19) - 3.2mm | 50m Roll","006","S/S 316, Natural",{"$f":"IF(T_NAV_AU[[#This Row],[ColourOptions]]=\"M\",\"as per catalogue\",IF(T_NAV_AU[[#This Row],[Colour Description]]=\"Pure White\", \"Powdercoat, as per catalogue\", T_NAV_AU[[#This Row],[Colour Description]]))","v":"S/S 316, Natural"},"METRE",{"$f":"IF(T_NAV_AU[[#This Row],[CustomPricing]]<>\"\",T_NAV_AU[[#This Row],[CustomPricing]],T_NAV_AU[[#This Row],[AUD_Original]])","v":3.91},3.91,null,50,300]
[null,"RB93-0110-000600","N",{"$f":"IF(AND(OR(T_NAV_AU[[#This Row],[ColourOptions]]=\"M\",T_NAV_AU[[#This Row],[ColourOptions]]=\"Y\"),MID(T_NAV_AU[[#This Row],[No.]],11,3)=\"069\"),REPLACE(T_NAV_AU[[#This Row],[No.]],11,3,\"xxx\"),T_NAV_AU[[#This Row],[No.]])","v":"RB93-0110-000600"},"S100 / STD Alum. Tube | 110mm x 6m","000","Mill Finish",{"$f":"IF(T_NAV_AU[[#This Row],[ColourOptions]]=\"M\",\"as per catalogue\",IF(T_NAV_AU[[#This Row],[Colour Description]]=\"Pure White\", \"Powdercoat, as per catalogue\", T_NAV_AU[[#This Row],[Colour Description]]))","v":"Mill Finish"},"LENGTH",{"$f":"IF(T_NAV_AU[[#This Row],[CustomPricing]]<>\"\",T_NAV_AU[[#This Row],[CustomPricing]],T_NAV_AU[[#This Row],[AUD_Original]])","v":389.05},389.05,null,2,12]
[null,"RB93-0130-000700","N",{"$f":"IF(AND(OR(T_NAV_AU[[#This Row],[ColourOptions]]=\"M\",T_NAV_AU[[#This Row],[ColourOptions]]=\"Y\"),MID(T_NAV_AU[[#This Row],[No.]],11,3)=\"069\"),REPLACE(T_NAV_AU[[#This Row],[No.]],11,3,\"xxx\"),T_NAV_AU[[#This Row],[No.]])","v":"RB93-0130-000700"},"S100 / HD Alum. Tube | 130mm x 7m","000","Mill Finish",{"$f":"IF(T_NAV_AU[[#This Row],[ColourOptions]]=\"M\",\"as per catalogue\",IF(T_NAV_AU[[#This Row],[Colour Description]]=\"Pure White\", \"Powdercoat, as per catalogue\", T_NAV_AU[[#This Row],[Colour Description]]))","v":"Mill Finish"},"LENGTH",{"$f":"IF(T_NAV_AU[[#This Row],[CustomPricing]]<>\"\",T_NAV_AU[[#This Row],[CustomPricing]],T_NAV_AU[[#This Row],[AUD_Original]])","v":711.64},711.64,null,1,9]
[null,"RB93-0160-000700","N",{"$f":"IF(AND(OR(T_NAV_AU[[#This Row],[ColourOptions]]=\"M\",T_NAV_AU[[#This Row],[ColourOptions]]=\"Y\"),MID(T_NAV_AU[[#This Row],[No.]],11,3)=\"069\"),REPLACE(T_NAV_AU[[#This Row],[No.]],11,3,\"xxx\"),T_NAV_AU[[#This Row],[No.]])","v":"RB93-0160-000700"},"S100 / XHD Alum. Tube | 160mm x 7m","000","Mill Finish",{"$f":"IF(T_NAV_AU[[#This Row],[ColourOptions]]=\"M\",\"as per catalogue\",IF(T_NAV_AU[[#This Row],[Colour Description]]=\"Pure White\", \"Powdercoat, as per catalogue\", T_NAV_AU[[#This Row],[Colour Description]]))","v":"Mill Finish"},"LENGTH",{"$f":"IF(T_NAV_AU[[#This Row],[CustomPricing]]<>\"\",T_NAV_AU[[#This Row],[CustomPricing]],T_NAV_AU[[#This Row],[AUD_Original]])","v":1072.3900000000001},1072.3900000000001,null,1,6]
[null,"RC91-0201-050000","N",{"$f":"IF(AND(OR(T_NAV_AU[[#This Row],[ColourOptions]]=\"M\",T_NAV_AU[[#This Row],[ColourOptions]]=\"Y\"),MID(T_NAV_AU[[#This Row],[No.]],11,3)=\"069\"),REPLACE(T_NAV_AU[[#This Row],[No.]],11,3,\"xxx\"),T_NAV_AU[[#This Row],[No.]])","v":"RC91-0201-050000"},"CF dim-OUT Side Guide Side Guide Lock","050","Black, Satin",{"$f":"IF(T_NAV_AU[[#This Row],[ColourOptions]]=\"M\",\"as per catalogue\",IF(T_NAV_AU[[#This Row],[Colour Description]]=\"Pure White\", \"Powdercoat, as per catalogue\", T_NAV_AU[[#This Row],[Colour Description]]))","v":"Black, Satin"},"Piece",{"$f":"IF(T_NAV_AU[[#This Row],[CustomPricing]]<>\"\",T_NAV_AU[[#This Row],[CustomPricing]],T_NAV_AU[[#This Row],[AUD_Original]])","v":0.3},0.3,null,200,5000]
[null,"RE01-0101-000580","N",{"$f":"IF(AND(OR(T_NAV_AU[[#This Row],[ColourOptions]]=\"M\",T_NAV_AU[[#This Row],[ColourOptions]]=\"Y\"),MID(T_NAV_AU[[#This Row],[No.]],11,3)=\"069\"),REPLACE(T_NAV_AU[[#This Row],[No.]],11,3,\"xxx\"),T_NAV_AU[[#This Row],[No.]])","v":"RE01-0101-000580"},"BOX 120 - Back Extrusion | 5.8m","000","Mill Finish",{"$f":"IF(T_NAV_AU[[#This Row],[ColourOptions]]=\"M\",\"as per catalogue\",IF(T_NAV_AU[[#This Row],[Colour Description]]=\"Pure White\", \"Powdercoat, as per catalogue\", T_NAV_AU[[#This Row],[Colour Description]]))","v":"Mill Finish"},"LENGTH",{"$f":"IF(T_NAV_AU[[#This Row],[CustomPricing]]<>\"\",T_NAV_AU[[#This Row],[CustomPricing]],T_NAV_AU[[#This Row],[AUD_Original]])","v":164.6},164.6,null,1,16]
[null,"RE01-0101-018580","N",{"$f":"IF(AND(OR(T_NAV_AU[[#This Row],[ColourOptions]]=\"M\",T_NAV_AU[[#This Row],[ColourOptions]]=\"Y\"),MID(T_NAV_AU[[#This Row],[No.]],11,3)=\"069\"),REPLACE(T_NAV_AU[[#This Row],[No.]],11,3,\"xxx\"),T_NAV_AU[[#This Row],[No.]])","v":"RE01-0101-018580"},"BOX 120 - Back Extrusion | 5.8m","018","Anodised 20",{"$f":"IF(T_NAV_AU[[#This Row],[ColourOptions]]=\"M\",\"as per catalogue\",IF(T_NAV_AU[[#This Row],[Colour Description]]=\"Pure White\", \"Powdercoat, as per catalogue\", T_NAV_AU[[#This Row],[Colour Description]]))","v":"Anodised 20"},"LENGTH",{"$f":"IF(T_NAV_AU[[#This Row],[CustomPricing]]<>\"\",T_NAV_AU[[#This Row],[CustomPricing]],T_NAV_AU[[#This Row],[AUD_Original]])","v":199.51},199.51,null,1,16]
[null,"RE01-0101-069580-PF","Y",{"$f":"IF(AND(OR(T_NAV_AU[[#This Row],[ColourOptions]]=\"M\",T_NAV_AU[[#This Row],[ColourOptions]]=\"Y\"),MID(T_NAV_AU[[#This Row],[No.]],11,3)=\"069\"),REPLACE(T_NAV_AU[[#This Row],[No.]],11,3,\"xxx\"),T_NAV_AU[[#This Row],[No.]])","v":"RE01-0101-xxx580-PF"},"BOX 120 - Back Extrusion w/ PF | 5.8m","069","Pure White",{"$f":"IF(T_NAV_AU[[#This Row],[ColourOptions]]=\"M\",\"as per catalogue\",IF(T_NAV_AU[[#This Row],[Colour Description]]=\"Pure White\", \"Powdercoat, as per catalogue\", T_NAV_AU[[#This Row],[Colour Description]]))","v":"Powdercoat, as per catalogue"},"LENGTH",{"$f":"IF(T_NAV_AU[[#This Row],[CustomPricing]]<>\"\",T_NAV_AU[[#This Row],[CustomPricing]],T_NAV_AU[[#This Row],[AUD_Original]])","v":199.51},199.51,null,1,16]
[null,"RE01-0102-000580","N",{"$f":"IF(AND(OR(T_NAV_AU[[#This Row],[ColourOptions]]=\"M\",T_NAV_AU[[#This Row],[ColourOptions]]=\"Y\"),MID(T_NAV_AU[[#This Row],[No.]],11,3)=\"069\"),REPLACE(T_NAV_AU[[#This Row],[No.]],11,3,\"xxx\"),T_NAV_AU[[#This Row],[No.]])","v":"RE01-0102-000580"},"BOX 120 - Front Cover FULL | 5.8m","000","Mill Finish",{"$f":"IF(T_NAV_AU[[#This Row],[ColourOptions]]=\"M\",\"as per catalogue\",IF(T_NAV_AU[[#This Row],[Colour Description]]=\"Pure White\", \"Powdercoat, as per catalogue\", T_NAV_AU[[#This Row],[Colour Description]]))","v":"Mill Finish"},"LENGTH",{"$f":"IF(T_NAV_AU[[#This Row],[CustomPricing]]<>\"\",T_NAV_AU[[#This Row],[CustomPricing]],T_NAV_AU[[#This Row],[AUD_Original]])","v":112.23},112.23,null,2,32]
[null,"RE01-0102-018580","N",{"$f":"IF(AND(OR(T_NAV_AU[[#This Row],[ColourOptions]]=\"M\",T_NAV_AU[[#This Row],[ColourOptions]]=\"Y\"),MID(T_NAV_AU[[#This Row],[No.]],11,3)=\"069\"),REPLACE(T_NAV_AU[[#This Row],[No.]],11,3,\"xxx\"),T_NAV_AU[[#This Row],[No.]])","v":"RE01-0102-018580"},"BOX 120 - Front Cover FULL | 5.8m","018","Anodised 20",{"$f":"IF(T_NAV_AU[[#This Row],[ColourOptions]]=\"M\",\"as per catalogue\",IF(T_NAV_AU[[#This Row],[Colour Description]]=\"Pure White\", \"Powdercoat, as per catalogue\", T_NAV_AU[[#This Row],[Colour Description]]))","v":"Anodised 20"},"LENGTH",{"$f":"IF(T_NAV_AU[[#This Row],[CustomPricing]]<>\"\",T_NAV_AU[[#This Row],[CustomPricing]],T_NAV_AU[[#This Row],[AUD_Original]])","v":143.41},143.41,null,2,32]
[null,"RE01-0102-069580-PF","Y",{"$f":"IF(AND(OR(T_NAV_AU[[#This Row],[ColourOptions]]=\"M\",T_NAV_AU[[#This Row],[ColourOptions]]=\"Y\"),MID(T_NAV_AU[[#This Row],[No.]],11,3)=\"069\"),REPLACE(T_NAV_AU[[#This Row],[No.]],11,3,\"xxx\"),T_NAV_AU[[#This Row],[No.]])","v":"RE01-0102-xxx580-PF"},"BOX 120 - Front Cover FULL w/ PF | 5.8m","069","Pure White",{"$f":"IF(T_NAV_AU[[#This Row],[ColourOptions]]=\"M\",\"as per catalogue\",IF(T_NAV_AU[[#This Row],[Colour Description]]=\"Pure White\", \"Powdercoat, as per catalogue\", T_NAV_AU[[#This Row],[Colour Description]]))","v":"Powdercoat, as per catalogue"},"LENGTH",{"$f":"IF(T_NAV_AU[[#This Row],[CustomPricing]]<>\"\",T_NAV_AU[[#This Row],[CustomPricing]],T_NAV_AU[[#This Row],[AUD_Original]])","v":143.41},143.41,null,2,32]
[null,"RE01-0103-000580","N",{"$f":"IF(AND(OR(T_NAV_AU[[#This Row],[ColourOptions]]=\"M\",T_NAV_AU[[#This Row],[ColourOptions]]=\"Y\"),MID(T_NAV_AU[[#This Row],[No.]],11,3)=\"069\"),REPLACE(T_NAV_AU[[#This Row],[No.]],11,3,\"xxx\"),T_NAV_AU[[#This Row],[No.]])","v":"RE01-0103-000580"},"BOX 120 - Front Cover SEMI | 5.8m","000","Mill Finish",{"$f":"IF(T_NAV_AU[[#This Row],[ColourOptions]]=\"M\",\"as per catalogue\",IF(T_NAV_AU[[#This Row],[Colour Description]]=\"Pure White\", \"Powdercoat, as per catalogue\", T_NAV_AU[[#This Row],[Colour Description]]))","v":"Mill Finish"},"LENGTH",{"$f":"IF(T_NAV_AU[[#This Row],[CustomPricing]]<>\"\",T_NAV_AU[[#This Row],[CustomPricing]],T_NAV_AU[[#This Row],[AUD_Original]])","v":93.53},93.53,null,4,64]
[null,"RE01-0103-018580","N",{"$f":"IF(AND(OR(T_NAV_AU[[#This Row],[ColourOptions]]=\"M\",T_NAV_AU[[#This Row],[ColourOptions]]=\"Y\"),MID(T_NAV_AU[[#This Row],[No.]],11,3)=\"069\"),REPLACE(T_NAV_AU[[#This Row],[No.]],11,3,\"xxx\"),T_NAV_AU[[#This Row],[No.]])","v":"RE01-0103-018580"},"BOX 120 - Front Cover SEMI | 5.8m","018","Anodised 20",{"$f":"IF(T_NAV_AU[[#This Row],[ColourOptions]]=\"M\",\"as per catalogue\",IF(T_NAV_AU[[#This Row],[Colour Description]]=\"Pure White\", \"Powdercoat, as per catalogue\", T_NAV_AU[[#This Row],[Colour Description]]))","v":"Anodised 20"},"LENGTH",{"$f":"IF(T_NAV_AU[[#This Row],[CustomPricing]]<>\"\",T_NAV_AU[[#This Row],[CustomPricing]],T_NAV_AU[[#This Row],[AUD_Original]])","v":124.7},124.7,null,4,64]
[null,"RE01-0103-069580-PF","Y",{"$f":"IF(AND(OR(T_NAV_AU[[#This Row],[ColourOptions]]=\"M\",T_NAV_AU[[#This Row],[ColourOptions]]=\"Y\"),MID(T_NAV_AU[[#This Row],[No.]],11,3)=\"069\"),REPLACE(T_NAV_AU[[#This Row],[No.]],11,3,\"xxx\"),T_NAV_AU[[#This Row],[No.]])","v":"RE01-0103-xxx580-PF"},"BOX 120 - Front Cover SEMI with P/F | 5.8m","069","Pure White",{"$f":"IF(T_NAV_AU[[#This Row],[ColourOptions]]=\"M\",\"as per catalogue\",IF(T_NAV_AU[[#This Row],[Colour Description]]=\"Pure White\", \"Powdercoat, as per catalogue\", T_NAV_AU[[#This Row],[Colour Description]]))","v":"Powdercoat, as per catalogue"},"LENGTH",{"$f":"IF(T_NAV_AU[[#This Row],[CustomPricing]]<>\"\",T_NAV_AU[[#This Row],[CustomPricing]],T_NAV_AU[[#This Row],[AUD_Original]])","v":124.7},124.7,null,4,64]
[null,"RE01-0106-000700","N",{"$f":"IF(AND(OR(T_NAV_AU[[#This Row],[ColourOptions]]=\"M\",T_NAV_AU[[#This Row],[ColourOptions]]=\"Y\"),MID(T_NAV_AU[[#This Row],[No.]],11,3)=\"069\"),REPLACE(T_NAV_AU[[#This Row],[No.]],11,3,\"xxx\"),T_NAV_AU[[#This Row],[No.]])","v":"RE01-0106-000700"},"BOX 190 - Universal Extrusion | 7m","000","Mill Finish",{"$f":"IF(T_NAV_AU[[#This Row],[ColourOptions]]=\"M\",\"as per catalogue\",IF(T_NAV_AU[[#This Row],[Colour Description]]=\"Pure White\", \"Powdercoat, as per catalogue\", T_NAV_AU[[#This Row],[Colour Description]]))","v":"Mill Finish"},"LENGTH",{"$f":"IF(T_NAV_AU[[#This Row],[CustomPricing]]<>\"\",T_NAV_AU[[#This Row],[CustomPricing]],T_NAV_AU[[#This Row],[AUD_Original]])","v":249.39},249.39,null,1,24]
[null,"RE01-0106-018700","N",{"$f":"IF(AND(OR(T_NAV_AU[[#This Row],[ColourOptions]]=\"M\",T_NAV_AU[[#This Row],[ColourOptions]]=\"Y\"),MID(T_NAV_AU[[#This Row],[No.]],11,3)=\"069\"),REPLACE(T_NAV_AU[[#This Row],[No.]],11,3,\"xxx\"),T_NAV_AU[[#This Row],[No.]])","v":"RE01-0106-018700"},"BOX 190 - Universal Extrusion | 7m","018","Anodised 20",{"$f":"IF(T_NAV_AU[[#This Row],[ColourOptions]]=\"M\",\"as per catalogue\",IF(T_NAV_AU[[#This Row],[Colour Description]]=\"Pure White\", \"Powdercoat, as per catalogue\", T_NAV_AU[[#This Row],[Colour Description]]))","v":"Anodised 20"},"LENGTH",{"$f":"IF(T_NAV_AU[[#This Row],[CustomPricing]]<>\"\",T_NAV_AU[[#This Row],[CustomPricing]],T_NAV_AU[[#This Row],[AUD_Original]])","v":374.09},374.09,null,1,24]
[null,"RE01-0106-069700-PF","Y",{"$f":"IF(AND(OR(T_NAV_AU[[#This Row],[ColourOptions]]=\"M\",T_NAV_AU[[#This Row],[ColourOptions]]=\"Y\"),MID(T_NAV_AU[[#This Row],[No.]],11,3)=\"069\"),REPLACE(T_NAV_AU[[#This Row],[No.]],11,3,\"xxx\"),T_NAV_AU[[#This Row],[No.]])","v":"RE01-0106-xxx700-PF"},"BOX 190 - Universal Extrusion w/ PF | 7m","069","Pure White",{"$f":"IF(T_NAV_AU[[#This Row],[ColourOptions]]=\"M\",\"as per catalogue\",IF(T_NAV_AU[[#This Row],[Colour Description]]=\"Pure White\", \"Powdercoat, as per catalogue\", T_NAV_AU[[#This Row],[Colour Description]]))","v":"Powdercoat, as per catalogue"},"LENGTH",{"$f":"IF(T_NAV_AU[[#This Row],[CustomPricing]]<>\"\",T_NAV_AU[[#This Row],[CustomPricing]],T_NAV_AU[[#This Row],[AUD_Original]])","v":311.74},311.74,null,1,24]
[null,"RE01-0107-000700","N",{"$f":"IF(AND(OR(T_NAV_AU[[#This Row],[ColourOptions]]=\"M\",T_NAV_AU[[#This Row],[ColourOptions]]=\"Y\"),MID(T_NAV_AU[[#This Row],[No.]],11,3)=\"069\"),REPLACE(T_NAV_AU[[#This Row],[No.]],11,3,\"xxx\"),T_NAV_AU[[#This Row],[No.]])","v":"RE01-0107-000700"},"BOX 190 - Front Cover | 7m","000","Mill Finish",{"$f":"IF(T_NAV_AU[[#This Row],[ColourOptions]]=\"M\",\"as per catalogue\",IF(T_NAV_AU[[#This Row],[Colour Description]]=\"Pure White\", \"Powdercoat, as per catalogue\", T_NAV_AU[[#This Row],[Colour Description]]))","v":"Mill Finish"},"LENGTH",{"$f":"IF(T_NAV_AU[[#This Row],[CustomPricing]]<>\"\",T_NAV_AU[[#This Row],[CustomPricing]],T_NAV_AU[[#This Row],[AUD_Original]])","v":342.92},342.92,null,1,12]
[null,"RE01-0107-018700","N",{"$f":"IF(AND(OR(T_NAV_AU[[#This Row],[ColourOptions]]=\"M\",T_NAV_AU[[#This Row],[ColourOptions]]=\"Y\"),MID(T_NAV_AU[[#This Row],[No.]],11,3)=\"069\"),REPLACE(T_NAV_AU[[#This Row],[No.]],11,3,\"xxx\"),T_NAV_AU[[#This Row],[No.]])","v":"RE01-0107-018700"},"BOX 190 - Front Cover | 7m","018","Anodised 20",{"$f":"IF(T_NAV_AU[[#This Row],[ColourOptions]]=\"M\",\"as per catalogue\",IF(T_NAV_AU[[#This Row],[Colour Description]]=\"Pure White\", \"Powdercoat, as per catalogue\", T_NAV_AU[[#This Row],[Colour Description]]))","v":"Anodised 20"},"LENGTH",{"$f":"IF(T_NAV_AU[[#This Row],[CustomPricing]]<>\"\",T_NAV_AU[[#This Row],[CustomPricing]],T_NAV_AU[[#This Row],[AUD_Original]])","v":498.78},498.78,null,1,12]
[null,"RE01-0107-069700-PF","Y",{"$f":"IF(AND(OR(T_NAV_AU[[#This Row],[ColourOptions]]=\"M\",T_NAV_AU[[#This Row],[ColourOptions]]=\"Y\"),MID(T_NAV_AU[[#This Row],[No.]],11,3)=\"069\"),REPLACE(T_NAV_AU[[#This Row],[No.]],11,3,\"xxx\"),T_NAV_AU[[#This Row],[No.]])","v":"RE01-0107-xxx700-PF"},"BOX 190 - Front Cover w/ PF | 7m","069","Pure White",{"$f":"IF(T_NAV_AU[[#This Row],[ColourOptions]]=\"M\",\"as per catalogue\",IF(T_NAV_AU[[#This Row],[Colour Description]]=\"Pure White\", \"Powdercoat, as per catalogue\", T_NAV_AU[[#This Row],[Colour Description]]))","v":"Powdercoat, as per catalogue"},"LENGTH",{"$f":"IF(T_NAV_AU[[#This Row],[CustomPricing]]<>\"\",T_NAV_AU[[#This Row],[CustomPricing]],T_NAV_AU[[#This Row],[AUD_Original]])","v":436.44},436.44,null,1,12]
[null,"RE01-0203-050063","N",{"$f":"IF(AND(OR(T_NAV_AU[[#This Row],[ColourOptions]]=\"M\",T_NAV_AU[[#This Row],[ColourOptions]]=\"Y\"),MID(T_NAV_AU[[#This Row],[No.]],11,3)=\"069\"),REPLACE(T_NAV_AU[[#This Row],[No.]],11,3,\"xxx\"),T_NAV_AU[[#This Row],[No.]])","v":"RE01-0203-050063"},"Bearing Idler | 63mm","050","Black, Satin",{"$f":"IF(T_NAV_AU[[#This Row],[ColourOptions]]=\"M\",\"as per catalogue\",IF(T_NAV_AU[[#This Row],[Colour Description]]=\"Pure White\", \"Powdercoat, as per catalogue\", T_NAV_AU[[#This Row],[Colour Description]]))","v":"Black, Satin"},"PIECE",{"$f":"IF(T_NAV_AU[[#This Row],[CustomPricing]]<>\"\",T_NAV_AU[[#This Row],[CustomPricing]],T_NAV_AU[[#This Row],[AUD_Original]])","v":20.239999999999998},20.239999999999998,null,10,50]
[null,"RE01-0214-050000","N",{"$f":"IF(AND(OR(T_NAV_AU[[#This Row],[ColourOptions]]=\"M\",T_NAV_AU[[#This Row],[ColourOptions]]=\"Y\"),MID(T_NAV_AU[[#This Row],[No.]],11,3)=\"069\"),REPLACE(T_NAV_AU[[#This Row],[No.]],11,3,\"xxx\"),T_NAV_AU[[#This Row],[No.]])","v":"RE01-0214-050000"},"External - Idler/Spring Adaptor Kit MKII","050","Black, Satin",{"$f":"IF(T_NAV_AU[[#This Row],[ColourOptions]]=\"M\",\"as per catalogue\",IF(T_NAV_AU[[#This Row],[Colour Description]]=\"Pure White\", \"Powdercoat, as per catalogue\", T_NAV_AU[[#This Row],[Colour Description]]))","v":"Black, Satin"},"SET",{"$f":"IF(T_NAV_AU[[#This Row],[CustomPricing]]<>\"\",T_NAV_AU[[#This Row],[CustomPricing]],T_NAV_AU[[#This Row],[AUD_Original]])","v":4.76},4.76,null,5,200]
[null,"RE01-0378-000580","N",{"$f":"IF(AND(OR(T_NAV_AU[[#This Row],[ColourOptions]]=\"M\",T_NAV_AU[[#This Row],[ColourOptions]]=\"Y\"),MID(T_NAV_AU[[#This Row],[No.]],11,3)=\"069\"),REPLACE(T_NAV_AU[[#This Row],[No.]],11,3,\"xxx\"),T_NAV_AU[[#This Row],[No.]])","v":"RE01-0378-000580"},"78 STD Alum. Tube | 80mm x 5.8m","000","Mill Finish",{"$f":"IF(T_NAV_AU[[#This Row],[ColourOptions]]=\"M\",\"as per catalogue\",IF(T_NAV_AU[[#This Row],[Colour Description]]=\"Pure White\", \"Powdercoat, as per catalogue\", T_NAV_AU[[#This Row],[Colour Description]]))","v":"Mill Finish"},"LENGTH",{"$f":"IF(T_NAV_AU[[#This Row],[CustomPricing]]<>\"\",T_NAV_AU[[#This Row],[CustomPricing]],T_NAV_AU[[#This Row],[AUD_Original]])","v":143.41},143.41,null,2,20]
[null,"RE01-0379-000600","N",{"$f":"IF(AND(OR(T_NAV_AU[[#This Row],[ColourOptions]]=\"M\",T_NAV_AU[[#This Row],[ColourOptions]]=\"Y\"),MID(T_NAV_AU[[#This Row],[No.]],11,3)=\"069\"),REPLACE(T_NAV_AU[[#This Row],[No.]],11,3,\"xxx\"),T_NAV_AU[[#This Row],[No.]])","v":"RE01-0379-000600"},"78 HD Alum. Tube | 82mm x 6m","000","Mill Finish",{"$f":"IF(T_NAV_AU[[#This Row],[ColourOptions]]=\"M\",\"as per catalogue\",IF(T_NAV_AU[[#This Row],[Colour Description]]=\"Pure White\", \"Powdercoat, as per catalogue\", T_NAV_AU[[#This Row],[Colour Description]]))","v":"Mill Finish"},"LENGTH",{"$f":"IF(T_NAV_AU[[#This Row],[CustomPricing]]<>\"\",T_NAV_AU[[#This Row],[CustomPricing]],T_NAV_AU[[#This Row],[AUD_Original]])","v":220.49},220.49,null,2,20]
[null,"RE01-0405-050078","N",{"$f":"IF(AND(OR(T_NAV_AU[[#This Row],[ColourOptions]]=\"M\",T_NAV_AU[[#This Row],[ColourOptions]]=\"Y\"),MID(T_NAV_AU[[#This Row],[No.]],11,3)=\"069\"),REPLACE(T_NAV_AU[[#This Row],[No.]],11,3,\"xxx\"),T_NAV_AU[[#This Row],[No.]])","v":"RE01-0405-050078"},"78mm Booster Tail Adaptor","050","Black, Satin",{"$f":"IF(T_NAV_AU[[#This Row],[ColourOptions]]=\"M\",\"as per catalogue\",IF(T_NAV_AU[[#This Row],[Colour Description]]=\"Pure White\", \"Powdercoat, as per catalogue\", T_NAV_AU[[#This Row],[Colour Description]]))","v":"Black, Satin"},"PIECE",{"$f":"IF(T_NAV_AU[[#This Row],[CustomPricing]]<>\"\",T_NAV_AU[[#This Row],[CustomPricing]],T_NAV_AU[[#This Row],[AUD_Original]])","v":2.38},2.38,null,4,200]
[null,"RE01-0411-050011","N",{"$f":"IF(AND(OR(T_NAV_AU[[#This Row],[ColourOptions]]=\"M\",T_NAV_AU[[#This Row],[ColourOptions]]=\"Y\"),MID(T_NAV_AU[[#This Row],[No.]],11,3)=\"069\"),REPLACE(T_NAV_AU[[#This Row],[No.]],11,3,\"xxx\"),T_NAV_AU[[#This Row],[No.]])","v":"RE01-0411-050011"},"External Booster Short LH | 63mm","050","Black, Satin",{"$f":"IF(T_NAV_AU[[#This Row],[ColourOptions]]=\"M\",\"as per catalogue\",IF(T_NAV_AU[[#This Row],[Colour Description]]=\"Pure White\", \"Powdercoat, as per catalogue\", T_NAV_AU[[#This Row],[Colour Description]]))","v":"Black, Satin"},"PIECE",{"$f":"IF(T_NAV_AU[[#This Row],[CustomPricing]]<>\"\",T_NAV_AU[[#This Row],[CustomPricing]],T_NAV_AU[[#This Row],[AUD_Original]])","v":40},40,null,4,40]
[null,"RE01-0411-050031","N",{"$f":"IF(AND(OR(T_NAV_AU[[#This Row],[ColourOptions]]=\"M\",T_NAV_AU[[#This Row],[ColourOptions]]=\"Y\"),MID(T_NAV_AU[[#This Row],[No.]],11,3)=\"069\"),REPLACE(T_NAV_AU[[#This Row],[No.]],11,3,\"xxx\"),T_NAV_AU[[#This Row],[No.]])","v":"RE01-0411-050031"},"External Booster Light LH | 63mm","050","Black, Satin",{"$f":"IF(T_NAV_AU[[#This Row],[ColourOptions]]=\"M\",\"as per catalogue\",IF(T_NAV_AU[[#This Row],[Colour Description]]=\"Pure White\", \"Powdercoat, as per catalogue\", T_NAV_AU[[#This Row],[Colour Description]]))","v":"Black, Satin"},"PIECE",{"$f":"IF(T_NAV_AU[[#This Row],[CustomPricing]]<>\"\",T_NAV_AU[[#This Row],[CustomPricing]],T_NAV_AU[[#This Row],[AUD_Original]])","v":40},40,null,4,40]
[null,"RE01-0411-050051","N",{"$f":"IF(AND(OR(T_NAV_AU[[#This Row],[ColourOptions]]=\"M\",T_NAV_AU[[#This Row],[ColourOptions]]=\"Y\"),MID(T_NAV_AU[[#This Row],[No.]],11,3)=\"069\"),REPLACE(T_NAV_AU[[#This Row],[No.]],11,3,\"xxx\"),T_NAV_AU[[#This Row],[No.]])","v":"RE01-0411-050051"},"External Booster Standard LH | 63mm","050","Black, Satin",{"$f":"IF(T_NAV_AU[[#This Row],[ColourOptions]]=\"M\",\"as per catalogue\",IF(T_NAV_AU[[#This Row],[Colour Description]]=\"Pure White\", \"Powdercoat, as per catalogue\", T_NAV_AU[[#This Row],[Colour Description]]))","v":"Black, Satin"},"PIECE",{"$f":"IF(T_NAV_AU[[#This Row],[CustomPricing]]<>\"\",T_NAV_AU[[#This Row],[CustomPricing]],T_NAV_AU[[#This Row],[AUD_Original]])","v":41.24},41.24,null,4,40]
[null,"RE01-0411-050061","N",{"$f":"IF(AND(OR(T_NAV_AU[[#This Row],[ColourOptions]]=\"M\",T_NAV_AU[[#This Row],[ColourOptions]]=\"Y\"),MID(T_NAV_AU[[#This Row],[No.]],11,3)=\"069\"),REPLACE(T_NAV_AU[[#This Row],[No.]],11,3,\"xxx\"),T_NAV_AU[[#This Row],[No.]])","v":"RE01-0411-050061"},"External Booster Heavy Duty LH | 63mm","050","Black, Satin",{"$f":"IF(T_NAV_AU[[#This Row],[ColourOptions]]=\"M\",\"as per catalogue\",IF(T_NAV_AU[[#This Row],[Colour Description]]=\"Pure White\", \"Powdercoat, as per catalogue\", T_NAV_AU[[#This Row],[Colour Description]]))","v":"Black, Satin"},"PIECE",{"$f":"IF(T_NAV_AU[[#This Row],[CustomPricing]]<>\"\",T_NAV_AU[[#This Row],[CustomPricing]],T_NAV_AU[[#This Row],[AUD_Original]])","v":42.49},42.49,null,4,40]
[null,"RE01-0411-050062","N",{"$f":"IF(AND(OR(T_NAV_AU[[#This Row],[ColourOptions]]=\"M\",T_NAV_AU[[#This Row],[ColourOptions]]=\"Y\"),MID(T_NAV_AU[[#This Row],[No.]],11,3)=\"069\"),REPLACE(T_NAV_AU[[#This Row],[No.]],11,3,\"xxx\"),T_NAV_AU[[#This Row],[No.]])","v":"RE01-0411-050062"},"External Booster Heavy Duty RH | 63mm","050","Black, Satin",{"$f":"IF(T_NAV_AU[[#This Row],[ColourOptions]]=\"M\",\"as per catalogue\",IF(T_NAV_AU[[#This Row],[Colour Description]]=\"Pure White\", \"Powdercoat, as per catalogue\", T_NAV_AU[[#This Row],[Colour Description]]))","v":"Black, Satin"},"PIECE",{"$f":"IF(T_NAV_AU[[#This Row],[CustomPricing]]<>\"\",T_NAV_AU[[#This Row],[CustomPricing]],T_NAV_AU[[#This Row],[AUD_Original]])","v":42.49},42.49,null,4,40]
[null,"RE01-0411-050071","N",{"$f":"IF(AND(OR(T_NAV_AU[[#This Row],[ColourOptions]]=\"M\",T_NAV_AU[[#This Row],[ColourOptions]]=\"Y\"),MID(T_NAV_AU[[#This Row],[No.]],11,3)=\"069\"),REPLACE(T_NAV_AU[[#This Row],[No.]],11,3,\"xxx\"),T_NAV_AU[[#This Row],[No.]])","v":"RE01-0411-050071"},"External Booster Extra Heavy Duty LH | 63mm","050","Black, Satin",{"$f":"IF(T_NAV_AU[[#This Row],[ColourOptions]]=\"M\",\"as per catalogue\",IF(T_NAV_AU[[#This Row],[Colour Description]]=\"Pure White\", \"Powdercoat, as per catalogue\", T_NAV_AU[[#This Row],[Colour Description]]))","v":"Black, Satin"},"PIECE",{"$f":"IF(T_NAV_AU[[#This Row],[CustomPricing]]<>\"\",T_NAV_AU[[#This Row],[CustomPricing]],T_NAV_AU[[#This Row],[AUD_Original]])","v":43.74},43.74,null,4,40]
[null,"RE01-0411-050101","N",{"$f":"IF(AND(OR(T_NAV_AU[[#This Row],[ColourOptions]]=\"M\",T_NAV_AU[[#This Row],[ColourOptions]]=\"Y\"),MID(T_NAV_AU[[#This Row],[No.]],11,3)=\"069\"),REPLACE(T_NAV_AU[[#This Row],[No.]],11,3,\"xxx\"),T_NAV_AU[[#This Row],[No.]])","v":"RE01-0411-050101"},"External Booster COMPACT LH | 63mm","050","Black, Satin",{"$f":"IF(T_NAV_AU[[#This Row],[ColourOptions]]=\"M\",\"as per catalogue\",IF(T_NAV_AU[[#This Row],[Colour Description]]=\"Pure White\", \"Powdercoat, as per catalogue\", T_NAV_AU[[#This Row],[Colour Description]]))","v":"Black, Satin"},"PIECE",{"$f":"IF(T_NAV_AU[[#This Row],[CustomPricing]]<>\"\",T_NAV_AU[[#This Row],[CustomPricing]],T_NAV_AU[[#This Row],[AUD_Original]])","v":38.08},38.08,null,4,40]
[null,"RE01-0501-050063","N",{"$f":"IF(AND(OR(T_NAV_AU[[#This Row],[ColourOptions]]=\"M\",T_NAV_AU[[#This Row],[ColourOptions]]=\"Y\"),MID(T_NAV_AU[[#This Row],[No.]],11,3)=\"069\"),REPLACE(T_NAV_AU[[#This Row],[No.]],11,3,\"xxx\"),T_NAV_AU[[#This Row],[No.]])","v":"RE01-0501-050063"},"Crank Housing 13mm square shaft | 63mm tube ","050","Black, Satin",{"$f":"IF(T_NAV_AU[[#This Row],[ColourOptions]]=\"M\",\"as per catalogue\",IF(T_NAV_AU[[#This Row],[Colour Description]]=\"Pure White\", \"Powdercoat, as per catalogue\", T_NAV_AU[[#This Row],[Colour Description]]))","v":"Black, Satin"},"PIECE",{"$f":"IF(T_NAV_AU[[#This Row],[CustomPricing]]<>\"\",T_NAV_AU[[#This Row],[CustomPricing]],T_NAV_AU[[#This Row],[AUD_Original]])","v":5.95},5.95,null,5,100]
[null,"RE01-0513-000002","N",{"$f":"IF(AND(OR(T_NAV_AU[[#This Row],[ColourOptions]]=\"M\",T_NAV_AU[[#This Row],[ColourOptions]]=\"Y\"),MID(T_NAV_AU[[#This Row],[No.]],11,3)=\"069\"),REPLACE(T_NAV_AU[[#This Row],[No.]],11,3,\"xxx\"),T_NAV_AU[[#This Row],[No.]])","v":"RE01-0513-000002"},"Gear 5:1 (7.5Nm)+Screws Univ Joint","000","Mill Finish",{"$f":"IF(T_NAV_AU[[#This Row],[ColourOptions]]=\"M\",\"as per catalogue\",IF(T_NAV_AU[[#This Row],[Colour Description]]=\"Pure White\", \"Powdercoat, as per catalogue\", T_NAV_AU[[#This Row],[Colour Description]]))","v":"Mill Finish"},"SET",{"$f":"IF(T_NAV_AU[[#This Row],[CustomPricing]]<>\"\",T_NAV_AU[[#This Row],[CustomPricing]],T_NAV_AU[[#This Row],[AUD_Original]])","v":55.55},55.55,null,5,50]
[null,"RE01-0513-069002","Y",{"$f":"IF(AND(OR(T_NAV_AU[[#This Row],[ColourOptions]]=\"M\",T_NAV_AU[[#This Row],[ColourOptions]]=\"Y\"),MID(T_NAV_AU[[#This Row],[No.]],11,3)=\"069\"),REPLACE(T_NAV_AU[[#This Row],[No.]],11,3,\"xxx\"),T_NAV_AU[[#This Row],[No.]])","v":"RE01-0513-xxx002"},"Gear 5:1 (7.5Nm)+Screws Univ Joint","069","Pure White",{"$f":"IF(T_NAV_AU[[#This Row],[ColourOptions]]=\"M\",\"as per catalogue\",IF(T_NAV_AU[[#This Row],[Colour Description]]=\"Pure White\", \"Powdercoat, as per catalogue\", T_NAV_AU[[#This Row],[Colour Description]]))","v":"Powdercoat, as per catalogue"},"SET",{"$f":"IF(T_NAV_AU[[#This Row],[CustomPricing]]<>\"\",T_NAV_AU[[#This Row],[CustomPricing]],T_NAV_AU[[#This Row],[AUD_Original]])","v":60.99},60.99,null,5,50]
[null,"RE01-0517-000002","N",{"$f":"IF(AND(OR(T_NAV_AU[[#This Row],[ColourOptions]]=\"M\",T_NAV_AU[[#This Row],[ColourOptions]]=\"Y\"),MID(T_NAV_AU[[#This Row],[No.]],11,3)=\"069\"),REPLACE(T_NAV_AU[[#This Row],[No.]],11,3,\"xxx\"),T_NAV_AU[[#This Row],[No.]])","v":"RE01-0517-000002"},"Gear 8:1 (20Nm)+Screws Univ Joint","000","Mill Finish",{"$f":"IF(T_NAV_AU[[#This Row],[ColourOptions]]=\"M\",\"as per catalogue\",IF(T_NAV_AU[[#This Row],[Colour Description]]=\"Pure White\", \"Powdercoat, as per catalogue\", T_NAV_AU[[#This Row],[Colour Description]]))","v":"Mill Finish"},"SET",{"$f":"IF(T_NAV_AU[[#This Row],[CustomPricing]]<>\"\",T_NAV_AU[[#This Row],[CustomPricing]],T_NAV_AU[[#This Row],[AUD_Original]])","v":102.02},102.02,null,5,50]
[null,"RE01-0517-050002","N",{"$f":"IF(AND(OR(T_NAV_AU[[#This Row],[ColourOptions]]=\"M\",T_NAV_AU[[#This Row],[ColourOptions]]=\"Y\"),MID(T_NAV_AU[[#This Row],[No.]],11,3)=\"069\"),REPLACE(T_NAV_AU[[#This Row],[No.]],11,3,\"xxx\"),T_NAV_AU[[#This Row],[No.]])","v":"RE01-0517-050002"},"Gear 8:1 (20Nm)+Screws Univ Joint","050","Black, Satin",{"$f":"IF(T_NAV_AU[[#This Row],[ColourOptions]]=\"M\",\"as per catalogue\",IF(T_NAV_AU[[#This Row],[Colour Description]]=\"Pure White\", \"Powdercoat, as per catalogue\", T_NAV_AU[[#This Row],[Colour Description]]))","v":"Black, Satin"},"SET",{"$f":"IF(T_NAV_AU[[#This Row],[CustomPricing]]<>\"\",T_NAV_AU[[#This Row],[CustomPricing]],T_NAV_AU[[#This Row],[AUD_Original]])","v":117.89},117.89,null,5,50]
[null,"RE01-0601-025000","N",{"$f":"IF(AND(OR(T_NAV_AU[[#This Row],[ColourOptions]]=\"M\",T_NAV_AU[[#This Row],[ColourOptions]]=\"Y\"),MID(T_NAV_AU[[#This Row],[No.]],11,3)=\"069\"),REPLACE(T_NAV_AU[[#This Row],[No.]],11,3,\"xxx\"),T_NAV_AU[[#This Row],[No.]])","v":"RE01-0601-025000"},"UNIVERSAL | M50 Motor Bracket + Screws","025","Silver ZINC Plated",{"$f":"IF(T_NAV_AU[[#This Row],[ColourOptions]]=\"M\",\"as per catalogue\",IF(T_NAV_AU[[#This Row],[Colour Description]]=\"Pure White\", \"Powdercoat, as per catalogue\", T_NAV_AU[[#This Row],[Colour Description]]))","v":"Silver ZINC Plated"},"SET",{"$f":"IF(T_NAV_AU[[#This Row],[CustomPricing]]<>\"\",T_NAV_AU[[#This Row],[CustomPricing]],T_NAV_AU[[#This Row],[AUD_Original]])","v":4.59},4.59,null,5,100]
[null,"RE01-0602-025000","N",{"$f":"IF(AND(OR(T_NAV_AU[[#This Row],[ColourOptions]]=\"M\",T_NAV_AU[[#This Row],[ColourOptions]]=\"Y\"),MID(T_NAV_AU[[#This Row],[No.]],11,3)=\"069\"),REPLACE(T_NAV_AU[[#This Row],[No.]],11,3,\"xxx\"),T_NAV_AU[[#This Row],[No.]])","v":"RE01-0602-025000"},"SOMFY | Round Head Adaptor Set + screws","025","Silver ZINC Plated",{"$f":"IF(T_NAV_AU[[#This Row],[ColourOptions]]=\"M\",\"as per catalogue\",IF(T_NAV_AU[[#This Row],[Colour Description]]=\"Pure White\", \"Powdercoat, as per catalogue\", T_NAV_AU[[#This Row],[Colour Description]]))","v":"Silver ZINC Plated"},"SET",{"$f":"IF(T_NAV_AU[[#This Row],[CustomPricing]]<>\"\",T_NAV_AU[[#This Row],[CustomPricing]],T_NAV_AU[[#This Row],[AUD_Original]])","v":24.36},24.36,null,5,100]
[null,"RE01-0603-025000","N",{"$f":"IF(AND(OR(T_NAV_AU[[#This Row],[ColourOptions]]=\"M\",T_NAV_AU[[#This Row],[ColourOptions]]=\"Y\"),MID(T_NAV_AU[[#This Row],[No.]],11,3)=\"069\"),REPLACE(T_NAV_AU[[#This Row],[No.]],11,3,\"xxx\"),T_NAV_AU[[#This Row],[No.]])","v":"RE01-0603-025000"},"10mm Square Shaft + Screws","025","Silver ZINC Plated",{"$f":"IF(T_NAV_AU[[#This Row],[ColourOptions]]=\"M\",\"as per catalogue\",IF(T_NAV_AU[[#This Row],[Colour Description]]=\"Pure White\", \"Powdercoat, as per catalogue\", T_NAV_AU[[#This Row],[Colour Description]]))","v":"Silver ZINC Plated"},"SET",{"$f":"IF(T_NAV_AU[[#This Row],[CustomPricing]]<>\"\",T_NAV_AU[[#This Row],[CustomPricing]],T_NAV_AU[[#This Row],[AUD_Original]])","v":3.98},3.98,null,1,100]
[null,"RE01-0604-025000","N",{"$f":"IF(AND(OR(T_NAV_AU[[#This Row],[ColourOptions]]=\"M\",T_NAV_AU[[#This Row],[ColourOptions]]=\"Y\"),MID(T_NAV_AU[[#This Row],[No.]],11,3)=\"069\"),REPLACE(T_NAV_AU[[#This Row],[No.]],11,3,\"xxx\"),T_NAV_AU[[#This Row],[No.]])","v":"RE01-0604-025000"},"M50 Motor Bracket & Somfy Round H Adaptor + Screws","025","Silver ZINC Plated",{"$f":"IF(T_NAV_AU[[#This Row],[ColourOptions]]=\"M\",\"as per catalogue\",IF(T_NAV_AU[[#This Row],[Colour Description]]=\"Pure White\", \"Powdercoat, as per catalogue\", T_NAV_AU[[#This Row],[Colour Description]]))","v":"Silver ZINC Plated"},"SET",{"$f":"IF(T_NAV_AU[[#This Row],[CustomPricing]]<>\"\",T_NAV_AU[[#This Row],[CustomPricing]],T_NAV_AU[[#This Row],[AUD_Original]])","v":30.16},30.16,null,5,100]
[null,"RE01-0663-050003","N",{"$f":"IF(AND(OR(T_NAV_AU[[#This Row],[ColourOptions]]=\"M\",T_NAV_AU[[#This Row],[ColourOptions]]=\"Y\"),MID(T_NAV_AU[[#This Row],[No.]],11,3)=\"069\"),REPLACE(T_NAV_AU[[#This Row],[No.]],11,3,\"xxx\"),T_NAV_AU[[#This Row],[No.]])","v":"RE01-0663-050003"},"SOMFY | M50 Drive Wheel to 63mm Tube","050","Black, Satin",{"$f":"IF(T_NAV_AU[[#This Row],[ColourOptions]]=\"M\",\"as per catalogue\",IF(T_NAV_AU[[#This Row],[Colour Description]]=\"Pure White\", \"Powdercoat, as per catalogue\", T_NAV_AU[[#This Row],[Colour Description]]))","v":"Black, Satin"},"PIECE",{"$f":"IF(T_NAV_AU[[#This Row],[CustomPricing]]<>\"\",T_NAV_AU[[#This Row],[CustomPricing]],T_NAV_AU[[#This Row],[AUD_Original]])","v":11.36},11.36,null,5,100]
[null,"RE01-0663-050518","N",{"$f":"IF(AND(OR(T_NAV_AU[[#This Row],[ColourOptions]]=\"M\",T_NAV_AU[[#This Row],[ColourOptions]]=\"Y\"),MID(T_NAV_AU[[#This Row],[No.]],11,3)=\"069\"),REPLACE(T_NAV_AU[[#This Row],[No.]],11,3,\"xxx\"),T_NAV_AU[[#This Row],[No.]])","v":"RE01-0663-050518"},"Crown 45mm Motor to 63mm Tube","050","Black, Satin",{"$f":"IF(T_NAV_AU[[#This Row],[ColourOptions]]=\"M\",\"as per catalogue\",IF(T_NAV_AU[[#This Row],[Colour Description]]=\"Pure White\", \"Powdercoat, as per catalogue\", T_NAV_AU[[#This Row],[Colour Description]]))","v":"Black, Satin"},"PIECE",{"$f":"IF(T_NAV_AU[[#This Row],[CustomPricing]]<>\"\",T_NAV_AU[[#This Row],[CustomPricing]],T_NAV_AU[[#This Row],[AUD_Original]])","v":2.0499999999999998},2.0499999999999998,null,5,200]
[null,"RE01-0664-050003","N",{"$f":"IF(AND(OR(T_NAV_AU[[#This Row],[ColourOptions]]=\"M\",T_NAV_AU[[#This Row],[ColourOptions]]=\"Y\"),MID(T_NAV_AU[[#This Row],[No.]],11,3)=\"069\"),REPLACE(T_NAV_AU[[#This Row],[No.]],11,3,\"xxx\"),T_NAV_AU[[#This Row],[No.]])","v":"RE01-0664-050003"},"SOMFY | M50 Crown Wheel to 63mm Tube","050","Black, Satin",{"$f":"IF(T_NAV_AU[[#This Row],[ColourOptions]]=\"M\",\"as per catalogue\",IF(T_NAV_AU[[#This Row],[Colour Description]]=\"Pure White\", \"Powdercoat, as per catalogue\", T_NAV_AU[[#This Row],[Colour Description]]))","v":"Black, Satin"},"PIECE",{"$f":"IF(T_NAV_AU[[#This Row],[CustomPricing]]<>\"\",T_NAV_AU[[#This Row],[CustomPricing]],T_NAV_AU[[#This Row],[AUD_Original]])","v":8.0299999999999994},8.0299999999999994,null,5,100]
[null,"RE01-0664-050508","N",{"$f":"IF(AND(OR(T_NAV_AU[[#This Row],[ColourOptions]]=\"M\",T_NAV_AU[[#This Row],[ColourOptions]]=\"Y\"),MID(T_NAV_AU[[#This Row],[No.]],11,3)=\"069\"),REPLACE(T_NAV_AU[[#This Row],[No.]],11,3,\"xxx\"),T_NAV_AU[[#This Row],[No.]])","v":"RE01-0664-050508"},"Drive Wheel 45mm Motor to 63mm Tube","050","Black, Satin",{"$f":"IF(T_NAV_AU[[#This Row],[ColourOptions]]=\"M\",\"as per catalogue\",IF(T_NAV_AU[[#This Row],[Colour Description]]=\"Pure White\", \"Powdercoat, as per catalogue\", T_NAV_AU[[#This Row],[Colour Description]]))","v":"Black, Satin"},"PIECE",{"$f":"IF(T_NAV_AU[[#This Row],[CustomPricing]]<>\"\",T_NAV_AU[[#This Row],[CustomPricing]],T_NAV_AU[[#This Row],[AUD_Original]])","v":4.13},4.13,null,5,50]
[null,"RE01-0666-050508","N",{"$f":"IF(AND(OR(T_NAV_AU[[#This Row],[ColourOptions]]=\"M\",T_NAV_AU[[#This Row],[ColourOptions]]=\"Y\"),MID(T_NAV_AU[[#This Row],[No.]],11,3)=\"069\"),REPLACE(T_NAV_AU[[#This Row],[No.]],11,3,\"xxx\"),T_NAV_AU[[#This Row],[No.]])","v":"RE01-0666-050508"},"Drive Wheel FT 45mm Motor to 63mm Tube | Impct Det","050","Black, Satin",{"$f":"IF(T_NAV_AU[[#This Row],[ColourOptions]]=\"M\",\"as per catalogue\",IF(T_NAV_AU[[#This Row],[Colour Description]]=\"Pure White\", \"Powdercoat, as per catalogue\", T_NAV_AU[[#This Row],[Colour Description]]))","v":"Black, Satin"},"PIECE",{"$f":"IF(T_NAV_AU[[#This Row],[CustomPricing]]<>\"\",T_NAV_AU[[#This Row],[CustomPricing]],T_NAV_AU[[#This Row],[AUD_Original]])","v":4.13},4.13,null,5,100]
[null,"RE01-0666-050518","N",{"$f":"IF(AND(OR(T_NAV_AU[[#This Row],[ColourOptions]]=\"M\",T_NAV_AU[[#This Row],[ColourOptions]]=\"Y\"),MID(T_NAV_AU[[#This Row],[No.]],11,3)=\"069\"),REPLACE(T_NAV_AU[[#This Row],[No.]],11,3,\"xxx\"),T_NAV_AU[[#This Row],[No.]])","v":"RE01-0666-050518"},"Drive Wheel & Insert 45mm Motor to 63mm Tube","050","Black, Satin",{"$f":"IF(T_NAV_AU[[#This Row],[ColourOptions]]=\"M\",\"as per catalogue\",IF(T_NAV_AU[[#This Row],[Colour Description]]=\"Pure White\", \"Powdercoat, as per catalogue\", T_NAV_AU[[#This Row],[Colour Description]]))","v":"Black, Satin"},"SET",{"$f":"IF(T_NAV_AU[[#This Row],[CustomPricing]]<>\"\",T_NAV_AU[[#This Row],[CustomPricing]],T_NAV_AU[[#This Row],[AUD_Original]])","v":5.04},5.04,null,5,100]
[null,"RE01-0678-050003","N",{"$f":"IF(AND(OR(T_NAV_AU[[#This Row],[ColourOptions]]=\"M\",T_NAV_AU[[#This Row],[ColourOptions]]=\"Y\"),MID(T_NAV_AU[[#This Row],[No.]],11,3)=\"069\"),REPLACE(T_NAV_AU[[#This Row],[No.]],11,3,\"xxx\"),T_NAV_AU[[#This Row],[No.]])","v":"RE01-0678-050003"},"SOMFY | Drive Wheel 78mm Tube","050","Black, Satin",{"$f":"IF(T_NAV_AU[[#This Row],[ColourOptions]]=\"M\",\"as per catalogue\",IF(T_NAV_AU[[#This Row],[Colour Description]]=\"Pure White\", \"Powdercoat, as per catalogue\", T_NAV_AU[[#This Row],[Colour Description]]))","v":"Black, Satin"},"PIECE",{"$f":"IF(T_NAV_AU[[#This Row],[CustomPricing]]<>\"\",T_NAV_AU[[#This Row],[CustomPricing]],T_NAV_AU[[#This Row],[AUD_Original]])","v":14.57},14.57,null,5,100]
[null,"RE01-0678-050508","N",{"$f":"IF(AND(OR(T_NAV_AU[[#This Row],[ColourOptions]]=\"M\",T_NAV_AU[[#This Row],[ColourOptions]]=\"Y\"),MID(T_NAV_AU[[#This Row],[No.]],11,3)=\"069\"),REPLACE(T_NAV_AU[[#This Row],[No.]],11,3,\"xxx\"),T_NAV_AU[[#This Row],[No.]])","v":"RE01-0678-050508"},"Crown Wheel 45mm Motor to 78mm Tube","050","Black, Satin",{"$f":"IF(T_NAV_AU[[#This Row],[ColourOptions]]=\"M\",\"as per catalogue\",IF(T_NAV_AU[[#This Row],[Colour Description]]=\"Pure White\", \"Powdercoat, as per catalogue\", T_NAV_AU[[#This Row],[Colour Description]]))","v":"Black, Satin"},"PIECE",{"$f":"IF(T_NAV_AU[[#This Row],[CustomPricing]]<>\"\",T_NAV_AU[[#This Row],[CustomPricing]],T_NAV_AU[[#This Row],[AUD_Original]])","v":1.78},1.78,null,5,50]
[null,"RE01-0679-050508","N",{"$f":"IF(AND(OR(T_NAV_AU[[#This Row],[ColourOptions]]=\"M\",T_NAV_AU[[#This Row],[ColourOptions]]=\"Y\"),MID(T_NAV_AU[[#This Row],[No.]],11,3)=\"069\"),REPLACE(T_NAV_AU[[#This Row],[No.]],11,3,\"xxx\"),T_NAV_AU[[#This Row],[No.]])","v":"RE01-0679-050508"},"Drive Wheel 45mm Motor to 78mm Tube ","050","Black, Satin",{"$f":"IF(T_NAV_AU[[#This Row],[ColourOptions]]=\"M\",\"as per catalogue\",IF(T_NAV_AU[[#This Row],[Colour Description]]=\"Pure White\", \"Powdercoat, as per catalogue\", T_NAV_AU[[#This Row],[Colour Description]]))","v":"Black, Satin"},"PIECE",{"$f":"IF(T_NAV_AU[[#This Row],[CustomPricing]]<>\"\",T_NAV_AU[[#This Row],[CustomPricing]],T_NAV_AU[[#This Row],[AUD_Original]])","v":4.62},4.62,null,5,50]
[null,"RE01-0680-050508","N",{"$f":"IF(AND(OR(T_NAV_AU[[#This Row],[ColourOptions]]=\"M\",T_NAV_AU[[#This Row],[ColourOptions]]=\"Y\"),MID(T_NAV_AU[[#This Row],[No.]],11,3)=\"069\"),REPLACE(T_NAV_AU[[#This Row],[No.]],11,3,\"xxx\"),T_NAV_AU[[#This Row],[No.]])","v":"RE01-0680-050508"},"Drive Wheel Impact Detect 45mm Motor to 78mm Tube","050","Black, Satin",{"$f":"IF(T_NAV_AU[[#This Row],[ColourOptions]]=\"M\",\"as per catalogue\",IF(T_NAV_AU[[#This Row],[Colour Description]]=\"Pure White\", \"Powdercoat, as per catalogue\", T_NAV_AU[[#This Row],[Colour Description]]))","v":"Black, Satin"},"PIECE",{"$f":"IF(T_NAV_AU[[#This Row],[CustomPricing]]<>\"\",T_NAV_AU[[#This Row],[CustomPricing]],T_NAV_AU[[#This Row],[AUD_Original]])","v":4.13},4.13,null,5,100]
[null,"RE01-0701-050078","N",{"$f":"IF(AND(OR(T_NAV_AU[[#This Row],[ColourOptions]]=\"M\",T_NAV_AU[[#This Row],[ColourOptions]]=\"Y\"),MID(T_NAV_AU[[#This Row],[No.]],11,3)=\"069\"),REPLACE(T_NAV_AU[[#This Row],[No.]],11,3,\"xxx\"),T_NAV_AU[[#This Row],[No.]])","v":"RE01-0701-050078"},"78mm Tube Adaptor","050","Black, Satin",{"$f":"IF(T_NAV_AU[[#This Row],[ColourOptions]]=\"M\",\"as per catalogue\",IF(T_NAV_AU[[#This Row],[Colour Description]]=\"Pure White\", \"Powdercoat, as per catalogue\", T_NAV_AU[[#This Row],[Colour Description]]))","v":"Black, Satin"},"PIECE",{"$f":"IF(T_NAV_AU[[#This Row],[CustomPricing]]<>\"\",T_NAV_AU[[#This Row],[CustomPricing]],T_NAV_AU[[#This Row],[AUD_Original]])","v":2.09},2.09,null,5,100]
[null,"RE01-1101-000120","N",{"$f":"IF(AND(OR(T_NAV_AU[[#This Row],[ColourOptions]]=\"M\",T_NAV_AU[[#This Row],[ColourOptions]]=\"Y\"),MID(T_NAV_AU[[#This Row],[No.]],11,3)=\"069\"),REPLACE(T_NAV_AU[[#This Row],[No.]],11,3,\"xxx\"),T_NAV_AU[[#This Row],[No.]])","v":"RE01-1101-000120"},"BOX 120 End Plate Set + Screws","000","Mill Finish",{"$f":"IF(T_NAV_AU[[#This Row],[ColourOptions]]=\"M\",\"as per catalogue\",IF(T_NAV_AU[[#This Row],[Colour Description]]=\"Pure White\", \"Powdercoat, as per catalogue\", T_NAV_AU[[#This Row],[Colour Description]]))","v":"Mill Finish"},"PAIR",{"$f":"IF(T_NAV_AU[[#This Row],[CustomPricing]]<>\"\",T_NAV_AU[[#This Row],[CustomPricing]],T_NAV_AU[[#This Row],[AUD_Original]])","v":40},40,null,4,16]
[null,"RE01-1101-069120","Y",{"$f":"IF(AND(OR(T_NAV_AU[[#This Row],[ColourOptions]]=\"M\",T_NAV_AU[[#This Row],[ColourOptions]]=\"Y\"),MID(T_NAV_AU[[#This Row],[No.]],11,3)=\"069\"),REPLACE(T_NAV_AU[[#This Row],[No.]],11,3,\"xxx\"),T_NAV_AU[[#This Row],[No.]])","v":"RE01-1101-xxx120"},"BOX 120 End Plate Set + Screws","069","Pure White",{"$f":"IF(T_NAV_AU[[#This Row],[ColourOptions]]=\"M\",\"as per catalogue\",IF(T_NAV_AU[[#This Row],[Colour Description]]=\"Pure White\", \"Powdercoat, as per catalogue\", T_NAV_AU[[#This Row],[Colour Description]]))","v":"Powdercoat, as per catalogue"},"PAIR",{"$f":"IF(T_NAV_AU[[#This Row],[CustomPricing]]<>\"\",T_NAV_AU[[#This Row],[CustomPricing]],T_NAV_AU[[#This Row],[AUD_Original]])","v":43.74},43.74,null,4,16]
[null,"RE01-1105-000001","N",{"$f":"IF(AND(OR(T_NAV_AU[[#This Row],[ColourOptions]]=\"M\",T_NAV_AU[[#This Row],[ColourOptions]]=\"Y\"),MID(T_NAV_AU[[#This Row],[No.]],11,3)=\"069\"),REPLACE(T_NAV_AU[[#This Row],[No.]],11,3,\"xxx\"),T_NAV_AU[[#This Row],[No.]])","v":"RE01-1105-000001"},"BOX 190 – End Plates & Screws Only","000","Mill Finish",{"$f":"IF(T_NAV_AU[[#This Row],[ColourOptions]]=\"M\",\"as per catalogue\",IF(T_NAV_AU[[#This Row],[Colour Description]]=\"Pure White\", \"Powdercoat, as per catalogue\", T_NAV_AU[[#This Row],[Colour Description]]))","v":"Mill Finish"},"SET",{"$f":"IF(T_NAV_AU[[#This Row],[CustomPricing]]<>\"\",T_NAV_AU[[#This Row],[CustomPricing]],T_NAV_AU[[#This Row],[AUD_Original]])","v":261.86},261.86,null,1,5]
[null,"RE01-1105-018001","N",{"$f":"IF(AND(OR(T_NAV_AU[[#This Row],[ColourOptions]]=\"M\",T_NAV_AU[[#This Row],[ColourOptions]]=\"Y\"),MID(T_NAV_AU[[#This Row],[No.]],11,3)=\"069\"),REPLACE(T_NAV_AU[[#This Row],[No.]],11,3,\"xxx\"),T_NAV_AU[[#This Row],[No.]])","v":"RE01-1105-018001"},"BOX 190 – End Plates & Screws Only","018","Anodised 20",{"$f":"IF(T_NAV_AU[[#This Row],[ColourOptions]]=\"M\",\"as per catalogue\",IF(T_NAV_AU[[#This Row],[Colour Description]]=\"Pure White\", \"Powdercoat, as per catalogue\", T_NAV_AU[[#This Row],[Colour Description]]))","v":"Anodised 20"},"SET",{"$f":"IF(T_NAV_AU[[#This Row],[CustomPricing]]<>\"\",T_NAV_AU[[#This Row],[CustomPricing]],T_NAV_AU[[#This Row],[AUD_Original]])","v":321.38},321.38,null,1,5]
[null,"RE01-1105-020100","N",{"$f":"IF(AND(OR(T_NAV_AU[[#This Row],[ColourOptions]]=\"M\",T_NAV_AU[[#This Row],[ColourOptions]]=\"Y\"),MID(T_NAV_AU[[#This Row],[No.]],11,3)=\"069\"),REPLACE(T_NAV_AU[[#This Row],[No.]],11,3,\"xxx\"),T_NAV_AU[[#This Row],[No.]])","v":"RE01-1105-020100"},"BOX 190 - Universal Bracket Extrusion | 100mm","020","Anodised 15",{"$f":"IF(T_NAV_AU[[#This Row],[ColourOptions]]=\"M\",\"as per catalogue\",IF(T_NAV_AU[[#This Row],[Colour Description]]=\"Pure White\", \"Powdercoat, as per catalogue\", T_NAV_AU[[#This Row],[Colour Description]]))","v":"Anodised 15"},"PIECE",{"$f":"IF(T_NAV_AU[[#This Row],[CustomPricing]]<>\"\",T_NAV_AU[[#This Row],[CustomPricing]],T_NAV_AU[[#This Row],[AUD_Original]])","v":41.66},41.66,null,2,10]
[null,"RE01-1105-069001","Y",{"$f":"IF(AND(OR(T_NAV_AU[[#This Row],[ColourOptions]]=\"M\",T_NAV_AU[[#This Row],[ColourOptions]]=\"Y\"),MID(T_NAV_AU[[#This Row],[No.]],11,3)=\"069\"),REPLACE(T_NAV_AU[[#This Row],[No.]],11,3,\"xxx\"),T_NAV_AU[[#This Row],[No.]])","v":"RE01-1105-xxx001"},"BOX 190 – End Plates & Screws Only","069","Pure White",{"$f":"IF(T_NAV_AU[[#This Row],[ColourOptions]]=\"M\",\"as per catalogue\",IF(T_NAV_AU[[#This Row],[Colour Description]]=\"Pure White\", \"Powdercoat, as per catalogue\", T_NAV_AU[[#This Row],[Colour Description]]))","v":"Powdercoat, as per catalogue"},"SET",{"$f":"IF(T_NAV_AU[[#This Row],[CustomPricing]]<>\"\",T_NAV_AU[[#This Row],[CustomPricing]],T_NAV_AU[[#This Row],[AUD_Original]])","v":267.81},267.81,null,1,5]
[null,"RE01-3020-025000","N",{"$f":"IF(AND(OR(T_NAV_AU[[#This Row],[ColourOptions]]=\"M\",T_NAV_AU[[#This Row],[ColourOptions]]=\"Y\"),MID(T_NAV_AU[[#This Row],[No.]],11,3)=\"069\"),REPLACE(T_NAV_AU[[#This Row],[No.]],11,3,\"xxx\"),T_NAV_AU[[#This Row],[No.]])","v":"RE01-3020-025000"},"Open Blind External Brackets","025","Silver ZINC Plated",{"$f":"IF(T_NAV_AU[[#This Row],[ColourOptions]]=\"M\",\"as per catalogue\",IF(T_NAV_AU[[#This Row],[Colour Description]]=\"Pure White\", \"Powdercoat, as per catalogue\", T_NAV_AU[[#This Row],[Colour Description]]))","v":"Silver ZINC Plated"},"SET",{"$f":"IF(T_NAV_AU[[#This Row],[CustomPricing]]<>\"\",T_NAV_AU[[#This Row],[CustomPricing]],T_NAV_AU[[#This Row],[AUD_Original]])","v":19.04},19.04,null,2,20]
[null,"RE01-3020-069000","Y",{"$f":"IF(AND(OR(T_NAV_AU[[#This Row],[ColourOptions]]=\"M\",T_NAV_AU[[#This Row],[ColourOptions]]=\"Y\"),MID(T_NAV_AU[[#This Row],[No.]],11,3)=\"069\"),REPLACE(T_NAV_AU[[#This Row],[No.]],11,3,\"xxx\"),T_NAV_AU[[#This Row],[No.]])","v":"RE01-3020-xxx000"},"Open Blind External Brackets","069","Pure White",{"$f":"IF(T_NAV_AU[[#This Row],[ColourOptions]]=\"M\",\"as per catalogue\",IF(T_NAV_AU[[#This Row],[Colour Description]]=\"Pure White\", \"Powdercoat, as per catalogue\", T_NAV_AU[[#This Row],[Colour Description]]))","v":"Powdercoat, as per catalogue"},"SET",{"$f":"IF(T_NAV_AU[[#This Row],[CustomPricing]]<>\"\",T_NAV_AU[[#This Row],[CustomPricing]],T_NAV_AU[[#This Row],[AUD_Original]])","v":19.04},19.04,null,2,20]
[null,"RE01-3021-012000","N",{"$f":"IF(AND(OR(T_NAV_AU[[#This Row],[ColourOptions]]=\"M\",T_NAV_AU[[#This Row],[ColourOptions]]=\"Y\"),MID(T_NAV_AU[[#This Row],[No.]],11,3)=\"069\"),REPLACE(T_NAV_AU[[#This Row],[No.]],11,3,\"xxx\"),T_NAV_AU[[#This Row],[No.]])","v":"RE01-3021-012000"},"Open Blind External Brackets - Stainless 304","012","S/S 304, Satin",{"$f":"IF(T_NAV_AU[[#This Row],[ColourOptions]]=\"M\",\"as per catalogue\",IF(T_NAV_AU[[#This Row],[Colour Description]]=\"Pure White\", \"Powdercoat, as per catalogue\", T_NAV_AU[[#This Row],[Colour Description]]))","v":"S/S 304, Satin"},"SET",{"$f":"IF(T_NAV_AU[[#This Row],[CustomPricing]]<>\"\",T_NAV_AU[[#This Row],[CustomPricing]],T_NAV_AU[[#This Row],[AUD_Original]])","v":47.61},47.61,null,2,20]
[null,"RE01-3030-025000","N",{"$f":"IF(AND(OR(T_NAV_AU[[#This Row],[ColourOptions]]=\"M\",T_NAV_AU[[#This Row],[ColourOptions]]=\"Y\"),MID(T_NAV_AU[[#This Row],[No.]],11,3)=\"069\"),REPLACE(T_NAV_AU[[#This Row],[No.]],11,3,\"xxx\"),T_NAV_AU[[#This Row],[No.]])","v":"RE01-3030-025000"},"Open Blind External Brackets | SQUARE","025","Silver ZINC Plated",{"$f":"IF(T_NAV_AU[[#This Row],[ColourOptions]]=\"M\",\"as per catalogue\",IF(T_NAV_AU[[#This Row],[Colour Description]]=\"Pure White\", \"Powdercoat, as per catalogue\", T_NAV_AU[[#This Row],[Colour Description]]))","v":"Silver ZINC Plated"},"SET",{"$f":"IF(T_NAV_AU[[#This Row],[CustomPricing]]<>\"\",T_NAV_AU[[#This Row],[CustomPricing]],T_NAV_AU[[#This Row],[AUD_Original]])","v":22.56},22.56,null,2,16]
[null,"RE01-3030-069000","Y",{"$f":"IF(AND(OR(T_NAV_AU[[#This Row],[ColourOptions]]=\"M\",T_NAV_AU[[#This Row],[ColourOptions]]=\"Y\"),MID(T_NAV_AU[[#This Row],[No.]],11,3)=\"069\"),REPLACE(T_NAV_AU[[#This Row],[No.]],11,3,\"xxx\"),T_NAV_AU[[#This Row],[No.]])","v":"RE01-3030-xxx000"},"Open Blind External Brackets | SQUARE","069","Pure White",{"$f":"IF(T_NAV_AU[[#This Row],[ColourOptions]]=\"M\",\"as per catalogue\",IF(T_NAV_AU[[#This Row],[Colour Description]]=\"Pure White\", \"Powdercoat, as per catalogue\", T_NAV_AU[[#This Row],[Colour Description]]))","v":"Powdercoat, as per catalogue"},"SET",{"$f":"IF(T_NAV_AU[[#This Row],[CustomPricing]]<>\"\",T_NAV_AU[[#This Row],[CustomPricing]],T_NAV_AU[[#This Row],[AUD_Original]])","v":22.56},22.56,null,2,16]
[null,"RE01-3031-012000","N",{"$f":"IF(AND(OR(T_NAV_AU[[#This Row],[ColourOptions]]=\"M\",T_NAV_AU[[#This Row],[ColourOptions]]=\"Y\"),MID(T_NAV_AU[[#This Row],[No.]],11,3)=\"069\"),REPLACE(T_NAV_AU[[#This Row],[No.]],11,3,\"xxx\"),T_NAV_AU[[#This Row],[No.]])","v":"RE01-3031-012000"},"Open Blind External Brackets | SQUARE - SS304","012","S/S 304, Satin",{"$f":"IF(T_NAV_AU[[#This Row],[ColourOptions]]=\"M\",\"as per catalogue\",IF(T_NAV_AU[[#This Row],[Colour Description]]=\"Pure White\", \"Powdercoat, as per catalogue\", T_NAV_AU[[#This Row],[Colour Description]]))","v":"S/S 304, Satin"},"SET",{"$f":"IF(T_NAV_AU[[#This Row],[CustomPricing]]<>\"\",T_NAV_AU[[#This Row],[CustomPricing]],T_NAV_AU[[#This Row],[AUD_Original]])","v":56.57},56.57,null,2,16]
[null,"RE15-0101-000580","N",{"$f":"IF(AND(OR(T_NAV_AU[[#This Row],[ColourOptions]]=\"M\",T_NAV_AU[[#This Row],[ColourOptions]]=\"Y\"),MID(T_NAV_AU[[#This Row],[No.]],11,3)=\"069\"),REPLACE(T_NAV_AU[[#This Row],[No.]],11,3,\"xxx\"),T_NAV_AU[[#This Row],[No.]])","v":"RE15-0101-000580"},"F56 HD Weight Bar | 26mm x 56mm x 5.8m","000","Mill Finish",{"$f":"IF(T_NAV_AU[[#This Row],[ColourOptions]]=\"M\",\"as per catalogue\",IF(T_NAV_AU[[#This Row],[Colour Description]]=\"Pure White\", \"Powdercoat, as per catalogue\", T_NAV_AU[[#This Row],[Colour Description]]))","v":"Mill Finish"},"LENGTH",{"$f":"IF(T_NAV_AU[[#This Row],[CustomPricing]]<>\"\",T_NAV_AU[[#This Row],[CustomPricing]],T_NAV_AU[[#This Row],[AUD_Original]])","v":118.47},118.47,null,2,48]
[null,"RE15-0101-018580","N",{"$f":"IF(AND(OR(T_NAV_AU[[#This Row],[ColourOptions]]=\"M\",T_NAV_AU[[#This Row],[ColourOptions]]=\"Y\"),MID(T_NAV_AU[[#This Row],[No.]],11,3)=\"069\"),REPLACE(T_NAV_AU[[#This Row],[No.]],11,3,\"xxx\"),T_NAV_AU[[#This Row],[No.]])","v":"RE15-0101-018580"},"F56 HD Weight Bar | 26mm x 56mm x 5.8m","018","Anodised 20",{"$f":"IF(T_NAV_AU[[#This Row],[ColourOptions]]=\"M\",\"as per catalogue\",IF(T_NAV_AU[[#This Row],[Colour Description]]=\"Pure White\", \"Powdercoat, as per catalogue\", T_NAV_AU[[#This Row],[Colour Description]]))","v":"Anodised 20"},"LENGTH",{"$f":"IF(T_NAV_AU[[#This Row],[CustomPricing]]<>\"\",T_NAV_AU[[#This Row],[CustomPricing]],T_NAV_AU[[#This Row],[AUD_Original]])","v":162.1},162.1,null,2,48]
[null,"RE15-0101-069580-PF","Y",{"$f":"IF(AND(OR(T_NAV_AU[[#This Row],[ColourOptions]]=\"M\",T_NAV_AU[[#This Row],[ColourOptions]]=\"Y\"),MID(T_NAV_AU[[#This Row],[No.]],11,3)=\"069\"),REPLACE(T_NAV_AU[[#This Row],[No.]],11,3,\"xxx\"),T_NAV_AU[[#This Row],[No.]])","v":"RE15-0101-xxx580-PF"},"F56 HD Weight Bar w/ PF | 26mm x 56mm x 5.8m","069","Pure White",{"$f":"IF(T_NAV_AU[[#This Row],[ColourOptions]]=\"M\",\"as per catalogue\",IF(T_NAV_AU[[#This Row],[Colour Description]]=\"Pure White\", \"Powdercoat, as per catalogue\", T_NAV_AU[[#This Row],[Colour Description]]))","v":"Powdercoat, as per catalogue"},"LENGTH",{"$f":"IF(T_NAV_AU[[#This Row],[CustomPricing]]<>\"\",T_NAV_AU[[#This Row],[CustomPricing]],T_NAV_AU[[#This Row],[AUD_Original]])","v":162.1},162.1,null,2,48]
[null,"RE15-0112-000700","N",{"$f":"IF(AND(OR(T_NAV_AU[[#This Row],[ColourOptions]]=\"M\",T_NAV_AU[[#This Row],[ColourOptions]]=\"Y\"),MID(T_NAV_AU[[#This Row],[No.]],11,3)=\"069\"),REPLACE(T_NAV_AU[[#This Row],[No.]],11,3,\"xxx\"),T_NAV_AU[[#This Row],[No.]])","v":"RE15-0112-000700"},"F72 HD Weight Bar | 31mm x 72mm x 7m","000","Mill Finish",{"$f":"IF(T_NAV_AU[[#This Row],[ColourOptions]]=\"M\",\"as per catalogue\",IF(T_NAV_AU[[#This Row],[Colour Description]]=\"Pure White\", \"Powdercoat, as per catalogue\", T_NAV_AU[[#This Row],[Colour Description]]))","v":"Mill Finish"},"LENGTH",{"$f":"IF(T_NAV_AU[[#This Row],[CustomPricing]]<>\"\",T_NAV_AU[[#This Row],[CustomPricing]],T_NAV_AU[[#This Row],[AUD_Original]])","v":271.83999999999997},271.83999999999997,null,1,36]
[null,"RE15-0112-018700","N",{"$f":"IF(AND(OR(T_NAV_AU[[#This Row],[ColourOptions]]=\"M\",T_NAV_AU[[#This Row],[ColourOptions]]=\"Y\"),MID(T_NAV_AU[[#This Row],[No.]],11,3)=\"069\"),REPLACE(T_NAV_AU[[#This Row],[No.]],11,3,\"xxx\"),T_NAV_AU[[#This Row],[No.]])","v":"RE15-0112-018700"},"F72 HD Weight Bar | 31mm x 72mm x 7m","018","Anodised 20",{"$f":"IF(T_NAV_AU[[#This Row],[ColourOptions]]=\"M\",\"as per catalogue\",IF(T_NAV_AU[[#This Row],[Colour Description]]=\"Pure White\", \"Powdercoat, as per catalogue\", T_NAV_AU[[#This Row],[Colour Description]]))","v":"Anodised 20"},"LENGTH",{"$f":"IF(T_NAV_AU[[#This Row],[CustomPricing]]<>\"\",T_NAV_AU[[#This Row],[CustomPricing]],T_NAV_AU[[#This Row],[AUD_Original]])","v":409},409,null,1,36]
[null,"RE15-0112-069700-PF","Y",{"$f":"IF(AND(OR(T_NAV_AU[[#This Row],[ColourOptions]]=\"M\",T_NAV_AU[[#This Row],[ColourOptions]]=\"Y\"),MID(T_NAV_AU[[#This Row],[No.]],11,3)=\"069\"),REPLACE(T_NAV_AU[[#This Row],[No.]],11,3,\"xxx\"),T_NAV_AU[[#This Row],[No.]])","v":"RE15-0112-xxx700-PF"},"F72 HD Weight Bar w/ PF | 31mm x 72mm x 7m","069","Pure White",{"$f":"IF(T_NAV_AU[[#This Row],[ColourOptions]]=\"M\",\"as per catalogue\",IF(T_NAV_AU[[#This Row],[Colour Description]]=\"Pure White\", \"Powdercoat, as per catalogue\", T_NAV_AU[[#This Row],[Colour Description]]))","v":"Powdercoat, as per catalogue"},"LENGTH",{"$f":"IF(T_NAV_AU[[#This Row],[CustomPricing]]<>\"\",T_NAV_AU[[#This Row],[CustomPricing]],T_NAV_AU[[#This Row],[AUD_Original]])","v":346.65},346.65,null,1,36]
[null,"RE15-0411-016000","N",{"$f":"IF(AND(OR(T_NAV_AU[[#This Row],[ColourOptions]]=\"M\",T_NAV_AU[[#This Row],[ColourOptions]]=\"Y\"),MID(T_NAV_AU[[#This Row],[No.]],11,3)=\"069\"),REPLACE(T_NAV_AU[[#This Row],[No.]],11,3,\"xxx\"),T_NAV_AU[[#This Row],[No.]])","v":"RE15-0411-016000"},"Wire Guide Ultra Lock Set","016","S/S 316, Satin",{"$f":"IF(T_NAV_AU[[#This Row],[ColourOptions]]=\"M\",\"as per catalogue\",IF(T_NAV_AU[[#This Row],[Colour Description]]=\"Pure White\", \"Powdercoat, as per catalogue\", T_NAV_AU[[#This Row],[Colour Description]]))","v":"S/S 316, Satin"},"SET",{"$f":"IF(T_NAV_AU[[#This Row],[CustomPricing]]<>\"\",T_NAV_AU[[#This Row],[CustomPricing]],T_NAV_AU[[#This Row],[AUD_Original]])","v":29.75},29.75,null,5,200]
[null,"RE15-0422-050001","N",{"$f":"IF(AND(OR(T_NAV_AU[[#This Row],[ColourOptions]]=\"M\",T_NAV_AU[[#This Row],[ColourOptions]]=\"Y\"),MID(T_NAV_AU[[#This Row],[No.]],11,3)=\"069\"),REPLACE(T_NAV_AU[[#This Row],[No.]],11,3,\"xxx\"),T_NAV_AU[[#This Row],[No.]])","v":"RE15-0422-050001"},"ULTRA Lock V2 - Kit Assembly (Pin & Latch Only)","050","Black, Satin",{"$f":"IF(T_NAV_AU[[#This Row],[ColourOptions]]=\"M\",\"as per catalogue\",IF(T_NAV_AU[[#This Row],[Colour Description]]=\"Pure White\", \"Powdercoat, as per catalogue\", T_NAV_AU[[#This Row],[Colour Description]]))","v":"Black, Satin"},"KIT",{"$f":"IF(T_NAV_AU[[#This Row],[CustomPricing]]<>\"\",T_NAV_AU[[#This Row],[CustomPricing]],T_NAV_AU[[#This Row],[AUD_Original]])","v":41.94},41.94,null,5,50]
[null,"RE15-0501-050000","N",{"$f":"IF(AND(OR(T_NAV_AU[[#This Row],[ColourOptions]]=\"M\",T_NAV_AU[[#This Row],[ColourOptions]]=\"Y\"),MID(T_NAV_AU[[#This Row],[No.]],11,3)=\"069\"),REPLACE(T_NAV_AU[[#This Row],[No.]],11,3,\"xxx\"),T_NAV_AU[[#This Row],[No.]])","v":"RE15-0501-050000"},"F56 Weight Bar Plain End Cap Set + Screws","050","Black, Satin",{"$f":"IF(T_NAV_AU[[#This Row],[ColourOptions]]=\"M\",\"as per catalogue\",IF(T_NAV_AU[[#This Row],[Colour Description]]=\"Pure White\", \"Powdercoat, as per catalogue\", T_NAV_AU[[#This Row],[Colour Description]]))","v":"Black, Satin"},"SET",{"$f":"IF(T_NAV_AU[[#This Row],[CustomPricing]]<>\"\",T_NAV_AU[[#This Row],[CustomPricing]],T_NAV_AU[[#This Row],[AUD_Original]])","v":2.98},2.98,null,5,200]
[null,"RE15-0512-069000","M",{"$f":"IF(AND(OR(T_NAV_AU[[#This Row],[ColourOptions]]=\"M\",T_NAV_AU[[#This Row],[ColourOptions]]=\"Y\"),MID(T_NAV_AU[[#This Row],[No.]],11,3)=\"069\"),REPLACE(T_NAV_AU[[#This Row],[No.]],11,3,\"xxx\"),T_NAV_AU[[#This Row],[No.]])","v":"RE15-0512-xxx000"},"F72 Multi-Bar End Cap | Zip","069","Pure White",{"$f":"IF(T_NAV_AU[[#This Row],[ColourOptions]]=\"M\",\"as per catalogue\",IF(T_NAV_AU[[#This Row],[Colour Description]]=\"Pure White\", \"Powdercoat, as per catalogue\", T_NAV_AU[[#This Row],[Colour Description]]))","v":"as per catalogue"},"SET",{"$f":"IF(T_NAV_AU[[#This Row],[CustomPricing]]<>\"\",T_NAV_AU[[#This Row],[CustomPricing]],T_NAV_AU[[#This Row],[AUD_Original]])","v":11.34},11.34,null,5,200]
[null,"RE15-0522-069000","M",{"$f":"IF(AND(OR(T_NAV_AU[[#This Row],[ColourOptions]]=\"M\",T_NAV_AU[[#This Row],[ColourOptions]]=\"Y\"),MID(T_NAV_AU[[#This Row],[No.]],11,3)=\"069\"),REPLACE(T_NAV_AU[[#This Row],[No.]],11,3,\"xxx\"),T_NAV_AU[[#This Row],[No.]])","v":"RE15-0522-xxx000"},"F72 Multi-Bar End Caps | Wire Guide + screws","069","Pure White",{"$f":"IF(T_NAV_AU[[#This Row],[ColourOptions]]=\"M\",\"as per catalogue\",IF(T_NAV_AU[[#This Row],[Colour Description]]=\"Pure White\", \"Powdercoat, as per catalogue\", T_NAV_AU[[#This Row],[Colour Description]]))","v":"as per catalogue"},"SET",{"$f":"IF(T_NAV_AU[[#This Row],[CustomPricing]]<>\"\",T_NAV_AU[[#This Row],[CustomPricing]],T_NAV_AU[[#This Row],[AUD_Original]])","v":45.23},45.23,null,5,200]
[null,"RE15-0540-050000","N",{"$f":"IF(AND(OR(T_NAV_AU[[#This Row],[ColourOptions]]=\"M\",T_NAV_AU[[#This Row],[ColourOptions]]=\"Y\"),MID(T_NAV_AU[[#This Row],[No.]],11,3)=\"069\"),REPLACE(T_NAV_AU[[#This Row],[No.]],11,3,\"xxx\"),T_NAV_AU[[#This Row],[No.]])","v":"RE15-0540-050000"},"F72 Plain End Cap Set + Screws","050","Black, Satin",{"$f":"IF(T_NAV_AU[[#This Row],[ColourOptions]]=\"M\",\"as per catalogue\",IF(T_NAV_AU[[#This Row],[Colour Description]]=\"Pure White\", \"Powdercoat, as per catalogue\", T_NAV_AU[[#This Row],[Colour Description]]))","v":"Black, Satin"},"SET",{"$f":"IF(T_NAV_AU[[#This Row],[CustomPricing]]<>\"\",T_NAV_AU[[#This Row],[CustomPricing]],T_NAV_AU[[#This Row],[AUD_Original]])","v":6.69},6.69,null,5,200]
[null,"RE15-0601-069001","M",{"$f":"IF(AND(OR(T_NAV_AU[[#This Row],[ColourOptions]]=\"M\",T_NAV_AU[[#This Row],[ColourOptions]]=\"Y\"),MID(T_NAV_AU[[#This Row],[No.]],11,3)=\"069\"),REPLACE(T_NAV_AU[[#This Row],[No.]],11,3,\"xxx\"),T_NAV_AU[[#This Row],[No.]])","v":"RE15-0601-xxx001"},"F56 Wire Guide End Cap Set + screws","069","Pure White",{"$f":"IF(T_NAV_AU[[#This Row],[ColourOptions]]=\"M\",\"as per catalogue\",IF(T_NAV_AU[[#This Row],[Colour Description]]=\"Pure White\", \"Powdercoat, as per catalogue\", T_NAV_AU[[#This Row],[Colour Description]]))","v":"as per catalogue"},"SET",{"$f":"IF(T_NAV_AU[[#This Row],[CustomPricing]]<>\"\",T_NAV_AU[[#This Row],[CustomPricing]],T_NAV_AU[[#This Row],[AUD_Original]])","v":5.37},5.37,null,5,200]
[null,"RE20-0301-050078","N",{"$f":"IF(AND(OR(T_NAV_AU[[#This Row],[ColourOptions]]=\"M\",T_NAV_AU[[#This Row],[ColourOptions]]=\"Y\"),MID(T_NAV_AU[[#This Row],[No.]],11,3)=\"069\"),REPLACE(T_NAV_AU[[#This Row],[No.]],11,3,\"xxx\"),T_NAV_AU[[#This Row],[No.]])","v":"RE20-0301-050078"},"ZIP Tube Reducer - 63/78","050","Black, Satin",{"$f":"IF(T_NAV_AU[[#This Row],[ColourOptions]]=\"M\",\"as per catalogue\",IF(T_NAV_AU[[#This Row],[Colour Description]]=\"Pure White\", \"Powdercoat, as per catalogue\", T_NAV_AU[[#This Row],[Colour Description]]))","v":"Black, Satin"},"PIECE",{"$f":"IF(T_NAV_AU[[#This Row],[CustomPricing]]<>\"\",T_NAV_AU[[#This Row],[CustomPricing]],T_NAV_AU[[#This Row],[AUD_Original]])","v":4.76},4.76,null,4,100]
[null,"RE20-0303-069002","M",{"$f":"IF(AND(OR(T_NAV_AU[[#This Row],[ColourOptions]]=\"M\",T_NAV_AU[[#This Row],[ColourOptions]]=\"Y\"),MID(T_NAV_AU[[#This Row],[No.]],11,3)=\"069\"),REPLACE(T_NAV_AU[[#This Row],[No.]],11,3,\"xxx\"),T_NAV_AU[[#This Row],[No.]])","v":"RE20-0303-xxx002"},"F56 | Zipscreen - Lock End Cap Set (2 piece)","069","Pure White",{"$f":"IF(T_NAV_AU[[#This Row],[ColourOptions]]=\"M\",\"as per catalogue\",IF(T_NAV_AU[[#This Row],[Colour Description]]=\"Pure White\", \"Powdercoat, as per catalogue\", T_NAV_AU[[#This Row],[Colour Description]]))","v":"as per catalogue"},"SET",{"$f":"IF(T_NAV_AU[[#This Row],[CustomPricing]]<>\"\",T_NAV_AU[[#This Row],[CustomPricing]],T_NAV_AU[[#This Row],[AUD_Original]])","v":4.53},4.53,null,10,200]
[null,"RE24-1312-009001","N",{"$f":"IF(AND(OR(T_NAV_AU[[#This Row],[ColourOptions]]=\"M\",T_NAV_AU[[#This Row],[ColourOptions]]=\"Y\"),MID(T_NAV_AU[[#This Row],[No.]],11,3)=\"069\"),REPLACE(T_NAV_AU[[#This Row],[No.]],11,3,\"xxx\"),T_NAV_AU[[#This Row],[No.]])","v":"RE24-1312-009001"},"Swaged RH Stud Terminal ONLY + Nuts & Washers","009","S/S 316, Polished",{"$f":"IF(T_NAV_AU[[#This Row],[ColourOptions]]=\"M\",\"as per catalogue\",IF(T_NAV_AU[[#This Row],[Colour Description]]=\"Pure White\", \"Powdercoat, as per catalogue\", T_NAV_AU[[#This Row],[Colour Description]]))","v":"S/S 316, Polished"},"PIECE",{"$f":"IF(T_NAV_AU[[#This Row],[CustomPricing]]<>\"\",T_NAV_AU[[#This Row],[CustomPricing]],T_NAV_AU[[#This Row],[AUD_Original]])","v":6.78},6.78,null,10,50]
[null,"RE24-1312-009002","N",{"$f":"IF(AND(OR(T_NAV_AU[[#This Row],[ColourOptions]]=\"M\",T_NAV_AU[[#This Row],[ColourOptions]]=\"Y\"),MID(T_NAV_AU[[#This Row],[No.]],11,3)=\"069\"),REPLACE(T_NAV_AU[[#This Row],[No.]],11,3,\"xxx\"),T_NAV_AU[[#This Row],[No.]])","v":"RE24-1312-009002"},"Dome Head Terminal for 3.2mm Wire","009","S/S 316, Polished",{"$f":"IF(T_NAV_AU[[#This Row],[ColourOptions]]=\"M\",\"as per catalogue\",IF(T_NAV_AU[[#This Row],[Colour Description]]=\"Pure White\", \"Powdercoat, as per catalogue\", T_NAV_AU[[#This Row],[Colour Description]]))","v":"S/S 316, Polished"},"PIECE",{"$f":"IF(T_NAV_AU[[#This Row],[CustomPricing]]<>\"\",T_NAV_AU[[#This Row],[CustomPricing]],T_NAV_AU[[#This Row],[AUD_Original]])","v":5.6},5.6,null,20,200]
[null,"RE24-1312-009420","N",{"$f":"IF(AND(OR(T_NAV_AU[[#This Row],[ColourOptions]]=\"M\",T_NAV_AU[[#This Row],[ColourOptions]]=\"Y\"),MID(T_NAV_AU[[#This Row],[No.]],11,3)=\"069\"),REPLACE(T_NAV_AU[[#This Row],[No.]],11,3,\"xxx\"),T_NAV_AU[[#This Row],[No.]])","v":"RE24-1312-009420"},"Swaged Dome Terminal + 4.2 metres Wire Rope","009","S/S 316, Polished",{"$f":"IF(T_NAV_AU[[#This Row],[ColourOptions]]=\"M\",\"as per catalogue\",IF(T_NAV_AU[[#This Row],[Colour Description]]=\"Pure White\", \"Powdercoat, as per catalogue\", T_NAV_AU[[#This Row],[Colour Description]]))","v":"S/S 316, Polished"},"SET",{"$f":"IF(T_NAV_AU[[#This Row],[CustomPricing]]<>\"\",T_NAV_AU[[#This Row],[CustomPricing]],T_NAV_AU[[#This Row],[AUD_Original]])","v":29.75},29.75,null,4,40]
[null,"RE24-1314-009400","N",{"$f":"IF(AND(OR(T_NAV_AU[[#This Row],[ColourOptions]]=\"M\",T_NAV_AU[[#This Row],[ColourOptions]]=\"Y\"),MID(T_NAV_AU[[#This Row],[No.]],11,3)=\"069\"),REPLACE(T_NAV_AU[[#This Row],[No.]],11,3,\"xxx\"),T_NAV_AU[[#This Row],[No.]])","v":"RE24-1314-009400"},"Machined Swage Fork Terminal - 4mm S/Steel Wire","009","S/S 316, Polished",{"$f":"IF(T_NAV_AU[[#This Row],[ColourOptions]]=\"M\",\"as per catalogue\",IF(T_NAV_AU[[#This Row],[Colour Description]]=\"Pure White\", \"Powdercoat, as per catalogue\", T_NAV_AU[[#This Row],[Colour Description]]))","v":"S/S 316, Polished"},"PIECE",{"$f":"IF(T_NAV_AU[[#This Row],[CustomPricing]]<>\"\",T_NAV_AU[[#This Row],[CustomPricing]],T_NAV_AU[[#This Row],[AUD_Original]])","v":88.08},88.08,null,2,40]
[null,"RE24-1401-009040","N",{"$f":"IF(AND(OR(T_NAV_AU[[#This Row],[ColourOptions]]=\"M\",T_NAV_AU[[#This Row],[ColourOptions]]=\"Y\"),MID(T_NAV_AU[[#This Row],[No.]],11,3)=\"069\"),REPLACE(T_NAV_AU[[#This Row],[No.]],11,3,\"xxx\"),T_NAV_AU[[#This Row],[No.]])","v":"RE24-1401-009040"},"Threaded Stud Terminal Kit - 4mm S/S Wire","009","S/S 316, Polished",{"$f":"IF(T_NAV_AU[[#This Row],[ColourOptions]]=\"M\",\"as per catalogue\",IF(T_NAV_AU[[#This Row],[Colour Description]]=\"Pure White\", \"Powdercoat, as per catalogue\", T_NAV_AU[[#This Row],[Colour Description]]))","v":"S/S 316, Polished"},"SET",{"$f":"IF(T_NAV_AU[[#This Row],[CustomPricing]]<>\"\",T_NAV_AU[[#This Row],[CustomPricing]],T_NAV_AU[[#This Row],[AUD_Original]])","v":27.98},27.98,null,2,40]
[null,"RE24-2205-009000","N",{"$f":"IF(AND(OR(T_NAV_AU[[#This Row],[ColourOptions]]=\"M\",T_NAV_AU[[#This Row],[ColourOptions]]=\"Y\"),MID(T_NAV_AU[[#This Row],[No.]],11,3)=\"069\"),REPLACE(T_NAV_AU[[#This Row],[No.]],11,3,\"xxx\"),T_NAV_AU[[#This Row],[No.]])","v":"RE24-2205-009000"},"Bottom Wire Guide Swivel Bracket - Floor/Face Fix","009","S/S 316, Polished",{"$f":"IF(T_NAV_AU[[#This Row],[ColourOptions]]=\"M\",\"as per catalogue\",IF(T_NAV_AU[[#This Row],[Colour Description]]=\"Pure White\", \"Powdercoat, as per catalogue\", T_NAV_AU[[#This Row],[Colour Description]]))","v":"S/S 316, Polished"},"SET",{"$f":"IF(T_NAV_AU[[#This Row],[CustomPricing]]<>\"\",T_NAV_AU[[#This Row],[CustomPricing]],T_NAV_AU[[#This Row],[AUD_Original]])","v":32.14},32.14,null,4,200]
[null,"RE24-2301-009090","N",{"$f":"IF(AND(OR(T_NAV_AU[[#This Row],[ColourOptions]]=\"M\",T_NAV_AU[[#This Row],[ColourOptions]]=\"Y\"),MID(T_NAV_AU[[#This Row],[No.]],11,3)=\"069\"),REPLACE(T_NAV_AU[[#This Row],[No.]],11,3,\"xxx\"),T_NAV_AU[[#This Row],[No.]])","v":"RE24-2301-009090"},"Wall Mounting 'L' Bracket - LH & RH Set 90 x 38mm","009","S/S 316, Polished",{"$f":"IF(T_NAV_AU[[#This Row],[ColourOptions]]=\"M\",\"as per catalogue\",IF(T_NAV_AU[[#This Row],[Colour Description]]=\"Pure White\", \"Powdercoat, as per catalogue\", T_NAV_AU[[#This Row],[Colour Description]]))","v":"S/S 316, Polished"},"PAIR",{"$f":"IF(T_NAV_AU[[#This Row],[CustomPricing]]<>\"\",T_NAV_AU[[#This Row],[CustomPricing]],T_NAV_AU[[#This Row],[AUD_Original]])","v":127.36},127.36,null,1,40]
[null,"RE24-2601-009040","N",{"$f":"IF(AND(OR(T_NAV_AU[[#This Row],[ColourOptions]]=\"M\",T_NAV_AU[[#This Row],[ColourOptions]]=\"Y\"),MID(T_NAV_AU[[#This Row],[No.]],11,3)=\"069\"),REPLACE(T_NAV_AU[[#This Row],[No.]],11,3,\"xxx\"),T_NAV_AU[[#This Row],[No.]])","v":"RE24-2601-009040"},"Tensioning Bracket & Terminal - 4mm S/S Wire","009","S/S 316, Polished",{"$f":"IF(T_NAV_AU[[#This Row],[ColourOptions]]=\"M\",\"as per catalogue\",IF(T_NAV_AU[[#This Row],[Colour Description]]=\"Pure White\", \"Powdercoat, as per catalogue\", T_NAV_AU[[#This Row],[Colour Description]]))","v":"S/S 316, Polished"},"SET",{"$f":"IF(T_NAV_AU[[#This Row],[CustomPricing]]<>\"\",T_NAV_AU[[#This Row],[CustomPricing]],T_NAV_AU[[#This Row],[AUD_Original]])","v":83.32},83.32,null,2,40]
[null,"RE24-2601-009902","N",{"$f":"IF(AND(OR(T_NAV_AU[[#This Row],[ColourOptions]]=\"M\",T_NAV_AU[[#This Row],[ColourOptions]]=\"Y\"),MID(T_NAV_AU[[#This Row],[No.]],11,3)=\"069\"),REPLACE(T_NAV_AU[[#This Row],[No.]],11,3,\"xxx\"),T_NAV_AU[[#This Row],[No.]])","v":"RE24-2601-009902"},"Flat Head Stud Terminal - 4mm S/Steel Wire","009","S/S 316, Polished",{"$f":"IF(T_NAV_AU[[#This Row],[ColourOptions]]=\"M\",\"as per catalogue\",IF(T_NAV_AU[[#This Row],[Colour Description]]=\"Pure White\", \"Powdercoat, as per catalogue\", T_NAV_AU[[#This Row],[Colour Description]]))","v":"S/S 316, Polished"},"PIECE",{"$f":"IF(T_NAV_AU[[#This Row],[CustomPricing]]<>\"\",T_NAV_AU[[#This Row],[CustomPricing]],T_NAV_AU[[#This Row],[AUD_Original]])","v":6.8},6.8,null,0,1]
[null,"RE24-4004-010032","N",{"$f":"IF(AND(OR(T_NAV_AU[[#This Row],[ColourOptions]]=\"M\",T_NAV_AU[[#This Row],[ColourOptions]]=\"Y\"),MID(T_NAV_AU[[#This Row],[No.]],11,3)=\"069\"),REPLACE(T_NAV_AU[[#This Row],[No.]],11,3,\"xxx\"),T_NAV_AU[[#This Row],[No.]])","v":"RE24-4004-010032"},"Wire Guide Top Saddle Terminal Kit w/ Spring","010","S/S 304, Natural",{"$f":"IF(T_NAV_AU[[#This Row],[ColourOptions]]=\"M\",\"as per catalogue\",IF(T_NAV_AU[[#This Row],[Colour Description]]=\"Pure White\", \"Powdercoat, as per catalogue\", T_NAV_AU[[#This Row],[Colour Description]]))","v":"S/S 304, Natural"},"SET",{"$f":"IF(T_NAV_AU[[#This Row],[CustomPricing]]<>\"\",T_NAV_AU[[#This Row],[CustomPricing]],T_NAV_AU[[#This Row],[AUD_Original]])","v":5.83},5.83,null,4,400]
[null,"RE24-9101-009050","N",{"$f":"IF(AND(OR(T_NAV_AU[[#This Row],[ColourOptions]]=\"M\",T_NAV_AU[[#This Row],[ColourOptions]]=\"Y\"),MID(T_NAV_AU[[#This Row],[No.]],11,3)=\"069\"),REPLACE(T_NAV_AU[[#This Row],[No.]],11,3,\"xxx\"),T_NAV_AU[[#This Row],[No.]])","v":"RE24-9101-009050"},"Spring Compression 14.5 ID x 50mm Long","009","S/S 316, Polished",{"$f":"IF(T_NAV_AU[[#This Row],[ColourOptions]]=\"M\",\"as per catalogue\",IF(T_NAV_AU[[#This Row],[Colour Description]]=\"Pure White\", \"Powdercoat, as per catalogue\", T_NAV_AU[[#This Row],[Colour Description]]))","v":"S/S 316, Polished"},"PIECE",{"$f":"IF(T_NAV_AU[[#This Row],[CustomPricing]]<>\"\",T_NAV_AU[[#This Row],[CustomPricing]],T_NAV_AU[[#This Row],[AUD_Original]])","v":5.3},5.3,null,2,500]
[null,"RE29-0102-000500","N",{"$f":"IF(AND(OR(T_NAV_AU[[#This Row],[ColourOptions]]=\"M\",T_NAV_AU[[#This Row],[ColourOptions]]=\"Y\"),MID(T_NAV_AU[[#This Row],[No.]],11,3)=\"069\"),REPLACE(T_NAV_AU[[#This Row],[No.]],11,3,\"xxx\"),T_NAV_AU[[#This Row],[No.]])","v":"RE29-0102-000500"},"Pivot Arm Terminal Bar - 5.0 metre","000","Mill Finish",{"$f":"IF(T_NAV_AU[[#This Row],[ColourOptions]]=\"M\",\"as per catalogue\",IF(T_NAV_AU[[#This Row],[Colour Description]]=\"Pure White\", \"Powdercoat, as per catalogue\", T_NAV_AU[[#This Row],[Colour Description]]))","v":"Mill Finish"},"LENGTH",{"$f":"IF(T_NAV_AU[[#This Row],[CustomPricing]]<>\"\",T_NAV_AU[[#This Row],[CustomPricing]],T_NAV_AU[[#This Row],[AUD_Original]])","v":235.67},235.67,null,1,10]
[null,"RE29-0102-069500","Y",{"$f":"IF(AND(OR(T_NAV_AU[[#This Row],[ColourOptions]]=\"M\",T_NAV_AU[[#This Row],[ColourOptions]]=\"Y\"),MID(T_NAV_AU[[#This Row],[No.]],11,3)=\"069\"),REPLACE(T_NAV_AU[[#This Row],[No.]],11,3,\"xxx\"),T_NAV_AU[[#This Row],[No.]])","v":"RE29-0102-xxx500"},"Pivot Arm Terminal Bar | 5m","069","Pure White",{"$f":"IF(T_NAV_AU[[#This Row],[ColourOptions]]=\"M\",\"as per catalogue\",IF(T_NAV_AU[[#This Row],[Colour Description]]=\"Pure White\", \"Powdercoat, as per catalogue\", T_NAV_AU[[#This Row],[Colour Description]]))","v":"Powdercoat, as per catalogue"},"LENGTH",{"$f":"IF(T_NAV_AU[[#This Row],[CustomPricing]]<>\"\",T_NAV_AU[[#This Row],[CustomPricing]],T_NAV_AU[[#This Row],[AUD_Original]])","v":243.16},243.16,null,1,10]
[null,"RE91-0100-025025","N",{"$f":"IF(AND(OR(T_NAV_AU[[#This Row],[ColourOptions]]=\"M\",T_NAV_AU[[#This Row],[ColourOptions]]=\"Y\"),MID(T_NAV_AU[[#This Row],[No.]],11,3)=\"069\"),REPLACE(T_NAV_AU[[#This Row],[No.]],11,3,\"xxx\"),T_NAV_AU[[#This Row],[No.]])","v":"RE91-0100-025025"},"25mm Cam Buckle & Strap Assembly","025","Silver ZINC Plated",{"$f":"IF(T_NAV_AU[[#This Row],[ColourOptions]]=\"M\",\"as per catalogue\",IF(T_NAV_AU[[#This Row],[Colour Description]]=\"Pure White\", \"Powdercoat, as per catalogue\", T_NAV_AU[[#This Row],[Colour Description]]))","v":"Silver ZINC Plated"},"PIECE",{"$f":"IF(T_NAV_AU[[#This Row],[CustomPricing]]<>\"\",T_NAV_AU[[#This Row],[CustomPricing]],T_NAV_AU[[#This Row],[AUD_Original]])","v":11.28},11.28,null,2,100]
[null,"RE91-0101-000580","N",{"$f":"IF(AND(OR(T_NAV_AU[[#This Row],[ColourOptions]]=\"M\",T_NAV_AU[[#This Row],[ColourOptions]]=\"Y\"),MID(T_NAV_AU[[#This Row],[No.]],11,3)=\"069\"),REPLACE(T_NAV_AU[[#This Row],[No.]],11,3,\"xxx\"),T_NAV_AU[[#This Row],[No.]])","v":"RE91-0101-000580"},"Channel Guide System Side Guide | 5.8m","000","Mill Finish",{"$f":"IF(T_NAV_AU[[#This Row],[ColourOptions]]=\"M\",\"as per catalogue\",IF(T_NAV_AU[[#This Row],[Colour Description]]=\"Pure White\", \"Powdercoat, as per catalogue\", T_NAV_AU[[#This Row],[Colour Description]]))","v":"Mill Finish"},"LENGTH",{"$f":"IF(T_NAV_AU[[#This Row],[CustomPricing]]<>\"\",T_NAV_AU[[#This Row],[CustomPricing]],T_NAV_AU[[#This Row],[AUD_Original]])","v":144.63999999999999},144.63999999999999,null,4,48]
[null,"RE91-0101-018580","N",{"$f":"IF(AND(OR(T_NAV_AU[[#This Row],[ColourOptions]]=\"M\",T_NAV_AU[[#This Row],[ColourOptions]]=\"Y\"),MID(T_NAV_AU[[#This Row],[No.]],11,3)=\"069\"),REPLACE(T_NAV_AU[[#This Row],[No.]],11,3,\"xxx\"),T_NAV_AU[[#This Row],[No.]])","v":"RE91-0101-018580"},"Channel Guide System Side Guide | 5.8m","018","Anodised 20",{"$f":"IF(T_NAV_AU[[#This Row],[ColourOptions]]=\"M\",\"as per catalogue\",IF(T_NAV_AU[[#This Row],[Colour Description]]=\"Pure White\", \"Powdercoat, as per catalogue\", T_NAV_AU[[#This Row],[Colour Description]]))","v":"Anodised 20"},"LENGTH",{"$f":"IF(T_NAV_AU[[#This Row],[CustomPricing]]<>\"\",T_NAV_AU[[#This Row],[CustomPricing]],T_NAV_AU[[#This Row],[AUD_Original]])","v":177.07},177.07,null,4,48]
[null,"RE91-0101-069580","Y",{"$f":"IF(AND(OR(T_NAV_AU[[#This Row],[ColourOptions]]=\"M\",T_NAV_AU[[#This Row],[ColourOptions]]=\"Y\"),MID(T_NAV_AU[[#This Row],[No.]],11,3)=\"069\"),REPLACE(T_NAV_AU[[#This Row],[No.]],11,3,\"xxx\"),T_NAV_AU[[#This Row],[No.]])","v":"RE91-0101-xxx580"},"Channel Guide System Side Guide | 5.8m","069","Pure White",{"$f":"IF(T_NAV_AU[[#This Row],[ColourOptions]]=\"M\",\"as per catalogue\",IF(T_NAV_AU[[#This Row],[Colour Description]]=\"Pure White\", \"Powdercoat, as per catalogue\", T_NAV_AU[[#This Row],[Colour Description]]))","v":"Powdercoat, as per catalogue"},"LENGTH",{"$f":"IF(T_NAV_AU[[#This Row],[CustomPricing]]<>\"\",T_NAV_AU[[#This Row],[CustomPricing]],T_NAV_AU[[#This Row],[AUD_Original]])","v":155.88},155.88,null,4,48]
[null,"RE91-1001-050000","N",{"$f":"IF(AND(OR(T_NAV_AU[[#This Row],[ColourOptions]]=\"M\",T_NAV_AU[[#This Row],[ColourOptions]]=\"Y\"),MID(T_NAV_AU[[#This Row],[No.]],11,3)=\"069\"),REPLACE(T_NAV_AU[[#This Row],[No.]],11,3,\"xxx\"),T_NAV_AU[[#This Row],[No.]])","v":"RE91-1001-050000"},"Channel Guide Funnel & Bottom Cap Set + Screws","050","Black, Satin",{"$f":"IF(T_NAV_AU[[#This Row],[ColourOptions]]=\"M\",\"as per catalogue\",IF(T_NAV_AU[[#This Row],[Colour Description]]=\"Pure White\", \"Powdercoat, as per catalogue\", T_NAV_AU[[#This Row],[Colour Description]]))","v":"Black, Satin"},"SET",{"$f":"IF(T_NAV_AU[[#This Row],[CustomPricing]]<>\"\",T_NAV_AU[[#This Row],[CustomPricing]],T_NAV_AU[[#This Row],[AUD_Original]])","v":3.57},3.57,null,10,500]
[null,"RE91-1101-013025","N",{"$f":"IF(AND(OR(T_NAV_AU[[#This Row],[ColourOptions]]=\"M\",T_NAV_AU[[#This Row],[ColourOptions]]=\"Y\"),MID(T_NAV_AU[[#This Row],[No.]],11,3)=\"069\"),REPLACE(T_NAV_AU[[#This Row],[No.]],11,3,\"xxx\"),T_NAV_AU[[#This Row],[No.]])","v":"RE91-1101-013025"},"25mm Footmans Loop - S/Steel","013","S/S 304, Polished",{"$f":"IF(T_NAV_AU[[#This Row],[ColourOptions]]=\"M\",\"as per catalogue\",IF(T_NAV_AU[[#This Row],[Colour Description]]=\"Pure White\", \"Powdercoat, as per catalogue\", T_NAV_AU[[#This Row],[Colour Description]]))","v":"S/S 304, Polished"},"PIECE",{"$f":"IF(T_NAV_AU[[#This Row],[CustomPricing]]<>\"\",T_NAV_AU[[#This Row],[CustomPricing]],T_NAV_AU[[#This Row],[AUD_Original]])","v":4.4800000000000004},4.4800000000000004,null,10,200]
[null,"RE91-1102-050025","N",{"$f":"IF(AND(OR(T_NAV_AU[[#This Row],[ColourOptions]]=\"M\",T_NAV_AU[[#This Row],[ColourOptions]]=\"Y\"),MID(T_NAV_AU[[#This Row],[No.]],11,3)=\"069\"),REPLACE(T_NAV_AU[[#This Row],[No.]],11,3,\"xxx\"),T_NAV_AU[[#This Row],[No.]])","v":"RE91-1102-050025"},"25mm Strap Down Loop | F56","050","Black, Satin",{"$f":"IF(T_NAV_AU[[#This Row],[ColourOptions]]=\"M\",\"as per catalogue\",IF(T_NAV_AU[[#This Row],[Colour Description]]=\"Pure White\", \"Powdercoat, as per catalogue\", T_NAV_AU[[#This Row],[Colour Description]]))","v":"Black, Satin"},"PIECE",{"$f":"IF(T_NAV_AU[[#This Row],[CustomPricing]]<>\"\",T_NAV_AU[[#This Row],[CustomPricing]],T_NAV_AU[[#This Row],[AUD_Original]])","v":2.38},2.38,null,10,1000]
[null,"RE91-1103-009050","N",{"$f":"IF(AND(OR(T_NAV_AU[[#This Row],[ColourOptions]]=\"M\",T_NAV_AU[[#This Row],[ColourOptions]]=\"Y\"),MID(T_NAV_AU[[#This Row],[No.]],11,3)=\"069\"),REPLACE(T_NAV_AU[[#This Row],[No.]],11,3,\"xxx\"),T_NAV_AU[[#This Row],[No.]])","v":"RE91-1103-009050"},"Strap Down Spring Clip - 50mm","009","S/S 316, Polished",{"$f":"IF(T_NAV_AU[[#This Row],[ColourOptions]]=\"M\",\"as per catalogue\",IF(T_NAV_AU[[#This Row],[Colour Description]]=\"Pure White\", \"Powdercoat, as per catalogue\", T_NAV_AU[[#This Row],[Colour Description]]))","v":"S/S 316, Polished"},"PIECE",{"$f":"IF(T_NAV_AU[[#This Row],[CustomPricing]]<>\"\",T_NAV_AU[[#This Row],[CustomPricing]],T_NAV_AU[[#This Row],[AUD_Original]])","v":3.1},3.1,null,10,200]
[null,"RE91-1104-013030","N",{"$f":"IF(AND(OR(T_NAV_AU[[#This Row],[ColourOptions]]=\"M\",T_NAV_AU[[#This Row],[ColourOptions]]=\"Y\"),MID(T_NAV_AU[[#This Row],[No.]],11,3)=\"069\"),REPLACE(T_NAV_AU[[#This Row],[No.]],11,3,\"xxx\"),T_NAV_AU[[#This Row],[No.]])","v":"RE91-1104-013030"},"Strap Down Pad Eye Saddle - 30mm","009","S/S 316, Polished",{"$f":"IF(T_NAV_AU[[#This Row],[ColourOptions]]=\"M\",\"as per catalogue\",IF(T_NAV_AU[[#This Row],[Colour Description]]=\"Pure White\", \"Powdercoat, as per catalogue\", T_NAV_AU[[#This Row],[Colour Description]]))","v":"S/S 316, Polished"},"PIECE",{"$f":"IF(T_NAV_AU[[#This Row],[CustomPricing]]<>\"\",T_NAV_AU[[#This Row],[CustomPricing]],T_NAV_AU[[#This Row],[AUD_Original]])","v":3.93},3.93,null,10,100]
[null,"RE91-1105-009000","N",{"$f":"IF(AND(OR(T_NAV_AU[[#This Row],[ColourOptions]]=\"M\",T_NAV_AU[[#This Row],[ColourOptions]]=\"Y\"),MID(T_NAV_AU[[#This Row],[No.]],11,3)=\"069\"),REPLACE(T_NAV_AU[[#This Row],[No.]],11,3,\"xxx\"),T_NAV_AU[[#This Row],[No.]])","v":"RE91-1105-009000"},"Flush Mount Strap Down Loop","009","S/S 316, Polished",{"$f":"IF(T_NAV_AU[[#This Row],[ColourOptions]]=\"M\",\"as per catalogue\",IF(T_NAV_AU[[#This Row],[Colour Description]]=\"Pure White\", \"Powdercoat, as per catalogue\", T_NAV_AU[[#This Row],[Colour Description]]))","v":"S/S 316, Polished"},"PIECE",{"$f":"IF(T_NAV_AU[[#This Row],[CustomPricing]]<>\"\",T_NAV_AU[[#This Row],[CustomPricing]],T_NAV_AU[[#This Row],[AUD_Original]])","v":28.34},28.34,null,4,100]
[null,"RE91-1111-013025","N",{"$f":"IF(AND(OR(T_NAV_AU[[#This Row],[ColourOptions]]=\"M\",T_NAV_AU[[#This Row],[ColourOptions]]=\"Y\"),MID(T_NAV_AU[[#This Row],[No.]],11,3)=\"069\"),REPLACE(T_NAV_AU[[#This Row],[No.]],11,3,\"xxx\"),T_NAV_AU[[#This Row],[No.]])","v":"RE91-1111-013025"},"25mm Footmans Loop Kit | F72","013","S/S 304, Polished",{"$f":"IF(T_NAV_AU[[#This Row],[ColourOptions]]=\"M\",\"as per catalogue\",IF(T_NAV_AU[[#This Row],[Colour Description]]=\"Pure White\", \"Powdercoat, as per catalogue\", T_NAV_AU[[#This Row],[Colour Description]]))","v":"S/S 304, Polished"},"KIT",{"$f":"IF(T_NAV_AU[[#This Row],[CustomPricing]]<>\"\",T_NAV_AU[[#This Row],[CustomPricing]],T_NAV_AU[[#This Row],[AUD_Original]])","v":9.07},9.07,null,5,100]
[null,"RE91-2001-050000","N",{"$f":"IF(AND(OR(T_NAV_AU[[#This Row],[ColourOptions]]=\"M\",T_NAV_AU[[#This Row],[ColourOptions]]=\"Y\"),MID(T_NAV_AU[[#This Row],[No.]],11,3)=\"069\"),REPLACE(T_NAV_AU[[#This Row],[No.]],11,3,\"xxx\"),T_NAV_AU[[#This Row],[No.]])","v":"RE91-2001-050000"},"Channel Guide Weight Bar End Cap Set + Screws","050","Black, Satin",{"$f":"IF(T_NAV_AU[[#This Row],[ColourOptions]]=\"M\",\"as per catalogue\",IF(T_NAV_AU[[#This Row],[Colour Description]]=\"Pure White\", \"Powdercoat, as per catalogue\", T_NAV_AU[[#This Row],[Colour Description]]))","v":"Black, Satin"},"SET",{"$f":"IF(T_NAV_AU[[#This Row],[CustomPricing]]<>\"\",T_NAV_AU[[#This Row],[CustomPricing]],T_NAV_AU[[#This Row],[AUD_Original]])","v":5.24},5.24,null,10,200]
[null,"SB03-1301-009190","N",{"$f":"IF(AND(OR(T_NAV_AU[[#This Row],[ColourOptions]]=\"M\",T_NAV_AU[[#This Row],[ColourOptions]]=\"Y\"),MID(T_NAV_AU[[#This Row],[No.]],11,3)=\"069\"),REPLACE(T_NAV_AU[[#This Row],[No.]],11,3,\"xxx\"),T_NAV_AU[[#This Row],[No.]])","v":"SB03-1301-009190"},"Zipscreen Extreme Open Bracket Kit","009","S/S 316, Polished",{"$f":"IF(T_NAV_AU[[#This Row],[ColourOptions]]=\"M\",\"as per catalogue\",IF(T_NAV_AU[[#This Row],[Colour Description]]=\"Pure White\", \"Powdercoat, as per catalogue\", T_NAV_AU[[#This Row],[Colour Description]]))","v":"S/S 316, Polished"},"SET",{"$f":"IF(T_NAV_AU[[#This Row],[CustomPricing]]<>\"\",T_NAV_AU[[#This Row],[CustomPricing]],T_NAV_AU[[#This Row],[AUD_Original]])","v":258.45999999999998},258.45999999999998,null,1,4]
[null,"SB03-1301-013060","N",{"$f":"IF(AND(OR(T_NAV_AU[[#This Row],[ColourOptions]]=\"M\",T_NAV_AU[[#This Row],[ColourOptions]]=\"Y\"),MID(T_NAV_AU[[#This Row],[No.]],11,3)=\"069\"),REPLACE(T_NAV_AU[[#This Row],[No.]],11,3,\"xxx\"),T_NAV_AU[[#This Row],[No.]])","v":"SB03-1301-013060"},"External Wire Guide Bracket Set","013","S/S 304, Polished",{"$f":"IF(T_NAV_AU[[#This Row],[ColourOptions]]=\"M\",\"as per catalogue\",IF(T_NAV_AU[[#This Row],[Colour Description]]=\"Pure White\", \"Powdercoat, as per catalogue\", T_NAV_AU[[#This Row],[Colour Description]]))","v":"S/S 304, Polished"},"SET",{"$f":"IF(T_NAV_AU[[#This Row],[CustomPricing]]<>\"\",T_NAV_AU[[#This Row],[CustomPricing]],T_NAV_AU[[#This Row],[AUD_Original]])","v":55.83},55.83,null,2,16]
[null,"SB04-0701-000550","N",{"$f":"IF(AND(OR(T_NAV_AU[[#This Row],[ColourOptions]]=\"M\",T_NAV_AU[[#This Row],[ColourOptions]]=\"Y\"),MID(T_NAV_AU[[#This Row],[No.]],11,3)=\"069\"),REPLACE(T_NAV_AU[[#This Row],[No.]],11,3,\"xxx\"),T_NAV_AU[[#This Row],[No.]])","v":"SB04-0701-000550"},"ZIPSCREEN - Zip Inner Rail | 5.5m","000","Mill Finish",{"$f":"IF(T_NAV_AU[[#This Row],[ColourOptions]]=\"M\",\"as per catalogue\",IF(T_NAV_AU[[#This Row],[Colour Description]]=\"Pure White\", \"Powdercoat, as per catalogue\", T_NAV_AU[[#This Row],[Colour Description]]))","v":"Mill Finish"},"LENGTH",{"$f":"IF(T_NAV_AU[[#This Row],[CustomPricing]]<>\"\",T_NAV_AU[[#This Row],[CustomPricing]],T_NAV_AU[[#This Row],[AUD_Original]])","v":48.63},48.63,null,10,120]
[null,"SB04-0701-018550","N",{"$f":"IF(AND(OR(T_NAV_AU[[#This Row],[ColourOptions]]=\"M\",T_NAV_AU[[#This Row],[ColourOptions]]=\"Y\"),MID(T_NAV_AU[[#This Row],[No.]],11,3)=\"069\"),REPLACE(T_NAV_AU[[#This Row],[No.]],11,3,\"xxx\"),T_NAV_AU[[#This Row],[No.]])","v":"SB04-0701-018550"},"ZIPSCREEN - Zip Inner Rail | 5.5m","018","Anodised 20",{"$f":"IF(T_NAV_AU[[#This Row],[ColourOptions]]=\"M\",\"as per catalogue\",IF(T_NAV_AU[[#This Row],[Colour Description]]=\"Pure White\", \"Powdercoat, as per catalogue\", T_NAV_AU[[#This Row],[Colour Description]]))","v":"Anodised 20"},"LENGTH",{"$f":"IF(T_NAV_AU[[#This Row],[CustomPricing]]<>\"\",T_NAV_AU[[#This Row],[CustomPricing]],T_NAV_AU[[#This Row],[AUD_Original]])","v":57.61},57.61,null,10,120]
[null,"SB04-0701-069550","Y",{"$f":"IF(AND(OR(T_NAV_AU[[#This Row],[ColourOptions]]=\"M\",T_NAV_AU[[#This Row],[ColourOptions]]=\"Y\"),MID(T_NAV_AU[[#This Row],[No.]],11,3)=\"069\"),REPLACE(T_NAV_AU[[#This Row],[No.]],11,3,\"xxx\"),T_NAV_AU[[#This Row],[No.]])","v":"SB04-0701-xxx550"},"ZIPSCREEN - Zip Inner Rail | 5.5m","069","Pure White",{"$f":"IF(T_NAV_AU[[#This Row],[ColourOptions]]=\"M\",\"as per catalogue\",IF(T_NAV_AU[[#This Row],[Colour Description]]=\"Pure White\", \"Powdercoat, as per catalogue\", T_NAV_AU[[#This Row],[Colour Description]]))","v":"Powdercoat, as per catalogue"},"LENGTH",{"$f":"IF(T_NAV_AU[[#This Row],[CustomPricing]]<>\"\",T_NAV_AU[[#This Row],[CustomPricing]],T_NAV_AU[[#This Row],[AUD_Original]])","v":63.6},63.6,null,10,120]
[null,"SB04-0702-000550","N",{"$f":"IF(AND(OR(T_NAV_AU[[#This Row],[ColourOptions]]=\"M\",T_NAV_AU[[#This Row],[ColourOptions]]=\"Y\"),MID(T_NAV_AU[[#This Row],[No.]],11,3)=\"069\"),REPLACE(T_NAV_AU[[#This Row],[No.]],11,3,\"xxx\"),T_NAV_AU[[#This Row],[No.]])","v":"SB04-0702-000550"},"ZIPSCREEN - U Mounting Rail | 5.5m","000","Mill Finish",{"$f":"IF(T_NAV_AU[[#This Row],[ColourOptions]]=\"M\",\"as per catalogue\",IF(T_NAV_AU[[#This Row],[Colour Description]]=\"Pure White\", \"Powdercoat, as per catalogue\", T_NAV_AU[[#This Row],[Colour Description]]))","v":"Mill Finish"},"LENGTH",{"$f":"IF(T_NAV_AU[[#This Row],[CustomPricing]]<>\"\",T_NAV_AU[[#This Row],[CustomPricing]],T_NAV_AU[[#This Row],[AUD_Original]])","v":52.75},52.75,null,10,120]
[null,"SB04-0702-018550","N",{"$f":"IF(AND(OR(T_NAV_AU[[#This Row],[ColourOptions]]=\"M\",T_NAV_AU[[#This Row],[ColourOptions]]=\"Y\"),MID(T_NAV_AU[[#This Row],[No.]],11,3)=\"069\"),REPLACE(T_NAV_AU[[#This Row],[No.]],11,3,\"xxx\"),T_NAV_AU[[#This Row],[No.]])","v":"SB04-0702-018550"},"ZIPSCREEN - U Mounting Rail | 5.5m","018","Anodised 20",{"$f":"IF(T_NAV_AU[[#This Row],[ColourOptions]]=\"M\",\"as per catalogue\",IF(T_NAV_AU[[#This Row],[Colour Description]]=\"Pure White\", \"Powdercoat, as per catalogue\", T_NAV_AU[[#This Row],[Colour Description]]))","v":"Anodised 20"},"LENGTH",{"$f":"IF(T_NAV_AU[[#This Row],[CustomPricing]]<>\"\",T_NAV_AU[[#This Row],[CustomPricing]],T_NAV_AU[[#This Row],[AUD_Original]])","v":58.35},58.35,null,10,120]
[null,"SB04-0702-069550","Y",{"$f":"IF(AND(OR(T_NAV_AU[[#This Row],[ColourOptions]]=\"M\",T_NAV_AU[[#This Row],[ColourOptions]]=\"Y\"),MID(T_NAV_AU[[#This Row],[No.]],11,3)=\"069\"),REPLACE(T_NAV_AU[[#This Row],[No.]],11,3,\"xxx\"),T_NAV_AU[[#This Row],[No.]])","v":"SB04-0702-xxx550"},"ZIPSCREEN - U Mounting Rail | 5.5m","069","Pure White",{"$f":"IF(T_NAV_AU[[#This Row],[ColourOptions]]=\"M\",\"as per catalogue\",IF(T_NAV_AU[[#This Row],[Colour Description]]=\"Pure White\", \"Powdercoat, as per catalogue\", T_NAV_AU[[#This Row],[Colour Description]]))","v":"Powdercoat, as per catalogue"},"LENGTH",{"$f":"IF(T_NAV_AU[[#This Row],[CustomPricing]]<>\"\",T_NAV_AU[[#This Row],[CustomPricing]],T_NAV_AU[[#This Row],[AUD_Original]])","v":67.34},67.34,null,10,120]
[null,"SB04-0703-000550","N",{"$f":"IF(AND(OR(T_NAV_AU[[#This Row],[ColourOptions]]=\"M\",T_NAV_AU[[#This Row],[ColourOptions]]=\"Y\"),MID(T_NAV_AU[[#This Row],[No.]],11,3)=\"069\"),REPLACE(T_NAV_AU[[#This Row],[No.]],11,3,\"xxx\"),T_NAV_AU[[#This Row],[No.]])","v":"SB04-0703-000550"},"ZIPSCREEN - L Fixing Rail | 5.5m","000","Mill Finish",{"$f":"IF(T_NAV_AU[[#This Row],[ColourOptions]]=\"M\",\"as per catalogue\",IF(T_NAV_AU[[#This Row],[Colour Description]]=\"Pure White\", \"Powdercoat, as per catalogue\", T_NAV_AU[[#This Row],[Colour Description]]))","v":"Mill Finish"},"LENGTH",{"$f":"IF(T_NAV_AU[[#This Row],[CustomPricing]]<>\"\",T_NAV_AU[[#This Row],[CustomPricing]],T_NAV_AU[[#This Row],[AUD_Original]])","v":41.65},41.65,null,10,120]
[null,"SB04-0703-018550","N",{"$f":"IF(AND(OR(T_NAV_AU[[#This Row],[ColourOptions]]=\"M\",T_NAV_AU[[#This Row],[ColourOptions]]=\"Y\"),MID(T_NAV_AU[[#This Row],[No.]],11,3)=\"069\"),REPLACE(T_NAV_AU[[#This Row],[No.]],11,3,\"xxx\"),T_NAV_AU[[#This Row],[No.]])","v":"SB04-0703-018550"},"ZIPSCREEN - L Fixing Rail | 5.5m","018","Anodised 20",{"$f":"IF(T_NAV_AU[[#This Row],[ColourOptions]]=\"M\",\"as per catalogue\",IF(T_NAV_AU[[#This Row],[Colour Description]]=\"Pure White\", \"Powdercoat, as per catalogue\", T_NAV_AU[[#This Row],[Colour Description]]))","v":"Anodised 20"},"LENGTH",{"$f":"IF(T_NAV_AU[[#This Row],[CustomPricing]]<>\"\",T_NAV_AU[[#This Row],[CustomPricing]],T_NAV_AU[[#This Row],[AUD_Original]])","v":53.5},53.5,null,10,120]
[null,"SB04-0703-069550","Y",{"$f":"IF(AND(OR(T_NAV_AU[[#This Row],[ColourOptions]]=\"M\",T_NAV_AU[[#This Row],[ColourOptions]]=\"Y\"),MID(T_NAV_AU[[#This Row],[No.]],11,3)=\"069\"),REPLACE(T_NAV_AU[[#This Row],[No.]],11,3,\"xxx\"),T_NAV_AU[[#This Row],[No.]])","v":"SB04-0703-xxx550"},"ZIPSCREEN - L Fixing Rail | 5.5m","069","Pure White",{"$f":"IF(T_NAV_AU[[#This Row],[ColourOptions]]=\"M\",\"as per catalogue\",IF(T_NAV_AU[[#This Row],[Colour Description]]=\"Pure White\", \"Powdercoat, as per catalogue\", T_NAV_AU[[#This Row],[Colour Description]]))","v":"Powdercoat, as per catalogue"},"LENGTH",{"$f":"IF(T_NAV_AU[[#This Row],[CustomPricing]]<>\"\",T_NAV_AU[[#This Row],[CustomPricing]],T_NAV_AU[[#This Row],[AUD_Original]])","v":50},50,null,10,120]
[null,"SB04-0704-000550","N",{"$f":"IF(AND(OR(T_NAV_AU[[#This Row],[ColourOptions]]=\"M\",T_NAV_AU[[#This Row],[ColourOptions]]=\"Y\"),MID(T_NAV_AU[[#This Row],[No.]],11,3)=\"069\"),REPLACE(T_NAV_AU[[#This Row],[No.]],11,3,\"xxx\"),T_NAV_AU[[#This Row],[No.]])","v":"SB04-0704-000550"},"Fixing Rail | 40 x 40 x 3mm x 5.5m","000","Mill Finish",{"$f":"IF(T_NAV_AU[[#This Row],[ColourOptions]]=\"M\",\"as per catalogue\",IF(T_NAV_AU[[#This Row],[Colour Description]]=\"Pure White\", \"Powdercoat, as per catalogue\", T_NAV_AU[[#This Row],[Colour Description]]))","v":"Mill Finish"},"LENGTH",{"$f":"IF(T_NAV_AU[[#This Row],[CustomPricing]]<>\"\",T_NAV_AU[[#This Row],[CustomPricing]],T_NAV_AU[[#This Row],[AUD_Original]])","v":86.04},86.04,null,2,10]
[null,"SB04-0704-069550","Y",{"$f":"IF(AND(OR(T_NAV_AU[[#This Row],[ColourOptions]]=\"M\",T_NAV_AU[[#This Row],[ColourOptions]]=\"Y\"),MID(T_NAV_AU[[#This Row],[No.]],11,3)=\"069\"),REPLACE(T_NAV_AU[[#This Row],[No.]],11,3,\"xxx\"),T_NAV_AU[[#This Row],[No.]])","v":"SB04-0704-xxx550"},"Fixing Rail | 40 x 40 x 3mm x 5.5m","069","Pure White",{"$f":"IF(T_NAV_AU[[#This Row],[ColourOptions]]=\"M\",\"as per catalogue\",IF(T_NAV_AU[[#This Row],[Colour Description]]=\"Pure White\", \"Powdercoat, as per catalogue\", T_NAV_AU[[#This Row],[Colour Description]]))","v":"Powdercoat, as per catalogue"},"LENGTH",{"$f":"IF(T_NAV_AU[[#This Row],[CustomPricing]]<>\"\",T_NAV_AU[[#This Row],[CustomPricing]],T_NAV_AU[[#This Row],[AUD_Original]])","v":106},106,null,2,10]
[null,"SB04-0705-000550","N",{"$f":"IF(AND(OR(T_NAV_AU[[#This Row],[ColourOptions]]=\"M\",T_NAV_AU[[#This Row],[ColourOptions]]=\"Y\"),MID(T_NAV_AU[[#This Row],[No.]],11,3)=\"069\"),REPLACE(T_NAV_AU[[#This Row],[No.]],11,3,\"xxx\"),T_NAV_AU[[#This Row],[No.]])","v":"SB04-0705-000550"},"ZIPSCREEN - Face Fix U Mounting Rail | 5.5m","000","Mill Finish",{"$f":"IF(T_NAV_AU[[#This Row],[ColourOptions]]=\"M\",\"as per catalogue\",IF(T_NAV_AU[[#This Row],[Colour Description]]=\"Pure White\", \"Powdercoat, as per catalogue\", T_NAV_AU[[#This Row],[Colour Description]]))","v":"Mill Finish"},"LENGTH",{"$f":"IF(T_NAV_AU[[#This Row],[CustomPricing]]<>\"\",T_NAV_AU[[#This Row],[CustomPricing]],T_NAV_AU[[#This Row],[AUD_Original]])","v":58.23},58.23,null,8,120]
[null,"SB04-0705-018550","N",{"$f":"IF(AND(OR(T_NAV_AU[[#This Row],[ColourOptions]]=\"M\",T_NAV_AU[[#This Row],[ColourOptions]]=\"Y\"),MID(T_NAV_AU[[#This Row],[No.]],11,3)=\"069\"),REPLACE(T_NAV_AU[[#This Row],[No.]],11,3,\"xxx\"),T_NAV_AU[[#This Row],[No.]])","v":"SB04-0705-018550"},"ZIPSCREEN - Face Fix U Mounting Rail | 5.5m","018","Anodised 20",{"$f":"IF(T_NAV_AU[[#This Row],[ColourOptions]]=\"M\",\"as per catalogue\",IF(T_NAV_AU[[#This Row],[Colour Description]]=\"Pure White\", \"Powdercoat, as per catalogue\", T_NAV_AU[[#This Row],[Colour Description]]))","v":"Anodised 20"},"LENGTH",{"$f":"IF(T_NAV_AU[[#This Row],[CustomPricing]]<>\"\",T_NAV_AU[[#This Row],[CustomPricing]],T_NAV_AU[[#This Row],[AUD_Original]])","v":90.46},90.46,null,8,120]
[null,"SB04-0705-069550","Y",{"$f":"IF(AND(OR(T_NAV_AU[[#This Row],[ColourOptions]]=\"M\",T_NAV_AU[[#This Row],[ColourOptions]]=\"Y\"),MID(T_NAV_AU[[#This Row],[No.]],11,3)=\"069\"),REPLACE(T_NAV_AU[[#This Row],[No.]],11,3,\"xxx\"),T_NAV_AU[[#This Row],[No.]])","v":"SB04-0705-xxx550"},"ZIPSCREEN - Face Fix U Mounting Rail | 5.5m","069","Pure White",{"$f":"IF(T_NAV_AU[[#This Row],[ColourOptions]]=\"M\",\"as per catalogue\",IF(T_NAV_AU[[#This Row],[Colour Description]]=\"Pure White\", \"Powdercoat, as per catalogue\", T_NAV_AU[[#This Row],[Colour Description]]))","v":"Powdercoat, as per catalogue"},"LENGTH",{"$f":"IF(T_NAV_AU[[#This Row],[CustomPricing]]<>\"\",T_NAV_AU[[#This Row],[CustomPricing]],T_NAV_AU[[#This Row],[AUD_Original]])","v":84.79},84.79,null,8,120]
[null,"SB05-1411-050001","N",{"$f":"IF(AND(OR(T_NAV_AU[[#This Row],[ColourOptions]]=\"M\",T_NAV_AU[[#This Row],[ColourOptions]]=\"Y\"),MID(T_NAV_AU[[#This Row],[No.]],11,3)=\"069\"),REPLACE(T_NAV_AU[[#This Row],[No.]],11,3,\"xxx\"),T_NAV_AU[[#This Row],[No.]])","v":"SB05-1411-050001"},"ZIPSCREEN - Inner Rail Funnel & Stop Set + Screws","050","Black, Satin",{"$f":"IF(T_NAV_AU[[#This Row],[ColourOptions]]=\"M\",\"as per catalogue\",IF(T_NAV_AU[[#This Row],[Colour Description]]=\"Pure White\", \"Powdercoat, as per catalogue\", T_NAV_AU[[#This Row],[Colour Description]]))","v":"Black, Satin"},"SET",{"$f":"IF(T_NAV_AU[[#This Row],[CustomPricing]]<>\"\",T_NAV_AU[[#This Row],[CustomPricing]],T_NAV_AU[[#This Row],[AUD_Original]])","v":4.9000000000000004},4.9000000000000004,null,10,500]
[null,"SB05-1511-050001","N",{"$f":"IF(AND(OR(T_NAV_AU[[#This Row],[ColourOptions]]=\"M\",T_NAV_AU[[#This Row],[ColourOptions]]=\"Y\"),MID(T_NAV_AU[[#This Row],[No.]],11,3)=\"069\"),REPLACE(T_NAV_AU[[#This Row],[No.]],11,3,\"xxx\"),T_NAV_AU[[#This Row],[No.]])","v":"SB05-1511-050001"},"ZIPSCREEN - Inner Rail Bottom Cap Set + Screws","050","Black, Satin",{"$f":"IF(T_NAV_AU[[#This Row],[ColourOptions]]=\"M\",\"as per catalogue\",IF(T_NAV_AU[[#This Row],[Colour Description]]=\"Pure White\", \"Powdercoat, as per catalogue\", T_NAV_AU[[#This Row],[Colour Description]]))","v":"Black, Satin"},"SET",{"$f":"IF(T_NAV_AU[[#This Row],[CustomPricing]]<>\"\",T_NAV_AU[[#This Row],[CustomPricing]],T_NAV_AU[[#This Row],[AUD_Original]])","v":3.49},3.49,null,10,500]
[null,"SB07-2103-050001","N",{"$f":"IF(AND(OR(T_NAV_AU[[#This Row],[ColourOptions]]=\"M\",T_NAV_AU[[#This Row],[ColourOptions]]=\"Y\"),MID(T_NAV_AU[[#This Row],[No.]],11,3)=\"069\"),REPLACE(T_NAV_AU[[#This Row],[No.]],11,3,\"xxx\"),T_NAV_AU[[#This Row],[No.]])","v":"SB07-2103-050001"},"ZIPSCREEN - Weight Bar Lock Set + screws","050","Black, Satin",{"$f":"IF(T_NAV_AU[[#This Row],[ColourOptions]]=\"M\",\"as per catalogue\",IF(T_NAV_AU[[#This Row],[Colour Description]]=\"Pure White\", \"Powdercoat, as per catalogue\", T_NAV_AU[[#This Row],[Colour Description]]))","v":"Black, Satin"},"SET",{"$f":"IF(T_NAV_AU[[#This Row],[CustomPricing]]<>\"\",T_NAV_AU[[#This Row],[CustomPricing]],T_NAV_AU[[#This Row],[AUD_Original]])","v":11.5},11.5,null,10,100]
[null,"SB07-2201-022001","N",{"$f":"IF(AND(OR(T_NAV_AU[[#This Row],[ColourOptions]]=\"M\",T_NAV_AU[[#This Row],[ColourOptions]]=\"Y\"),MID(T_NAV_AU[[#This Row],[No.]],11,3)=\"069\"),REPLACE(T_NAV_AU[[#This Row],[No.]],11,3,\"xxx\"),T_NAV_AU[[#This Row],[No.]])","v":"SB07-2201-022001"},"F56 Extern Weight Bar Pull Handle + screws","022","Brushed Silver Satin",{"$f":"IF(T_NAV_AU[[#This Row],[ColourOptions]]=\"M\",\"as per catalogue\",IF(T_NAV_AU[[#This Row],[Colour Description]]=\"Pure White\", \"Powdercoat, as per catalogue\", T_NAV_AU[[#This Row],[Colour Description]]))","v":"Brushed Silver Satin"},"SET",{"$f":"IF(T_NAV_AU[[#This Row],[CustomPricing]]<>\"\",T_NAV_AU[[#This Row],[CustomPricing]],T_NAV_AU[[#This Row],[AUD_Original]])","v":6.7},6.7,null,10,50]
[null,"SB07-2202-013000","N",{"$f":"IF(AND(OR(T_NAV_AU[[#This Row],[ColourOptions]]=\"M\",T_NAV_AU[[#This Row],[ColourOptions]]=\"Y\"),MID(T_NAV_AU[[#This Row],[No.]],11,3)=\"069\"),REPLACE(T_NAV_AU[[#This Row],[No.]],11,3,\"xxx\"),T_NAV_AU[[#This Row],[No.]])","v":"SB07-2202-013000"},"External Weight Bar Handle + Screws MkII","013","S/S 304, Polished",{"$f":"IF(T_NAV_AU[[#This Row],[ColourOptions]]=\"M\",\"as per catalogue\",IF(T_NAV_AU[[#This Row],[Colour Description]]=\"Pure White\", \"Powdercoat, as per catalogue\", T_NAV_AU[[#This Row],[Colour Description]]))","v":"S/S 304, Polished"},"SET",{"$f":"IF(T_NAV_AU[[#This Row],[CustomPricing]]<>\"\",T_NAV_AU[[#This Row],[CustomPricing]],T_NAV_AU[[#This Row],[AUD_Original]])","v":9.74},9.74,null,10,50]
[null,"SB91-0001-050580","N",{"$f":"IF(AND(OR(T_NAV_AU[[#This Row],[ColourOptions]]=\"M\",T_NAV_AU[[#This Row],[ColourOptions]]=\"Y\"),MID(T_NAV_AU[[#This Row],[No.]],11,3)=\"069\"),REPLACE(T_NAV_AU[[#This Row],[No.]],11,3,\"xxx\"),T_NAV_AU[[#This Row],[No.]])","v":"SB91-0001-050580"},"Weight Bar Bubble Seal Strip 8 x 12mm x 5.8m","050","Black, Satin",{"$f":"IF(T_NAV_AU[[#This Row],[ColourOptions]]=\"M\",\"as per catalogue\",IF(T_NAV_AU[[#This Row],[Colour Description]]=\"Pure White\", \"Powdercoat, as per catalogue\", T_NAV_AU[[#This Row],[Colour Description]]))","v":"Black, Satin"},"LENGTH",{"$f":"IF(T_NAV_AU[[#This Row],[CustomPricing]]<>\"\",T_NAV_AU[[#This Row],[CustomPricing]],T_NAV_AU[[#This Row],[AUD_Original]])","v":27.74},27.74,null,10,30]
[null,"SB91-0008-050050","N",{"$f":"IF(AND(OR(T_NAV_AU[[#This Row],[ColourOptions]]=\"M\",T_NAV_AU[[#This Row],[ColourOptions]]=\"Y\"),MID(T_NAV_AU[[#This Row],[No.]],11,3)=\"069\"),REPLACE(T_NAV_AU[[#This Row],[No.]],11,3,\"xxx\"),T_NAV_AU[[#This Row],[No.]])","v":"SB91-0008-050050"},"Ultra Lock Seal V3 - 50 metre rolls","050","Black, Satin",{"$f":"IF(T_NAV_AU[[#This Row],[ColourOptions]]=\"M\",\"as per catalogue\",IF(T_NAV_AU[[#This Row],[Colour Description]]=\"Pure White\", \"Powdercoat, as per catalogue\", T_NAV_AU[[#This Row],[Colour Description]]))","v":"Black, Satin"},"METRE",{"$f":"IF(T_NAV_AU[[#This Row],[CustomPricing]]<>\"\",T_NAV_AU[[#This Row],[CustomPricing]],T_NAV_AU[[#This Row],[AUD_Original]])","v":4.21},4.21,null,50,500]
[null,"SB91-0012-050300","N",{"$f":"IF(AND(OR(T_NAV_AU[[#This Row],[ColourOptions]]=\"M\",T_NAV_AU[[#This Row],[ColourOptions]]=\"Y\"),MID(T_NAV_AU[[#This Row],[No.]],11,3)=\"069\"),REPLACE(T_NAV_AU[[#This Row],[No.]],11,3,\"xxx\"),T_NAV_AU[[#This Row],[No.]])","v":"SB91-0012-050300"},"Fabric Brush T Slot Fit 10mm x 4.8mm | 300 Lm roll","050","Black, Satin",{"$f":"IF(T_NAV_AU[[#This Row],[ColourOptions]]=\"M\",\"as per catalogue\",IF(T_NAV_AU[[#This Row],[Colour Description]]=\"Pure White\", \"Powdercoat, as per catalogue\", T_NAV_AU[[#This Row],[Colour Description]]))","v":"Black, Satin"},"METRE",{"$f":"IF(T_NAV_AU[[#This Row],[CustomPricing]]<>\"\",T_NAV_AU[[#This Row],[CustomPricing]],T_NAV_AU[[#This Row],[AUD_Original]])","v":2.5099999999999998},2.5099999999999998,null,300,1200]
[null,"SB91-0013-050150","N",{"$f":"IF(AND(OR(T_NAV_AU[[#This Row],[ColourOptions]]=\"M\",T_NAV_AU[[#This Row],[ColourOptions]]=\"Y\"),MID(T_NAV_AU[[#This Row],[No.]],11,3)=\"069\"),REPLACE(T_NAV_AU[[#This Row],[No.]],11,3,\"xxx\"),T_NAV_AU[[#This Row],[No.]])","v":"SB91-0013-050150"},"Weight Bar Bubble Seal Push Fit – 150m Roll","050","Black, Satin",{"$f":"IF(T_NAV_AU[[#This Row],[ColourOptions]]=\"M\",\"as per catalogue\",IF(T_NAV_AU[[#This Row],[Colour Description]]=\"Pure White\", \"Powdercoat, as per catalogue\", T_NAV_AU[[#This Row],[Colour Description]]))","v":"Black, Satin"},"METRE",{"$f":"IF(T_NAV_AU[[#This Row],[CustomPricing]]<>\"\",T_NAV_AU[[#This Row],[CustomPricing]],T_NAV_AU[[#This Row],[AUD_Original]])","v":3.78},3.78,null,150,1500]
[null,"SB91-0018-050040","N",{"$f":"IF(AND(OR(T_NAV_AU[[#This Row],[ColourOptions]]=\"M\",T_NAV_AU[[#This Row],[ColourOptions]]=\"Y\"),MID(T_NAV_AU[[#This Row],[No.]],11,3)=\"069\"),REPLACE(T_NAV_AU[[#This Row],[No.]],11,3,\"xxx\"),T_NAV_AU[[#This Row],[No.]])","v":"SB91-0018-050040"},"16mm Bubble Seal | F72 | 40 Lm Rolls","050","Black, Satin",{"$f":"IF(T_NAV_AU[[#This Row],[ColourOptions]]=\"M\",\"as per catalogue\",IF(T_NAV_AU[[#This Row],[Colour Description]]=\"Pure White\", \"Powdercoat, as per catalogue\", T_NAV_AU[[#This Row],[Colour Description]]))","v":"Black, Satin"},"METRE",{"$f":"IF(T_NAV_AU[[#This Row],[CustomPricing]]<>\"\",T_NAV_AU[[#This Row],[CustomPricing]],T_NAV_AU[[#This Row],[AUD_Original]])","v":5.67},5.67,null,40,2000]
[null,"SB91-0019-050580","N",{"$f":"IF(AND(OR(T_NAV_AU[[#This Row],[ColourOptions]]=\"M\",T_NAV_AU[[#This Row],[ColourOptions]]=\"Y\"),MID(T_NAV_AU[[#This Row],[No.]],11,3)=\"069\"),REPLACE(T_NAV_AU[[#This Row],[No.]],11,3,\"xxx\"),T_NAV_AU[[#This Row],[No.]])","v":"SB91-0019-050580"},"16mm Bubble Seal | F56 | 5.8 metre Lengths","050","Black, Satin",{"$f":"IF(T_NAV_AU[[#This Row],[ColourOptions]]=\"M\",\"as per catalogue\",IF(T_NAV_AU[[#This Row],[Colour Description]]=\"Pure White\", \"Powdercoat, as per catalogue\", T_NAV_AU[[#This Row],[Colour Description]]))","v":"Black, Satin"},"LENGTH",{"$f":"IF(T_NAV_AU[[#This Row],[CustomPricing]]<>\"\",T_NAV_AU[[#This Row],[CustomPricing]],T_NAV_AU[[#This Row],[AUD_Original]])","v":36.28},36.28,null,20,200]
[null,"SB91-0408-001015","N",{"$f":"IF(AND(OR(T_NAV_AU[[#This Row],[ColourOptions]]=\"M\",T_NAV_AU[[#This Row],[ColourOptions]]=\"Y\"),MID(T_NAV_AU[[#This Row],[No.]],11,3)=\"069\"),REPLACE(T_NAV_AU[[#This Row],[No.]],11,3,\"xxx\"),T_NAV_AU[[#This Row],[No.]])","v":"SB91-0408-001015"},"7.2mm spline with 15mm tail | 100m roll","001","Clear",{"$f":"IF(T_NAV_AU[[#This Row],[ColourOptions]]=\"M\",\"as per catalogue\",IF(T_NAV_AU[[#This Row],[Colour Description]]=\"Pure White\", \"Powdercoat, as per catalogue\", T_NAV_AU[[#This Row],[Colour Description]]))","v":"Clear"},"ROLL",{"$f":"IF(T_NAV_AU[[#This Row],[CustomPricing]]<>\"\",T_NAV_AU[[#This Row],[CustomPricing]],T_NAV_AU[[#This Row],[AUD_Original]])","v":127.36},127.36,null,1,10]
[null,"SB91-0409-050015","N",{"$f":"IF(AND(OR(T_NAV_AU[[#This Row],[ColourOptions]]=\"M\",T_NAV_AU[[#This Row],[ColourOptions]]=\"Y\"),MID(T_NAV_AU[[#This Row],[No.]],11,3)=\"069\"),REPLACE(T_NAV_AU[[#This Row],[No.]],11,3,\"xxx\"),T_NAV_AU[[#This Row],[No.]])","v":"SB91-0409-050015"},"7mm Fabric Spline w/ 15mm Tail (100m rolls)","050","Black, Satin",{"$f":"IF(T_NAV_AU[[#This Row],[ColourOptions]]=\"M\",\"as per catalogue\",IF(T_NAV_AU[[#This Row],[Colour Description]]=\"Pure White\", \"Powdercoat, as per catalogue\", T_NAV_AU[[#This Row],[Colour Description]]))","v":"Black, Satin"},"ROLL",{"$f":"IF(T_NAV_AU[[#This Row],[CustomPricing]]<>\"\",T_NAV_AU[[#This Row],[CustomPricing]],T_NAV_AU[[#This Row],[AUD_Original]])","v":558.86},558.86,null,1,10]
[null,"SB91-0516-050009","N",{"$f":"IF(AND(OR(T_NAV_AU[[#This Row],[ColourOptions]]=\"M\",T_NAV_AU[[#This Row],[ColourOptions]]=\"Y\"),MID(T_NAV_AU[[#This Row],[No.]],11,3)=\"069\"),REPLACE(T_NAV_AU[[#This Row],[No.]],11,3,\"xxx\"),T_NAV_AU[[#This Row],[No.]])","v":"SB91-0516-050009"},"Foam Tape 1.6mm x 9.0mm | 45m Roll","050","Black, Satin",{"$f":"IF(T_NAV_AU[[#This Row],[ColourOptions]]=\"M\",\"as per catalogue\",IF(T_NAV_AU[[#This Row],[Colour Description]]=\"Pure White\", \"Powdercoat, as per catalogue\", T_NAV_AU[[#This Row],[Colour Description]]))","v":"Black, Satin"},"METRE",{"$f":"IF(T_NAV_AU[[#This Row],[CustomPricing]]<>\"\",T_NAV_AU[[#This Row],[CustomPricing]],T_NAV_AU[[#This Row],[AUD_Original]])","v":2.0299999999999998},2.0299999999999998,null,45,450]
[null,"SB91-1015-050200","N",{"$f":"IF(AND(OR(T_NAV_AU[[#This Row],[ColourOptions]]=\"M\",T_NAV_AU[[#This Row],[ColourOptions]]=\"Y\"),MID(T_NAV_AU[[#This Row],[No.]],11,3)=\"069\"),REPLACE(T_NAV_AU[[#This Row],[No.]],11,3,\"xxx\"),T_NAV_AU[[#This Row],[No.]])","v":"SB91-1015-050200"},"20 x 5mm Ballast x 2m (0.8kg/m) | Wrapped","050","Black, Satin",{"$f":"IF(T_NAV_AU[[#This Row],[ColourOptions]]=\"M\",\"as per catalogue\",IF(T_NAV_AU[[#This Row],[Colour Description]]=\"Pure White\", \"Powdercoat, as per catalogue\", T_NAV_AU[[#This Row],[Colour Description]]))","v":"Black, Satin"},"LENGTH",{"$f":"IF(T_NAV_AU[[#This Row],[CustomPricing]]<>\"\",T_NAV_AU[[#This Row],[CustomPricing]],T_NAV_AU[[#This Row],[AUD_Original]])","v":22.57},22.57,null,10,100]
[null,"SB91-1008-033300","N",{"$f":"IF(AND(OR(T_NAV_AU[[#This Row],[ColourOptions]]=\"M\",T_NAV_AU[[#This Row],[ColourOptions]]=\"Y\"),MID(T_NAV_AU[[#This Row],[No.]],11,3)=\"069\"),REPLACE(T_NAV_AU[[#This Row],[No.]],11,3,\"xxx\"),T_NAV_AU[[#This Row],[No.]])","v":"SB91-1008-033300"},"25 x 8mm Ballast x 3m (1.6kg/m) | Galvanised","033","Heavy Duty Galvanised",{"$f":"IF(T_NAV_AU[[#This Row],[ColourOptions]]=\"M\",\"as per catalogue\",IF(T_NAV_AU[[#This Row],[Colour Description]]=\"Pure White\", \"Powdercoat, as per catalogue\", T_NAV_AU[[#This Row],[Colour Description]]))","v":"Heavy Duty Galvanised"},"LENGTH",{"$f":"IF(T_NAV_AU[[#This Row],[CustomPricing]]<>\"\",T_NAV_AU[[#This Row],[CustomPricing]],T_NAV_AU[[#This Row],[AUD_Original]])","v":58.95},58.95,null,5,50]
[null,"SH91-0135-050200","N",{"$f":"IF(AND(OR(T_NAV_AU[[#This Row],[ColourOptions]]=\"M\",T_NAV_AU[[#This Row],[ColourOptions]]=\"Y\"),MID(T_NAV_AU[[#This Row],[No.]],11,3)=\"069\"),REPLACE(T_NAV_AU[[#This Row],[No.]],11,3,\"xxx\"),T_NAV_AU[[#This Row],[No.]])","v":"SH91-0135-050200"},"ZIP / No. 6 GAUGE - Double Sided | 200mt roll","050","Black, Satin",{"$f":"IF(T_NAV_AU[[#This Row],[ColourOptions]]=\"M\",\"as per catalogue\",IF(T_NAV_AU[[#This Row],[Colour Description]]=\"Pure White\", \"Powdercoat, as per catalogue\", T_NAV_AU[[#This Row],[Colour Description]]))","v":"Black, Satin"},"METRE",{"$f":"IF(T_NAV_AU[[#This Row],[CustomPricing]]<>\"\",T_NAV_AU[[#This Row],[CustomPricing]],T_NAV_AU[[#This Row],[AUD_Original]])","v":11.85},11.85,null,200,400]

{"sheet":"Items_US","index":13,"n_rows":917,"n_cols":21,"rows_kept":917,"cut":false,"hidden":true,"merged":[[0,18,1,18]]}
["No.","Description","US",null,null,null,null,null,null,null,null,null,null,null,null,null,null,null,"OLD FILTERS","AU:","RE01*|RE91*|RE24*|RC91*|AW91*|AW05*|HD82-2366*|SB04*|SB05*|HD86-0332*|RB05*|MT*|RB56*|SB07*|HD82-1884*|RE29*|RE15*|RE20*|SS91*|SH91*|AW92*|RE03*|SB91*|RB91*|RB80*|RB93*|RE24*|SB*|RB92*"]
["AW05-0701-050100","Pivot Arm - 1m (3.2 ft.) Blk",284.51,null,null,null,null,null,null,null,null,null,null,null,null,null,null,null,null,"US:","RE01*|RE91*|RE24*|RC91*|AW91*|AW05*|HD82-2366*|SB04*|SB05*|HD86-0332*|RB05*|MT*|RB56*|SB07*|RE29*|RE15*|RE20*|SS91*|SH91*|AW92*|RE03*|SB91*|RB91*|RB80*|RB93*|RE24*|SB03*|RB92*"]
["AW05-0701-050140","Pivot Arm - 1.4m (4.5 ft.) Blk",307.42]
["AW05-0701-050160","Pivot Arm - 1.6M (5.25 ft.) - Blk",333.3]
["AW05-0701-064100","Pivot Arm - 1m (3.2 ft.) Wht",244.26]
["AW05-0701-064140","Pivot Arm - 1.4m (4.5 ft.) Wht",307.42]
["AW05-0701-069160","Pivot Arm - 1.6M (5.25 ft.) - Pure Wht",333.3]
["AW05-0801-050000","Pivot Arm Cover Cap for Terminal Bar Blk",4.43]
["AW05-0801-064000","Pivot Arm Cover Cap for Terminal Bar Wht",4.43]
["AW91-1401-338000","Idler Housing - 78mm (3\") tube",6.1]
["AW91-1501-050000","Fabric Brush T Slot Fit 7mmH x 4.8mmW 382yd (350m)",1.1000000000000001]
["AW92-0901-000480","78mm Steel Awning Tube, 4.8m (16 ft.) Mill",62.57]
["AW92-0901-000700","78mm Steel Awning Tube, 7m (22.9 ft.) Mill",89.55]
["HD82-0054-010000","Washer, Spring S/S 304, M4",0]
["HD82-1004-025901","Screw - Self Tapper Philips C/Sunk Head #6x3/4\"",0.06]
["HD82-1103-010006","Screw, Socket Button Cap -  FOR RE15-0532-060000",0]
["HD82-1105-010001","Screw Flanged Button Head M5 x 6mm",0]
["HD82-1183-025012","Screw, Pan Phillips Head - M4 x 12",0]
["HD82-1481-010006","Screw, Self Tapping - Type F, Philips, ST2.9 x 6mm",0.1]
["HD82-1491-025010","Screw, Thread Forming - TORX - T8 - K30x10mm",0.03]
["HD82-1493-025006","Screw, Thread Cutting - Type T (Type 23), TORX-T8,",0]
["HD82-1824-025006","Screw For Bottom Up Spool (Bag of 100pcs)",9.48]
["HD82-2366-010008","Channel Lock SetScrw,SelfTap,Type25,PanHead #6x5/8",0.3]
["HD82-2366-010016","Scrw Self Tap,Thread Cutting Type25 Phillips#6x5/8",0.09]
["HD82-2908-025010","Scrw Self Tap, PhillipS Modified Truss Head #8x3/8",0]
["HD82-3021-010000","Nut, Plain, Hex, Metric, P0.70, M4",0]
["HD82-3023-010000","Nut, Plain, Hex, M6 - FOR RE15-0532-060000",0]
["HD86-0001-025903","Semi Tubular Rivet 3/16\"diaX7/16\" Oval Head",0.08]
["HD86-0331-010008","Rivet Dome Head-SS 3.2mm, Grip rng 3.2-4.8mm SS",0.27]
["HD86-0332-010009","Rivet, Dome Head, SS 4.0mm OD, Grip Rnge 3.2-4.8mm",0.81]
["HD86-1011-000150","Pocket alignment pin, 7/64\" x  1-1/2\", steel",0.88400000000000001]
["HD86-1120-010012","Roll Pin, 2mm x 12mm",0]
["HD86-1140-010030","Roll Pin, Spring, Metric, 4.0mm  x 30mm, S/S 304",2.46]
["MT01-1145-050998","AUTOMATE | AX30 & AX50 AC MOTOR COLLAR",0]
["MT01-1145-069002","ARC FT SLIM Motor Quiet [Ø45/10Nm/21rpm]",226.38]
["MT01-1145-069003","ARC FT SLIM Motor [Ø45/15Nm/32rpm]",190.39]
["MT01-1145-069004","ARCFTSLIMMotorQuiet[Ø45/10Nm/21rpm]-20'Cord",244.65]
["MT01-1145-069017","AUTOMATE | AX50 ARC Motor [Ø45/110V/12rpm] LC",334.21]
["MT01-1145-069018","AUTOMATE | AX30 ARC Motor [Ø45/110V/12rpm] LC",297.44]
["MT01-1225-069003","AUTOMATE | DC [25mm/1.1Nm/40r] RS485-MTR024V",235.99]
["MT01-1320-069001","AUTOMATE|LI-ION 0.5Nm ARC Motor[Ø20/5V/20rpm](SKY)",192.31]
["MT01-1322-069003","AUTOMATE|LI-ION 0.5Nm ARC Motor[Ø22/12V/28rpm]",0]
["MT01-1325-069001","AUTOMATE|LI-ION 1.1Nm ARC Short Mtr [Ø25/5V/20rpm]",192.31]
["MT01-1325-069002","AUTOMATE|LI-ION 1.1Nm ARC Motor[Ø25/5V/20rpm](SKY)",192.31]
["MT01-1325-069012","AUTOMATE|LI-ION 1.1Nm CT20 Srt [Ø25/5V/20rpm](SKY)",192.31]
["MT01-1325-069013","AUTOMATE|LI-ION 1.1Nm CT20 [Ø25/5V/20rpm] (SKY)",192.31]
["MT01-1325-069014","AUTOMATE|LI-ION 1.1Nm CT20 [Ø25/5V/28rpm] (SKY)",192.31]
["MT01-1328-069001","AUTOMATE|LI-ION 2.0Nm ARC Motor[Ø28/5V/20rpm](SKY)",233.89]
["MT01-1328-069004","AUTOMATE|LI-ION 2.0Nm CT 15[Ø28/5V/20rpm](SKY)",233.89]
["MT01-1328-069005","AUTOMATE|LI-ION 2.0Nm CT 15[Ø28/5V/28rpm](SKY)",233.89]
["MT01-1335-069001","AUTOMATE|LI-ION 3.0Nm ARC Motor [Ø35/5V/20rpm]",262.12]
["MT01-1345-069001","AUTOMATE | LI-ION Q3.0Nm ARC Motor [Ø45/5V/20rpm]",281.17]
["MT01-1345-069002","AUTOMATE | LI-ION 10Nm ARC Motor [Ø45/5V/9rpm]",300.24]
["MT01-2101-069002","AUTOMATE | VERSA DRAPERY MOTOR [1.2Nm/15V/120rpm",137.46]
["MT01-3001-069001","Cord Lift DCRF Motor-0.8N-45r",159.19]
["MT01-3101-060002","CBG TDBU End Cap Left Side",70.2]
["MT01-3101-060003","CBG TDBU End Cap Right Side",70.2]
["MT01-4001-069002","Automate| Core Tilt Motor Kit",162.24]
["MT02-0101-050004","AUTOMATE Push5 Black ARC Remote",53.86]
["MT02-0101-050008","AUTOMATE Push15 Black ARC Remote",61.95]
["MT02-0101-060009","TDBU 15CH Remote Control White",88.92]
["MT02-0101-067004","AUTOMATE Push5 White ARC Remote",53.86]
["MT02-0101-067008","AUTOMATE Push15 White ARC Remote",61.95]
["MT02-0101-069007","BB | REMOTE CONTROL ARC 15Ch",65.34]
["MT02-0101-072001","RF433 Diagnostic Tool",136.5]
["MT02-0101-072002","AUTOMATE | THE SHADE STORE 15CH ARC Remote",27.77]
["MT02-0101-072003","AUTOMATE | 15CH ARC Remote",61.42]
["MT02-0201-069001","BMS Dash Button Preset for Group Control",269.95999999999998]
["MT02-0202-069001","Frame Button Kit for 4Ch on Flush Switch",13.6]
["MT02-0202-069002","Frame Button Kit for 3Ch on Flush Switch",13.6]
["MT02-0202-069003","Frame Button Kit for 2Ch on Flush Switch",13.6]
["MT02-0202-069004","Frame Button Kit for 1Ch on Flush Switch",13.6]
["MT02-0301-050002","AUTOMATE | ARC Motion Sensor | Black",106]
["MT02-0301-072001","ARC Sun & Wind Sensor",200.74]
["MT02-0301-072002","AUTOMATE | ARC Motion Sensor | White",106]
["MT02-0302-069001","BMS Light Sensor for room measurement indoor range",395.95]
["MT02-0302-069002","BMS Temperature & Humidity sensor indoor range",395.95]
["MT02-0401-067001","Automate Pulse 2 Bridge White/Platinum",215.24]
["MT02-0401-067003","The Shade Store Bridge kit",81.91]
["MT02-0401-067004","Smart Home Collections Bridge kit",215.24]
["MT02-0401-067005","R-TEC Bridge kit",215.24]
["MT02-0401-069007","ARC USB Repeater - White",73.5]
["MT02-0401-069012","BMS Server built-in Ethernet/Serial (RS232/485)",6619.39]
["MT02-0401-331011","AUTOMATE |4 Motor Controller 85-240VAC input",250]
["MT02-0406-000001","Serial Connector Kit",62.28]
["MT02-0406-000002","Serial Adapter | USB to RS232",23.72]
["MT02-0406-000003","Serial Cable Extender Kit – 10’",12.45]
["MT02-0406-000004","Serial Cable Splitter",7.39]
["MT02-0406-000005","Termination Resistor Plug",11.69]
["MT02-0406-000006","Terminal Adapter",60.99]
["MT02-0406-000007","Serial Cable | RJ9 to RJ45 - 24\"",10.89]
["MT03-0103-069004","AUTOMATE Crown & Drive Set|25mm DC | S45",4.95]
["MT03-0103-069005","Crown & Drive Set for 28mm DC motor in S45 Tubes",5.15]
["MT03-0103-069008","DRIVE FOR 25mm and 28MM DC MOTOR IN S45 TUBE",2.85]
["MT03-0109-069002","AUTOMATE|\"Drive for 25mm DC motor in 1.25\"\" tube\"",1.62]
["MT03-0109-069003","Crown & Drive Set for 25mm DC motor in 1.25\" tube",2.13]
["MT03-0110-050020","CROWN AND DRIVE - 25MM MOTOR IN Albright 45mm Tube",2.64]
["MT03-0110-069001","Crown for 28mm Motor in 1.5\" tube",1.53]
["MT03-0110-069002","CROWN & DRIVE 28MM MOTOR IN 1.5\" TUBE with clip",3.94]
["MT03-0110-069007","CROWN  & Drive for 20MM MOTOR IN 1\" TUBE",3.39]
["MT03-0110-069008","CROWN & Drive for 20MM MOTOR IN 1.125\" TUBE",4.59]
["MT03-0110-069009","Crown Adapter for 20mm Motor to use 25mm Crowns",2.14]
["MT03-0110-069010","CROWN & Drive for FOR 20MM MOTOR IN S35 TUBE",1.35]
["MT03-0110-069011","CROWN & DRIVE FOR 20MM MOTOR IN LOUVOLITE 32MM",2.29]
["MT03-0110-069012","CROWN & DRIVE FOR 20MM MOTOR IN LOUVOLITE 38MM",4.21]
["MT03-0110-069013","Crown & Drive Set for 25MM Motor in Louvolite 38mm",4.47]
["MT03-0111-050001","\"AUTOMATE Drive Wheel 35mm | 2.0\"\" Ribbed Tube\"",2.86]
["MT03-0113-027001","AUTOMATE Crown 45mm Motor to 2.5\" Tube - Chrome",0]
["MT03-0113-027002","AUTOMATE Crown 45mm Motor to 2.5\" TubeChrome&Screw",5.41]
["MT03-0113-034001","AUTOMATE Crown 45mm Motor to 2.5\" Tube Satin Nicke",3.11]
["MT03-0113-034002","AUTOMATE Crown 45mm Motor to 2.5\" TubeSatNickScrew",5.41]
["MT03-0113-043001","AUTOMATE Crown 45mm Motor to 2.5\" Tube - Brass",0]
["MT03-0113-043002","AUTOMATE Crown 45mm Motor to 2.5\" TubeBrassScrew",5.41]
["MT03-0113-050001","AUTOMATE Crown 45mm Motor to 2.5\" Tube - Black",2.27]
["MT03-0113-050002","AUTOMATE Crown 45mm Motor to 2.5\" Tube - Black",0.86]
["MT03-0113-075001","AUTOMATE Crown 45mm Motor to 2.5\" Tube - White",2.27]
["MT03-0113-075002","AUTOMATE | Crown 45mm Motor to 2.5\"\" Tube + Screw",0]
["MT03-0113-079001","Crown 45mm Motor to 2.5\" Tube- Antique Bronze",0]
["MT03-0113-079002","Crown 45mm Motor to 2.5\" TubeAntiqueBronze Screw",5.41]
["MT03-0113-091001","AUTOMATE Crown 45mm Motor to 2.5\" Tube - Gun Metal",0]
["MT03-0113-091002","AUTOMATE Crown 45mm Motor to 2.5\"TubeGunMetalScrew",5.41]
["MT03-0114-050002","Automate | Crown 45mm motor 3.25” + scrws Black",2.36]
["MT03-0114-069002","Automate | Crown 45mm motor 3.25” + scrws White",0]
["MT03-0198-025008","AUTOMATE | 50Nm Motor Drive Adaptor Kit",6.53]
["MT03-0198-050002","Crown for 25mm DC motor in Serenity Tube",0.49]
["MT03-0198-050003","Drive for 25mm DC motor in Serenity Tube",0.55000000000000004]
["MT03-0198-050004","AUTOMATE Crown & Drive Set|35-45mm AC-DC | Timber",4.97]
["MT03-0198-050011","AUTOMATE Drive for 25/28mm - 38mm Switch Tube",1.26]
["MT03-0198-050012","AUTOMATE Crown for 25/28mm - 38mm Switch Tube",0.75]
["MT03-0198-050013","AUTOMATE Crown  Drive & Clip |28mm Motor/38mm tube",2.12]
["MT03-0198-050014","Drive for 1.1 Nm motor in CBG Silhouette and Zebra",2.09]
["MT03-0198-069015","Crown for 1.1 Nm motor in CBG Silhouette tube",1.59]
["MT03-0198-069016","Crown for 1.1 Nm motor in CBG Zebra tube",1.59]
["MT03-0203-069001","AUTOMATE | BRACKET ADAPTOR S45 SERIES",1.05]
["MT03-0205-069001","AUTOMATE | BRACKET ADAPTOR R8 SERIES",1.05]
["MT03-0205-069002","AUTOMATE | BRACKET ADAPTOR R16-SERIES",1.05]
["MT03-0205-069005","AUTOMATE | BRACKET ADAPTOR MAXXMAR FOR 5V MOTOR",1.05]
["MT03-0205-069006","AUTOMATE | BRACKET ADAPTOR FOR LARGE LOUVOLITE SYS",1.05]
["MT03-0205-069007","AUTOMATE | BRACKET ADAPTOR FOR COULISSE SYSTEMS",1.05]
["MT03-0206-069001","Motor Adapter 25/28mm to SKY 2Nm v3",0.7]
["MT03-0206-069002","AUTOMATE | BRACKET ADAPTOR SKYLINE SERIES",1.05]
["MT03-0207-050016","Cord Lift Motor Adapter for Springs Headrail",0.96]
["MT03-0207-050020","Cord lift motor adapter for Lafayette",0.95]
["MT03-0207-050021","Shaft Adaptor for Tilt Motor to D Shaft+grub screw",0.45]
["MT03-0207-069011","35mm Slim Head ARC Motor Star Head Adapter+ screws",3.07]
["MT03-0207-069015","AUTOMATE | BRACKET ADAPTOR LOUVOLITE SERIES",1.05]
["MT03-0207-069018","Motor Adptr Clip for 5 or 12v-25/28 Mtrs to CBG DR",1.78]
["MT03-0301-069007","Automate | 4M 28AWG Copper USB Charger Cable",11.75]
["MT03-0301-069008","USB Wall Charger - 5v, 2a, White US Plug Universal",8.49]
["MT03-0301-069012","Automate Connection Harness for DCRF Motors-JST sc",4.2300000000000004]
["MT03-0301-069013","\"AUTOMATE USB Charging Cable Extender 48\"\" /1200mm",8.57]
["MT03-0301-069014","\"AUTOMATE USB Charging Cable Extender 8\"\" / 210mm",5.72]
["MT03-0301-069023","AUTOMATE | USB  Kit 1 x cable 1 x USB connector",8.57]
["MT03-0301-069024","AUTOMATE | USB  Kit 1 x cable 5 x USB connector",13.19]
["MT03-0301-069025","AUTOMATE | USB  Kit 25 x USB connector",28.58]
["MT03-0301-411005","Automate|15V DC,24A,360W, 18CH Power 100-240VAC",243.36]
["MT03-0302-050002","BMS Pole Long Range Antenna",269.95999999999998]
["MT03-0302-067001","AUTOMATE | Solar Panel 2.0",108.14]
["MT03-0304-050007","Automate|1.8M/6FT 3 PIN US Plug AC Power Cord Adap",8.8800000000000008]
["MT03-0304-069002","Replacement Hardware kit for Li-ion Solar Panel",5.28]
["MT03-0304-069003","Automate I Acc Y Cable - 1 Solar Panel 2 Motors",6.13]
["MT03-0304-069012","AUTOMATE | Magnetic Cube connector for 12V motor",9.0500000000000007]
["MT03-0304-069013","AUTOMATE | Magnetic cable Extension 20\" for 12V mo",8.66]
["MT03-0305-069003","AUTOMATE | RECHARGABLE BATTERY PACK 2600mAh – 5V",95.32]
["MT03-0305-069004","AUTOMATE | VERSA BATTERY MODULE [2600 mAh]",125.21]
["MT03-0305-069005","AUTOMATE |VERSA AC MODULE 10’ CORD + PLUG [110V]",59.78]
["MT03-0305-069006","AUTOMATE | VERSA AC MODULE 20’ CORD [110V]",84.69]
["MT03-0305-069007","Rechargeable Battery Pack Clip Pads Kit",0]
["MT03-0401-069004","AUTOMATE | MOTOR END PULLY \"S\" TRACK WHITE",4.8899999999999997]
["MT03-0401-069012","R-TECH AUTOMATED TRACK CEILING MOUNT CLIP - WHITE",1.21]
["MT03-0401-069013","AUTOMATE | RETURN PULLEY  PULLY \"S\" TRACK WHITE",3.61]
["MT03-0401-069014","AUTOMATE | VERTICAL END PULLY \"B\" TRACK",11.64]
["MT03-0401-078004","AUTOMATE | MOTOR END PULLY \"S\" TRACK BRONZE",4.8899999999999997]
["MT03-0401-078012","R-Tech Automated Track Ceiling Mount Clip - Bronze",1.21]
["MT03-0401-078013","AUTOMATE | RETURN PULLEY  PULLY \"S\" TRACK BRONZE",3.61]
["MT03-0502-027001","Motor Cap for 25/28mm Autom 5V Motor - Chrome",4.28]
["MT03-0502-034001","Motor Cap for 25/28mm Autom 5V Motor -Satin Nickel",4.28]
["MT03-0502-043001","Motor Cap for 25/28mm Autom 5V Motor - Brass",4.28]
["MT03-0502-059001","Motor Cap for 25/28mm Autom 5V Motor - Black",3.26]
["MT03-0502-077001","Motor Cap for 25/28mm Autom 5V Motor - White",3.26]
["MT03-0502-079001","Motor Cap for 25/28mm Autom 5V Motor - Ant. Bronze",4.28]
["MT03-0502-091001","Motor Cap for 25/28mm Autom 5V Motor - Gun Metal",4.28]
["MT03-0601-069001","AC 2 Conductor Right Angle Field Plug 125v - 15A",4.84]
["MT03-0603-050001","AUTOMATE | Male Power Plug Adapter - 2.1mm x 5.5mm",4.53]
["MT03-0603-050002","AUTOMATE | 4pin Waterproof connector",12.54]
["MT03-0603-050003","Motor Adapt Kit Cord Lift - HT Headrail",1.05]
["MTCLIP-18-25-28","Motor Drive Clip For 18/25/28mm Motors",0.09]
["MTCLIP-35-45","Motor Drive Clip For 35/45mm Motors",0.1]
["MTCLIP-35-45-V2","Motor Drive Clip For 35/45 Drive Adapte-ST40 Drive",0.81]
["MTRF-DCIM-1C","1 Channel Dry Contact Input Module for 433 RF",27.6]
["MTRF-REM-15","RF White 15 Channel Remote w/Levelling Control",61.95]
["MTRF-REM-15NL","RF White 15 Channel Rmt / Level Control Plain Pkg",61.95]
["MTRF-REM-1C","RF White 1 Channel Remote",52.41]
["MTRF-REM-WP2","Wall Plates only for Remotes",5.38]
["MTRF-SUNSENS","Automate Interior Sun Sensor",33.35]
["MTRF-WIFIBRIDGE","PULSE Wi-Fi to ARC - 2 way RF Bridge",219.03]
["MTRF-WIFIBRIDGE-KIT","PULSE Wi-Fi to ARC - 2 way RF Bridge Kit",219.03]
["MTRF-WS-15","RF White 15 Channel Decorator Switch (Cut In)",50.03]
["MTRF-WS-1C","RF White 1 Channel  Decorator Wall Switch (Cut In)",40.51]
["MTRF-WS-2C","RF White 2 Channel Decorator Wall Switch (Cut In)",45.27]
["MTRF-WS5-FLUSH","RF White 5 Channel Decorator Surface Mount Switch",47.65]
["MTRF-WS-COVER","Decorator Screw-less Switch Cover Plate",10.66]
["RB05-0100-050045","Crank Gear Drive Tube Adaptor 7x7mm square shaft",3.92]
["RB05-4007-025001","Crank Gear - Small [Ratio 2.8:1] w/screw & washer",32.130000000000003]
["RB05-4013-069001","Crank Gear-[Ratio 9:1] w/screw&nuts-13x13mm-Wht",38.049999999999997]
["RB05-4207-025001","Gear Large [Ratio 6:1]+screw, wshr & roll pin",0]
["RB05-4207-025003","Gear Large [Ratio 6:1]+screw,wshr&roll pinNO Joint",0]
["RB05-8358-069040","Easy-Lock Gear Small VX RB08 Instal Bkts 40mm Proj",6.04]
["RB05-9101-020001","Coupling Joint Set",18.93]
["RB05-9101-069002","External Shade attch. for Internal op. 300mm Shaft",0]
["RB05-9101-340100","Crank Control Arm 100cm  (3.2ft) Gray",59.07]
["RB05-9101-340150","Crank Control Arm 150cm (4.9ft) Gray",65.09]
["RB05-9101-340200","Crank Control Arm 200cm (6.5ft) Gray",75.95]
["RB05-9102-069000","Crank Arm Support White",2.37]
["RB05-9102-340000","Crank Arm Support Gray",2.37]
["RB05-9201-069120","Crank Arm Rod 120cm (3.9 ft) - White",38.049999999999997]
["RB05-9201-069160","Crank Arm Rod 160cm (5.25 ft) - White",43.66]
["RB05-9359-069040","Easy-Lock Gear Small LX RB09 Instal Bkts 40mm Proj",6.04]
["RB10-0101-050060","Bkt Cover Cap+screw-Blk",1.63]
["RB10-0101-069060","Bkt Cover Cap+screw-Wht",1.63]
["RB10-0101-338060","Bkt Cover Cap+screw-SlvGry",1.63]
["RB10-6000-050060","RB10 Tube adapter S60/60 STD Tube Blk",1.74]
["RB10-6000-050080","RB10 Tube adapter S60/80 HD Tube Blk",1.97]
["RB10-6000-069060","RB10 Tube adapter S60/60 STD Tube Wht",1.74]
["RB10-6000-069080","RB10 Tube adapter S60/80 HD Tube Wht",1.97]
["RB10-6040-050031","RB10 Retro-Fit Booster Stndrd LHS60-Blk",28.66]
["RB10-6040-050032","RB10 Retro-Fit Booster Stndrd RHS60-Blk",28.66]
["RB10-6040-050041","RB10 Retro-Fit Booster Heavy LHS60-Blk",32.020000000000003]
["RB10-6040-050042","RB10 Retro-Fit Booster Heavy RHS60-Blk",32.020000000000003]
["RB10-6040-050051","RB10 Retro-Fit Booster Extra Heavy LHS60-Blk",38.46]
["RB10-6040-050052","RB10 Retro-Fit Booster Extra Heavy RHS60-Blk",36.979999999999997]
["RB10-6040-050114","RB10 Retro-Fit Booster Light RH SHORT 24”|S60 Blk",24.63]
["RB10-6040-050161","RB10 Retro-Fit Booster SHORT SPRING LH | S60",21.66]
["RB10-6040-050171","RB10 Retro-Fit Booster Extra Short Spring LHS60",32.020000000000003]
["RB10-6100-050001","RB10 Winder Body S60 - Blk",14.34]
["RB10-6100-069001","RB10 Winder Body S60 - Wht",14.34]
["RB10-6200-050001","RB10 Bearing Idler Head S60-Blk",12.96]
["RB10-6200-069001","RB10 Bearing Idler Head S60 Wht",12.96]
["RB10-6220-050001","RB10 Pre-Tension Idler-Left Hand S60-Blk",7.55]
["RB10-6220-050002","RB10 Pre-Tension Idler - Right Hand | S60",7.55]
["RB10-6300-050001","RB10 Winder Bkt Kit-Univ. FixS60-Blk",17.61]
["RB10-6300-069001","RB10 Winder Bkt Kit-Univ. FixS60-Wht",17.61]
["RB10-6400-050001","RB10 Idler-Univrsl Bkt adptr+screwS60-Blk",2.67]
["RB10-6400-069001","RB10 Idler-Univrsl Bkt adptr+screwS60-Wht",2.67]
["RB10-6410-050001","RB10 Idler Adaptor Spacer + Screws",7.84]
["RB10-6500-050001","RB10 Idler Bkt Kit-Univ. Fix S60-Blk",10.34]
["RB10-6500-069001","RB10 Idler Bkt Kit-Univ. Fix S60-Wht",10.34]
["RB10-6500-338001","RB10 Idler Bkt Kit-Univ. Fix S60-SlvGry",10.34]
["RB10-9101-025008","Pretension Spanner for RB10 Idler-8mm SQ Slvr ZINC",15.79]
["RB10-9102-025008","Pretension Spanner for RB10/RE01 - 8mm Square",15.79]
["RB560","Bracket Set R16 1-1/2\" Projection Zinc",1.48]
["RB56-0105-050502","AUTOMATE Drive Wheel | S60 - S80",2.82]
["RB56-0105-050511","M50 Drive Wheel | S60 - SONESSE 50",0.96]
["RB56-0105-050518","AUTOMATE Drive Wheel Set | S60 S80 | Impact Detect",3.48]
["RB56-0118-050060","Idle Bkt Cover S60 Blk",1.4]
["RB56-0118-069060","Idle Bkt Cover S60 Wht",1.4]
["RB56-0125-050060","Star Head+Idle Bkt Cover S60",1.57]
["RB56-0125-069060","Star Head+Idle Bkt Cover S60-Wht",1.57]
["RB56-0125-338060","Star Head+Idle Bkt Cover S60-SlvGry",1.4]
["RB56-0136-050502","M50 Crown Wheel | S60 / 60STD Tube - ELERO 50",1.85]
["RB56-0136-050504","M50 Crown Wheel S60/60STD Tube-GAPOSA 50 Blk",1.85]
["RB56-0136-050508","AUTOMATE Crown Wheel | S60 STD Tube",2.98]
["RB56-0138-050502","M50 Crown Wheel | S60 / 80HD Tube - ELERO/GAPOSA 5",2.98]
["RB56-0138-050508","AUTOMATE Crown Wheel | S80 HD Tube",2.98]
["RB56-0205-050511","M50 Noise reduce Drive Wheel S60-SOMFY SONESSE 50",1.85]
["RB56-0236-050501","M50 Noise reduce Crown WheelS60/60STD Tube-SOMFY50",1.85]
["RB56-0238-050501","M50 Noise reduce Crown WheelS60/80HD Tube-SOMFY50",2.98]
["RB56-0336-050502","Crown & Drive Set for 45mm motor in S60 tube",11.6]
["RB56-0338-050502","Crown & Drive Set for 45mm motor in S80 tube",11.6]
["RB56-0701-050050","M50 Motor adptr set+screwS60-SOMFY 50 ROUND",6.92]
["RB56-0701-050508","M50 Motor Adaptor set+screws S60 AUTOMATE/DOOYA",3.97]
["RB56-0701-069050","M50 Motor Adaptor set+screws S60 SOMFY 50 ROUND",7.75]
["RB56-0701-069508","M50 Motor Adaptor set+screws S60 AUTOMATE/DOOYA",3.97]
["RB56-0701-069518","ARC Motor Adapter Set S60-80 (part 1 of 2 for Kit)",3.69]
["RB56-0702-050050","M50 Motor Adaptor set + screws | S60 - ELERO 50",3.97]
["RB56-0702-069050","M50 Motor Adaptor set + screws | S60 - ELERO 50",3.97]
["RB56-0711-050501","M50 Motor Head Plate | S60 - SOMFY 50 ROUND HEAD",5.64]
["RB56-0711-050506","M50 Motor Head Plate | S60 - BECKER 50",5.03]
["RB56-0711-050509","M50 Motor Head Plate | S60 - AUTOMATE/DOOYA",5.03]
["RB56-0711-050519","M50 SLIM Motor Head Plate + screws | AUTOMATE S60",5.03]
["RB56-0711-069518","M50 SLIM Motor Head Plate | AUTOMATE S60",7.03]
["RB56-0721-069518","Motor Adapter kit, 45mm to S60/80 Brackets (set)",8.5299999999999994]
["RB56-0752-025050","M50 Motor adptr set+screwS60-SOMFY STAR HEAD 50",4.72]
["RB56-0762-014050","Univeral Zamak adapter w/Lock ring &M8x12mm screw",46.28]
["RB56-0763-014050","Univ Zamak Adap&Lock Ring & M6x10mm S/Screws Open",36.71]
["RB56-0764-014050","Univ Zamak Adap&Lock Ring & M6x12mm S/Screws Box",33.03]
["RB560BK","Bracket Set R16 1-1/2\" Projection Black",1.48]
["RB560EXT","Bracket Set R16 1-1/2\" Projection Zinc Exterior",1.74]
["RB560W","Bracket Set R16 1-1/2\" Projection White",1.48]
["RB56-1001-050060","Auto Idler S60/60STD Tube-Blk",13.21]
["RB56-1001-050061","Auto Idler S60/60STD Tube-Blk",13.21]
["RB56-1001-050080","Auto Idler S60/80HD Tube-Blk",16.16]
["RB56-1001-050081","Auto Idler S60/80HD Tube-Blk",16.16]
["RB56-1001-069061","Auto Idler S60/60STD Tube-Wht",13.21]
["RB56-1001-069080","Auto Idler S60/80HD Tube",16.16]
["RB56-1001-069081","Auto Idler S60/80HD Tube",16.16]
["RB56-1002-050060","Multi-Link Intermed Drive S60/60STD Tube-Blk",12.14]
["RB56-1002-050080","Multi-Link Intermed Drive S60/80HD Tube-Blk",18.3]
["RB56-1002-069060","Multi-Link Intermed Drive S60/60STD Tube-Wht",12.14]
["RB56-1002-069080","Multi-Link Intermed Drive S60/80HD Tube-Wht",18.3]
["RB561FPBK","Face Plate R-Series Fascia 3\" Pair Black",0.87]
["RB561FPBZ","Face Plate R-Series Fascia 3\" Pair Bronze",0.87]
["RB561FPG","Face Plate R-Series Fascia 3\" Pair Gray",0.87]
["RB561FPV","Face Plate R-Series Fascia 3\" Pair Vanilla",0.87]
["RB561FPW","Face Plate R-Series Fascia 3\" Pair White",0.87]
["RB561RTNBK","Bracket Set R-Series Fascia R16 3\" Black",7.92]
["RB561RTNBZ","Bracket Set R-Series Fascia R16 3\" Bronze",7.92]
["RB561RTNG","Bracket Set R-Series Fascia R16 3\" Gray",7.92]
["RB561RTNV","Bracket Set R-Series Fascia R16 3\" Vanilla",7.92]
["RB561RTNW","Bracket Set R-Series Fascia R16 3\" White",7.92]
["RB56-2002-050060","Multi-Link Intermed Receiver S60/60STD Tube-Blk",8.25]
["RB56-2002-050080","Multi-Link Intermed Receiver S60/80HD Tube-Blk",11.04]
["RB56-2002-069060","Multi-Link Intermed Receiver S60/60STD Tube-Wht",8.25]
["RB56-2002-069080","Multi-Link Intermed Receiver S60/80HD Tube-Wht",11.04]
["RB56-3002-050060","UNI-Link Receiver S60/60STD Tube-Blk",13.7]
["RB56-3002-069060","UNI-Link Receiver S60/60STD Tube-Wht",13.7]
["RB56-3002-069080","UNI-Link Receiver S60/80HD Tube Wht",13.7]
["RB56-7102-050060","M50 Motor Bkt-Univ. Fix S60-SOMFY 50 STAR HEAD-Blk",6.22]
["RB56-7102-069060","M50 Motor Bkt-Univ. Fix S60-SOMFY 50 STAR HEAD-Wht",6.22]
["RB56-7102-338060","M50 Motor Bkt-Univ. Fix S60-SOMFY 50 STAR HEAD Gry",5.54]
["RB56-7103-050060","M50 Univ. Motor Bkt-60mm Univ. Fix S60-Blk",8.89]
["RB56-7103-050080","M50 Univ. Motor Bkt-80mm Univ. Fix S60-Blk",38.619999999999997]
["RB56-7103-069060","M50 Univ. Motor Bkt-60mm Univ. Fix S60-Wht",8.89]
["RB56-7103-069080","M50 Univ. Motor Bkt-80mm Univ. Fix S60-Wht",38.619999999999997]
["RB56-7123-050060","Combo Univ. Motor Base Bkt LH-Top/Ceil Fix S60-Blk",47.96]
["RB56-7123-069060","Combo Univ. Motor Base Bkt LH-Top/Ceil Fix S60-Wht",47.96]
["RB56-7124-050060","Combo Univ. Motor Base Bkt RH-Top/Ceil Fix S60-Blk",47.96]
["RB56-7124-069060","Combo Univ. Motor Base Bkt RH-Top/Ceil Fix S60-Wht",47.96]
["RB56-7201-050060","Intermed Bkt Adj.60mm Top/Ceil Fix S60-Blk",23.28]
["RB56-7201-050080","Intermed Bkt Adj.80mm Top/Ceil Fix S60-Blk",55.72]
["RB56-7201-069060","Intermed Bkt Adj.60mm Top/Ceil Fix S60-Wht",23.28]
["RB56-7201-069080","Intermed Bkt Adj.80mm Top/Ceil Fix S60-Wht",55.72]
["RB56-7202-050060","Intermed Bkt Adj.60mm Face/Wall Fix S60-Blk",23.28]
["RB56-7202-050080","Intermed Bkt Adj.80mm Face/Wall Fix S60-Blk",55.72]
["RB56-7202-069060","Intermed Bkt Adj.60mm Face/Wall Fix S60-Wht",23.28]
["RB56-7202-069080","Intermed Bkt Adj.80mm Face/Wall Fix S60-Wht",55.72]
["RB56-7223-050060","Combo Intermed Bkt Adj.Top/Ceil Fix S60-Blk",82.16]
["RB56-7223-069060","Combo Intermed Bkt Adj.Top/Ceil Fix S60-Wht",82.16]
["RB56-7301-050060","Idle End Bkt Adj.60mm Top/Ceil Fix S60-Blk",23.28]
["RB56-7301-050061","Idle End Bkt Adj.60mm Top/Ceil Fix S60-Blk",23.28]
["RB56-7301-050080","Idle End Bkt Adj.80mm Top/Ceil Fix S60-Blk",55.72]
["RB56-7301-050081","Idle End Bkt Adj.80mm Top/Ceil Fix S60-Blk",55.72]
["RB56-7301-069060","Idle End Bkt Adj.60mm Top/Ceil Fix S60-Wht",23.28]
["RB56-7301-069061","Idle End Bkt Adj.60mm Top/Ceil Fix S60-Wht",23.28]
["RB56-7301-069080","Idle End Bkt Adj.80mm Top/Ceil Fix S60-Wht",55.72]
["RB56-7301-069081","Idle End Bkt Adj.80mm Top/Ceil Fix S60-Wht",55.72]
["RB56-7302-050060","Idle End Bkt Adj.60mm Face/Wall Fix S60-Blk",23.28]
["RB56-7302-050061","Idle End Bkt Adj.60mm Face/Wall Fix S60-Blk",23.28]
["RB56-7302-050080","Idle End Bkt Adj.80mm Face/Wall Fix S60 Blk",55.72]
["RB56-7302-050081","Idle End Bkt Adj.80mm Face/Wall Fix S60 Blk",55.72]
["RB56-7302-069060","Idle End Bkt Adj.60mm Face/Wall Fix S60-Wht",23.28]
["RB56-7302-069061","Idle End Bkt Adj.60mm Face/Wall Fix S60-Wht",23.28]
["RB56-7302-069080","Idle End Bkt Adj.80mm Face/Wall Fix S60-Wht",55.72]
["RB56-7302-069081","Idle End Bkt Adj.80mm Face/Wall Fix S60-Wht",55.72]
["RB56-7323-050060","Combo Idle End Bkt Adj. LH-Top/Ceil Fix S60-Blk",82.16]
["RB56-7323-050061","Combo Idle End Bkt Adj. LH-Top/Ceil Fix S60-Blk",82.16]
["RB56-7323-069060","Combo Idle End Bkt Adj. LH-Top/Ceil Fix S60-Wht",82.16]
["RB56-7323-069061","Combo Idle End Bkt Adj. LH-Top/Ceil Fix S60-Wht",82.16]
["RB56-7324-050060","Combo Idle End Bkt Adj. RH-Top/Ceil Fix S60-Blk",82.16]
["RB56-7324-050061","Combo Idle End Bkt Adj. RH-Top/Ceil Fix S60-Blk",82.16]
["RB56-7324-069060","Combo IdleEnd Bkt Adj. RH-Top/Ceil Fix S60-Wht",82.16]
["RB56-7324-069061","Combo IdleEnd Bkt Adj. RH-Top/Ceil Fix S60-Wht",82.16]
["RB56-7401-050060","Uni-Link Int Bkt Adj.60mm Top/Ceil Fix S60-Blk",110.82]
["RB56-7401-069060","Uni-Link Int Bkt Adj.60mm Top/Ceil Fix S60-Wht",110.82]
["RB56-7402-050060","Uni-Link Inter.Bkt Adj. 60mm Face/Wall Fix S60 Blk",110.82]
["RB56-7402-069060","Uni-Link Inter.Bkt Adj. 60mm Face/Wall Fix S60 Wht",110.82]
["RB56-7510-050060","Intermed Bkt NON Adj.Univ. Fix S60-Blk",11.97]
["RB56-7510-069060","Intermed Bkt NON Adj.Univ. Fix S60-Wht",11.97]
["RB56-7523-050060","Combo Inter. Bkt NON Adj.Top/Ceil Fix S60-Blk",29.48]
["RB56-7523-069060","Combo Inter. Bkt NON Adj.Top/Ceil Fix S60-Wht",29.48]
["RB56-7610-050061","Idle End Bkt SLT NON Adjust Univ. Fix S60 - Blk",13.41]
["RB56-7610-069061","Idle End Bkt SLT NON Adjust Univ. Fix S60 - Wht",13.41]
["RB56-7621-050060","Combo IdleEnd Bkt NON ADJ. LH-Top/Ceil Fix S60-Blk",33.03]
["RB56-7621-050061","Combo IdleEnd Bkt NON ADJ. LH-Top/Ceil Fix S60-Blk",33.03]
["RB56-7621-069060","Combo IdleEnd Bkt NON ADJ. LH-Top/Ceil Fix S60-Wht",33.03]
["RB56-7621-069061","Combo IdleEnd Bkt NON ADJ. LH-Top/Ceil Fix S60-Wht",33.03]
["RB56-7622-050060","Combo IdleEnd Bkt NON ADJ. RH-Top/Ceil Fix S60-Blk",33.03]
["RB56-7622-050061","Combo IdleEnd Bkt NON ADJ. RH-Top/Ceil Fix S60-Blk",33.03]
["RB56-7622-069060","Combo IdleEnd Bkt NON ADJ. RH-Top/Ceil Fix S60-Wht",33.03]
["RB56-7622-069061","Combo IdleEnd Bkt NON ADJ. RH-Top/Ceil Fix S60-Wht",33.03]
["RB56-9107-020068","Adj. Tool Univ. Nickel  S60-Polished Slvr",21.69]
["RB80-0101-073100","Extreme Crank Gear adapter S100",11.19]
["RB80-0201-073100","Extreme Bearing Idler [Dual Shaft 15x10mm] S100",66.05]
["RB80-0202-073100","Extreme Bearing Idler | S100",66.05]
["RB80-0211-073100","ZIPSCREEN Extreme Bearing Idler (15x10mm) S100",66.05]
["RB80-0301-073100","Extreme Universal Drive Wheel S100",10.08]
["RB80-0411-025050","SOMFY Zamack Adapter Spacer",10.85]
["RB80-0451-025100","Crank adapter Kit S100",32.47]
["RB80-0475-025100","Wire Guide adptr/inside mnt Bkt(CrankEnd)S100 Zinc",47.43]
["RB80-0475-066100","Wire Guide adptr/inside mnt Bkt(CrankEnd)S100 Wht",47.43]
["RB80-0476-025100","MOTOR Extr.WireGuide Bkt/adptr kit Ceilng/wall-Znc",55.03]
["RB80-0476-050100","MOTOR Extr.WireGuide Bkt/adptr kit Ceilng/wall-Blk",69.12]
["RB80-0476-066100","MOTOR Extr.WireGuide Bkt/adptr kit Ceilng/wall-Wht",69.12]
["RB80-0476-069100","EXTREME Wire Guide Bracket Adaptor Set | Motor",69.12]
["RB80-0477-050100","GEAR Extr.WireGuide Bkt/adptr kit Ceilng/wall-Blk",83.23]
["RB80-0477-066100","GEAR Extr.WireGuide Bkt/adptr kit Ceilng/wall-Wht",83.23]
["RB80-0478-050100","Motor Extreme Inside Mount Bkt Kit S100-Blk",118.49]
["RB80-0478-066100","Motor Extreme Inside Mount Bkt Kit S100-Off Wht",118.49]
["RB80-0478-069100","EXTREME Recess Bracket Kit | Motor",118.49]
["RB80-0479-050100","Gear Extreme Inside Mount Bkt Kit S100-Blk",125.55]
["RB80-0479-066100","Gear Extreme Inside Mount Bkt Kit S100-Off Wht",125.55]
["RB80-0481-012000","Box 190 Wire Guide Adaptor Plate with Screws",12.04]
["RB80-0501-050110","Extreme Zip Reducer Endplate Set+screw S100/110STD",6.55]
["RB80-0501-050130","Extreme Zip Reducer Endplate Set+screw S100/130HD",7.95]
["RB80-0601-073110","S100 Extreme Tube Endplate [2pc set+screw] 110STD",6.71]
["RB80-0601-073130","S100 Extreme Tube Endplate [2pc set+screw] 130HD",8.9499999999999993]
["RB80-0601-073160","S100 Extreme Tube Endplate [2pc set+screw] 160XHD",10.08]
["RB80-0701-073100","Extreme Universal Crown Wheel S100",23.5]
["RB80-1201-050109","Extreme Ceiling/wall mount Bkt Set+adptr S100-Blk",97.34]
["RB80-1201-066109","Extreme Ceiling/wall mount Bkt Set+adptr S100-Wht",97.34]
["RB80-1201-069109","Extreme Ceiling/wall mount Bkt Set+adptr S100-Wht",97.34]
["RB80-1501-050110","Extreme Square Bkt Plate Inside mnt S100-Blk",26.81]
["RB80-1501-069110","Extreme Square Bkt Plate Inside mnt S100-Pure Wht",26.81]
["RB80-1502-025110","Extreme Square Idle Bkt Plate Inside mnt S100-ZINC",33.86]
["RB80-1502-050110","Extreme Square Idle Bkt Plate Inside mnt S100-Blk",33.86]
["RB80-1502-066110","Extreme Square Idle Bkt Plate Inside mnt S100-Wht",33.86]
["RB80-1502-069110","EXTREME Square Idle Bracket Plate [110 x 5mm]",33.86]
["RB80-1503-025110","Extreme Bracket Adaptor Kit (Motor/Idler Plt)-Zinc",60.67]
["RB80-1503-050110","Extreme Bracket Adaptor Kit (Motor/Idler Plt)-Blk",60.67]
["RB80-1503-069110","Extreme Bracket Adaptor Kit (Motor/Idler Plt)-Wht",60.67]
["RB91-0260-000490","S60/60STD Al. Tube OD 60mmx4.87m(16Ft) Mill NoTape",88.85]
["RB91-0280-000490","S60/80HD Al. Tube OD 80mmx4.87m (16Ft) Mill NoTape",129.96]
["RB91-0403-000300","PVC Keyway Tube Spline 20mm tail/300 Lm Roll-Clear",128.74]
["RB91-1232-020490","D30 Silent Alum. Bottom Rail 16ft (4.87m) Ano.",29.04]
["RB91-1232-02058C","D30 SILENT Bottom Rail - ANODISED( Loose Loading)",0]
["RB91-1232-050490","D30 Silent Alum. Bottom Rail 16ft (4.87m) Blk",29.04]
["RB91-1232-050580","D30 Silent Alum. Bottom Rail 19ft (5.8m) Blk",34.479999999999997]
["RB91-1232-05058C","D30 Silent Alum. Bottom Rail Blk (Loose loading)",0]
["RB91-1232-069490","D30 Silent Alum. Bottom Rail 16ft (4.87m) Wht",29.04]
["RB91-1232-06958C","D30 SILENT Bottom Rail - WHITE( Loose Loading)",0]
["RB91-1232-080490","D30 Silent Alum. Bottom Rail 16ft (4.87m) Bronze",29.04]
["RB91-1232-414490","D30 Silent Alum. Bottom Rail 16ft (4.87m) Vanilla",29.04]
["RB91-1232-41458C","D30 SILENT Bottom Rail - VANILLA( Loose Loading)",0]
["RB91-1239-020490","Bottom Up Rail 16’ Anodized",47.49]
["RB91-1239-050490","Bottom Up Rail 16’ Black",45.92]
["RB91-1239-075490","Bottom Up Rail 16’ White",45.92]
["RB91-1239-080490","Bottom Up Rail 16’ Bronze",45.92]
["RB91-1334-015000","Chainhold Cover Comfortex Satin Nickel",1.06]
["RB91-1334-050000","Chainhold Cover Comfortex Black",0.27]
["RB91-1334-075000","Chainhold Cover Comfortex White",0.27]
["RB91-1334-081000","Chainhold Cover Comfortex Antique Bronze",1.06]
["RB91-1334-338000","Chainhold Cover - Comfortex Silver Grey",0]
["RB91-1334-414000","Chainhold Cover Comfortex Vanilla",0.27]
["RB91-1334-473000","Chainhold Cover Comfortex CBG brown",0.27]
["RB91-1336-001000","Chainhold Cover Clear",0.35]
["RB91-1336-050000","Chainhold Cover Black",0.35]
["RB91-1336-075000","Chainhold Cover White",0.35]
["RB91-1336-331000","Chainhold Cover Gray",0.35]
["RB91-1336-338000","Chainhold Cover Silver Grey",0]
["RB91-1336-414000","Chainhold Cover Vanilla",0.35]
["RB91-1337-001000","Chainhold Base Assembly Clear",0.78]
["RB91-1337-050000","Chainhold Base Assembly Black",0.78]
["RB91-1337-075000","Chainhold Base Assembly White",0.78]
["RB91-1337-331000","Chainhold Base Assembly Gray",0.78]
["RB91-1337-338000","Chainhold Base Assembly Silver Grey",0.78]
["RB91-1337-414000","Chainhold Base Assembly Vanilla",0.78]
["RB91-1337-473000","Chainhold Base Assembly CBG brown",0.54]
["RB91-1338-001110","Chainhold Mounting Kit Clear",0.43]
["RB91-1338-001210","Chainhold Floor Fix Bracket + screws Clear",0.52]
["RB91-1338-001310","Chainhold Side Fix Bracket + screws Clear",0.52]
["RB91-1338-001410","Chainhold Wall and Side Mount Bracket Kit",0.94]
["RB91-1338-050210","Chainhold Floor Fix Bracket + screws Black",0.52]
["RB91-1338-075210","Chainhold Floor Fix Bracket + screws White",0.52]
["RB91-1338-331210","Chainhold Floor Fix Bracket + screws Gray",0.52]
["RB91-1340-069003","FD42 Extreme Weight Bar - Wire Guide End Cap-Wht",41.98]
["RB91-1342-027012","Metal Chainhold Square Cover | Chrome",10.82]
["RB91-1342-034012","Metal Chainhold Square Cover | Satin Nickel",10.82]
["RB91-1342-043012","Metal Chainhold Square Cover | Brass",10.82]
["RB91-1342-046001","Plastic Chainhold Square Cover | Heavy Frost",10.82]
["RB91-1342-050012","Metal Chainhold Square Cover | Black",10.82]
["RB91-1342-075012","Metal Chainhold Square Cover | White",10.82]
["RB91-1342-079012","Metal Chainhold Square Cover | Antique Bronze",10.82]
["RB91-1342-091012","Metal Chainhold Square Cover | Gun Metal",10.82]
["RB91-1343-047001","Chainhold Square Inner Cover Kit | Clear + 7% Disp",10.82]
["RB91-1344-046003","TSS Wall & Side Mount Brack Kit | Heavy Frost",1.19]
["RB91-1344-047002","Chainhold Outside Mount Kit | Clear + 7% Disp",10.82]
["RB91-1403-050030","Fashion Wand for 2' Chain Loop Black",20.71]
["RB91-1403-050091","Fashion Wand for 4' Chain Loop Black",22.38]
["RB91-1403-050122","Fashion Wand for 5' Chain Loop Black",24.08]
["RB91-1403-075091","Fashion Wand for 4' Chain Loop White",22.38]
["RB91-1403-089061","Fashion Wand for 3' Chain Loop Bronze",20.71]
["RB91-2131-050002","D30 Medium Bottom Rail End Caps LH & RH set Blk",0.72]
["RB91-2131-069002","D30 Medium Bottom Rail End Caps LH & RH set Wht",0.72]
["RB91-2131-089002","D30 Medium Bottom Rail End Caps LH & RH set Brown",0.32]
["RB91-2131-338002","D30 Medium Bottom Rail End Caps LH & RH set SlvGry",0.72]
["RB91-2131-414002","D30 Medium Bottom Rail End Caps LH & RH set Van.",0.32]
["RB91-2139-050000","Bottom up Rail End Cap, Black",0.51]
["RB91-2139-069000","Bottom up Rail End Cap, White",0.51]
["RB91-2139-338000","Bottom up Rail End Cap, Gray",0.51]
["RB91-2231-050002","D30 Bottom Rail Wire Guide End Caps LH&RH set Blk",1.49]
["RB91-2231-069002","D30 Bottom Rail Wire Guide End Caps LH&RH set Wth",1.49]
["RB91-2231-338002","D30 Bottom Rail Wire Guide End Caps LH&RH set Gray",1.49]
["RB91-2239-050001","Bottom Up Cord Guide Kit",2.48]
["RB91-2439-050001","ESU Skyline Adapter Kit",1.1399999999999999]
["RB91-3120-024000","Base 40/50 Tensioning Wire Stop+Adjstr Ceil. Slvr",3.18]
["RB91-3120-069000","Base 40/50 Tensioning Wire Stop+Adjstr Ceil. Wht",3.18]
["RB91-3121-024000","Base 40/50 Tensioning Wire Stop+Adjstr Wall Slvr",3.18]
["RB91-3121-069000","Base 40/50 Tensioning Wire Stop+Adjstr Wall Wht",3.18]
["RB91-3602-006040","Wire Guide Tensioning Cable 4mm 50m (165 ft) Roll",5.93]
["RB91-3602-006041","Wire Tensioning Guide (7x7) - 4mm w/ PVC Coating",7.46]
["RB91-3602-010012","Wire Guide Tensioning Cable 1.2mm 50m (165ft) Roll",1.97]
["RB91-3602-010032","Wire Tension Guide (1x19) 3.2mm 50m (164ft) Roll",2.76]
["RB91-3611-020010","Crimping Clip for 1.2mm Tensioning Wire",0.54]
["RB91-6260-000490","S60/60STD Al. Tube OD 60mmx4.87m(16Ft) Mill Taped",103.44]
["RB91-6260-000580","S60/60STD Alum. Tube OD 60mmx5.8m (19Ft) Taped",103.44]
["RB91-6280-000490","S60/80HD Al. Tube OD 80mmx4.87m (16Ft) Mill Taped",165.77]
["RB91-7030-393000","D30 Bottom Rail Fabric Feeding Funnel LH & RH set",3.36]
["RB93-0110-000600","S100 Alum. Tube STD 110mm(4.33\") x6m(19.6 ft)-Mill",330.2]
["RB93-0130-000700","S100 Alum. Tube HD 130mm(5.11\") x 7m(23 ft)-Mill",860.65]
["RB93-0160-000700","S100 Alum. Tube XHD 160mm(6.30\") x 7m(23 ft)-Mill",908.4]
["RB93-0443-000490","S45 T-Spline Tube Lgt. OD 43mmx4.87m (16Ft) NoTape",32.83]
["RB93-0444-000490","S45 T-Spline Tube Std. OD 44mmx4.87m (16Ft) NoTape",39.76]
["RB93-0449-000370","S45 T-Spline Tube HD OD 49mmx3.66m (12Ft) NoTape",69.849999999999994]
["RB93-0449-000490","S45 T-Spline Tube HD OD 49mmx4.87m (16Ft) NoTape",69.849999999999994]
["RB93-6443-000490","S45 T-Spline Tube Lgt. OD 43mmx4.87m (16Ft) Taped",34.56]
["RB93-6443-000580","S45 T-Spline Tube Lgt. OD 43mmx5.8m (19Ft) Taped",38.46]
["RB93-6444-000490","S45 T-Spline Tube Std. OD 44mmx4.87m (16Ft) Taped",43.72]
["RB93-6444-000490-MX","S45 T-Spline Tube Std. OD 44mmx4.87m (16Ft) Taped",16.809999999999999]
["RB93-6444-00049C","S45 T-Spline Tube Std. OD 44mmx4.87m (16Ft) Taped",16.809999999999999]
["RB93-6449-000370","S45 T-Spline Tube HD OD 49mmx3.7m (12Ft) Taped",75.94]
["RB93-6449-000370-MX","S45 T-Spline Tube HD OD 49mmx3.7m (12Ft) Taped",75.94]
["RB93-6449-000490","S45 T-Spline Tube HD OD 49mmx4.87m (16Ft) Taped",75.94]
["RC91-0101-000490","Edge Light Block Side Guide 2Pc.Set 16ft(4.87m)Mil",85.8]
["RC91-0101-00049C","Edge Side Guide |2 Piece Set - Mill (Loose)",82.51]
["RC91-0101-020490","Edge Light Block Side Guide 2Pc.Set 16ft(4.87m)Ano",89.23]
["RC91-0101-02049C","Edge Side Guide |2 Piece Set - ANODISED (Loose)",85.8]
["RC91-0101-050490","Edge Light Block Side Guide 2Pc.Set 16ft(4.87m)Blk",89.23]
["RC91-0101-05049C","Edge Side Guide |2 Piece Set - BLACK (Loose)",85.8]
["RC91-0101-069490","Edge Light Block Side Guide 2Pc.Set 16ft(4.87m)Wht",89.23]
["RC91-0101-069490-MX","Edge Light Block Side Guide 2Pc.Set 16ft(4.87m)Wht",89.23]
["RC91-0101-06949C","Edge Side Guide |2 Piece Set - WHITE (Loose)",85.8]
["RC91-0201-050000","Light Blocking Side Guide Side Guide Lock Black",0.22]
["RC91-0302-338000","CF Cassette Side Guide Ear Silver Grey",0.22]
["RC91-1001-050000","Light Blocking Side Guide Bottom Cap+screws Black",1.35]
["RC91-1001-069000","Light Blocking Side Guide Bottom Cap+screws  White",1.35]
["RC91-1001-338000","Light Blocking Side Guide Bottom Cap+screws Grey",1.35]
["RC91-1002-050000","Light Blocking Side Guide Funnel & Screw Set Black",1.35]
["RC91-1002-069000","Light Blocking Side Guide Funnel & Screw Set White",1.35]
["RC91-1002-338000","Light Blocking Side Guide Funnel & Screw Set Gray",1.35]
["RE0100330","Panel Track Fixplate 2 Rails Gray",1.05]
["RE0100410","Panel Track Fixplate 3 Rails White",1.1100000000000001]
["RE0100430","Panel Track Fixplate 3 Rails Gray",1.1100000000000001]
["RE0100530","Panel Track Fixplate 5 Rails Gray",1.31]
["RE0100630","Panel Track Panel Holder Plug Gray",0.44]
["RE01-0101-000580","BOX 120 EXT -Back Extrusion x 5.8m (19ft) Mill",148.53]
["RE01-0101-00058C","BOX 120 EXT - Back Extrusion - Mill (Loose Load)",148.53]
["RE01-0101-050580","BOX 120 EXT-Back Extrusion 5.8m(19ft) Blk",185.65]
["RE01-0101-050580-PF","BOX 120 EXT-Back Extrusion w/P/Film 5.8m(19ft) Blk",185.65]
["RE01-0101-05058C-PF","BOX 120 EXT - Back Extrusion - Blk (Loose Load)",185.65]
["RE01-0101-069580","BOX 120EXT Back Extrusion 5.8m (19ft) Wht",185.65]
["RE01-0101-069580-PF","BOX 120EXT Back Extrusion w/P/Film 5.8m (19ft) Wht",185.65]
["RE01-0101-06958C-PF","BOX 120 EXT - Back Extrusion - Wht (Loose Load)",185.65]
["RE01-0101-080580","BOX 120 EXT-Back Extrusion 5.8m(19ft)Bronze",185.65]
["RE01-0101-080580-PF","BOX120EXT-Back Extrusion w/P/Film 5.8m(19ft)Bronze",185.65]
["RE01-0101-08058C-PF","BOX 120 EXT - Back Extrusion - Bronze (Loose Load)",185.65]
["RE01-0101-352580-PF","BOX120EXTBack Extrusion w/P/Film 5.8m(19ft)WoodGry",185.65]
["RE01-0101-35258C-PF","BOX 120 EXT - Back Extrusion - WoodGry(Loose Load)",185.65]
["RE01-0101-425580-PF","BOX120EXT Back Extrusion w/P/Film 5.8m(19ft)pprbrk",185.65]
["RE01-0101-42558C-PF","BOX 120 EXT - Back Extrusion - Pprbrk (Loose Load)",185.65]
["RE01-0102-000580","BOX 120 EXT -Front Cvr FULL x 5.8m (19ft) Mill",89.51]
["RE01-0102-00058C","BOX 120 EXT - Front Cvr FULL - Mill (Loose Load)",89.51]
["RE01-0102-018580","BOX 120 EXT - Front Cover FULL x 19ft (5.8m) Ano.",120.68]
["RE01-0102-050580","BOX 120EXT Front Cvr 5.8m (19ft) Blk",120.68]
["RE01-0102-050580-PF","BOX 120EXT Front Cvr FULL w/P/Film 5.8m (19ft) Blk",120.68]
["RE01-0102-05058C-PF","BOX 120 EXT - Front Cvr FULL - Blk (Loose Load)",120.68]
["RE01-0102-069580","BOX 120 EXT-Front Cvr FULL 5.8m (19ft)Wht",120.68]
["RE01-0102-069580-PF","BOX 120 EXT-Front Cvr FULL w/P/Filmx5.8m (19ft)Wht",120.68]
["RE01-0102-06958C-PF","BOX 120 EXT - Front Cvr FULL - Wht (Loose Load)",120.68]
["RE01-0102-080580","BOX 120EXTFront Cvr 5.8m(19ft)Bronze",120.68]
["RE01-0102-080580-PF","BOX 120EXTFront Cvr FULL w/P/Filmx5.8m(19ft)Bronze",120.68]
["RE01-0102-08058C-PF","BOX 120 EXT - Front Cvr FULL - Bronze (Loose Load)",120.68]
["RE01-0102-352580-PF","BOX 120EXTFront Cvr FULL w/P/Filmx5.8m(19ft)WdlGry",120.68]
["RE01-0102-35258C-PF","BOX 120 EXT - Front Cvr FULL - WdlGry (Loose Load)",120.68]
["RE01-0102-425580-PF","BOX 120EXTFront Cvr FULL w/P/Filmx5.8m(19ft)Pprbrk",120.68]
["RE01-0102-42558C-PF","BOX 120 EXT - Front Cvr FULL - Pprbrk (Loose Load)",120.68]
["RE01-0103-000580","BOX 120 - Front Cover SEMI x 19ft (5.8m) Mill",74.599999999999994]
["RE01-0103-00058C","BOX 120 - Front Cover SEMI - Mill (Loose Load)",74.599999999999994]
["RE01-0103-018580","BOX 120 - Front Cover SEMI x 19ft (5.8m) Ano.",99.46]
["RE01-0103-050580-PF","BOX 120-Front Cvr SEMI w/P/Filmx5.8m (19 ft)Blk",99.46]
["RE01-0103-05058C-PF","BOX 120 - Front Cvr SEMI - Blk (Loose Load)",99.46]
["RE01-0103-069580-PF","BOX 120-Front Cvr SEMI w/P/Filmx5.8m (19ft)Wht",99.46]
["RE01-0103-06958C-PF","BOX 120 - Front Cvr SEMI - Wht (Loose Load)",99.46]
["RE01-0103-080580-PF","BOX 120-Front Cvr SEMI w/P/Filmx5.8m(19ft)Bronze",99.46]
["RE01-0103-08058C-PF","BOX 120 - Front Cvr SEMI - Bronze (Loose Load)",99.46]
["RE01-0103-352580-PF","BOX 120-Front Cvr SEMI w/P/Filmx5.8m(19ft)WdlGry",99.46]
["RE01-0103-35258C-PF","BOX 120 - Front Cvr SEMI - WdlGry (Loose Load)",99.46]
["RE01-0103-425580-PF","BOX 120-Front Cvr SEMI w/P/Filmx5.8m(19ft)Pprbrk",99.46]
["RE01-0103-42558C-PF","BOX 120 - Front Cvr SEMI - Pprbrk (Loose Load)",99.46]
["RE01-0106-000700","BOX 190 - Univ. Extr. x 22.9ft (7m) Mill",192.89]
["RE01-0106-00070C","BOX 190 - Univ. Extr. - Mill (Loose Load)",192.89]
["RE01-0106-018700","BOX 190 - Univ. Extr. x 22.9ft (7m) Anod.",289.33]
["RE01-0106-050700-PF","BOX 190 - Univ. Extr. w/P/Film x 22.9ft (7m) Blk.",241.11]
["RE01-0106-05070C-PF","BOX 190 - Univ. Extr. - Blk (Loose Load)",241.11]
["RE01-0106-069700-PF","BOX 190 - Univ. Extr. w/P/Film x 22.9ft (7m) Wht.",241.11]
["RE01-0106-06970C-PF","BOX 190 - Univ. Extr. - Wht (Loose Load)",241.11]
["RE01-0107-000700","BOX 190 - Front Cover x 22.9 ft (7m) length Mill",265.22000000000003]
["RE01-0107-00070C","BOX 190 - Front Cover - Mill (Loose Load)",265.22000000000003]
["RE01-0107-018700","BOX 190 - Front Cover x 22.9 ft (7m) length Anod.",385.77]
["RE01-0107-050700-PF","BOX 190 - Front Cover w/P/Film x 22.9ft (7m) Blk.",337.56]
["RE01-0107-05070C-PF","BOX 190 - Front Cover - Blk (Loose Load)",337.56]
["RE01-0107-069700-PF","BOX 190 - Front Cover w/P/Film x 22.9ft (7m) Wht.",337.56]
["RE01-0107-06970C-PF","BOX 190 - Front Cover - Wht (Loose Load)",337.56]
["RE0101130","Panel Track Profile End Cap Gray",0.18]
["RE0101310","Panel Track Slider L White",0.49]
["RE0101330","Panel Track Slider L Gray",0.49]
["RE0101530","Panel Track Slider R Gray",0.49]
["RE0101803","Panel Track Wand 47\" (120cm) Transparent",4.3499999999999996]
["RE0101930","Panel Track Wand Clip for Slider Gray",1]
["RE01-0203-050063","Bearing Idler | 63mm",16.8]
["RE01-0204-050000","Idler/Spring Adaptor + Screws",3.36]
["RE01-0212-050063","Idler Housing & Pin Kit | 63mm",8.9499999999999993]
["RE01-0214-050000","External - Idler/Spring Adaptor Kit MKII",3.4]
["RE01-0363-000580","63mm STD Alum. Tube - 65mm OD x 19ft (5.8m) Mill",99.46]
["RE01-0378-000580","78mm STD Alum. Tube - 80mm OD x 19ft (5.8m) mill",124.66]
["RE01-0378-00058C","78mm STD Alu Tube - 80mm O.D.-loose",0]
["RE01-0379-000700","78mm HD Alum. Tube - 81.6mm O.D x 22.9ft (7.0m)",158.41]
["RE01-0402-009000","External Booster Bracket Adapter - Univ. SS 316,",3.36]
["RE01-0402-025902","R-Clip for Wire Guide Silver ZINC Plated",1.1000000000000001]
["RE01-0403-013000","External Booster Spacer + Fixing screws",7.55]
["RE01-0405-050078","78mm Booster Tail Adaptor",1.68]
["RE01-0411-050011","External Booster Short LH | 63mm",32.47]
["RE01-0411-050031","External Booster Light LH | 63mm",33.58]
["RE01-0411-050051","External Booster Standard  LH | 63mm",36.659999999999997]
["RE01-0411-050061","External Booster Heavy Duty  LH | 63mm",39.64]
["RE01-0411-050071","External Booster Extra Heavy Duty  LH | 63mm",42.32]
["RE01-0411-050101","External Booster COMPACT LH | 63mm",32.47]
["RE01-0501-050063","Crank Housing 13mm square shaft | 63mm tube",6.99]
["RE01-0501-050078","Crank Housing 13mm square shaft | 78mm tube",6.99]
["RE01-0513-000002","Gear Ratio 5:1 (7.5Nm)+Fix Screws Univ Joint Mill",39.18]
["RE01-0513-050002","Gear Ratio 5:1 (7.5Nm)+Fix Screws Univ Joint Blk",39.18]
["RE01-0513-069002","Gear Ratio 5:1 (7.5Nm)+Screws- Universal Joint Wh",39.18]
["RE01-0517-000002","Gear - Ratio 8:1 (20Nm)+Screws - Univ. Joint Mill",73.010000000000005]
["RE01-0517-050002","Gear - Ratio 8:1 (20Nm)+Screws - Univ. Joint Black",73.010000000000005]
["RE01-0518-069013","Crank Gear - Ratio 8:1 (20Nm)+Packer & Screws",83.96]
["RE01-0601-025000","AUTOMATE VEUE 45mm Motor Bracket Adapter + screws",4.2]
["RE01-0602-006040","M50 Round Head Motor Adapter Set + screws",24.97]
["RE01-0602-025000","SOMFY Round Head Adaptor Set + screws",28.96]
["RE01-0603-025000","AUTOMATE VEUE 45mm SLIM Motor 10mm Sq. Shaft",3.13]
["RE01-0604-025000","SOMFY Round Head Adaptor Set + screws",23.22]
["RE01-0662-050508","Crown Wheel (offset) – 63mm Steel Tube",2.02]
["RE01-0663-050003","SOMFY Drive Wheel - 63mm Tube",8.77]
["RE01-0663-050502","XXXDrive Wheel | 63 Steel Tube - AutomateXXX",4.0199999999999996]
["RE01-0663-050508","Crown Wheel - 63mm Alum. Tube",2.02]
["RE01-0663-050518","AUTOMATE | Crown Wheel – 63mm Universal",1.94]
["RE01-0664-050003","SOMFY Crown Wheel - 63mm Tube",8.7799999999999994]
["RE01-0664-050508","AUTOMATE | 63mm Drive Wheel | STD Motor",7.61]
["RE01-0665-050518","Drive Wheel Set | Impact Detect |2.5\"&3.5\"tube",6.14]
["RE01-0666-050508","Drive Wheel (FT Impact Detect) - 63mm Alum Tube",7.61]
["RE01-0666-050518","AUTOMATE | 63mm Drive Wheel | Impact Detect",8.83]
["RE01-0678-050003","SOMFY Drive Wheel - 78mm Tube",9.09]
["RE01-0678-050508","Crown Wheel - 78mm Steel & Alum. Tube",2.02]
["RE01-0679-050508","AUTOMATE | 78mm Drive Wheel | STD Motor",7.61]
["RE01-0680-050508","AUTOMATE|78mm Drive Wheel |No Impact Detect Insert",7.61]
["RE01-0680-050518","AUTOMATE | 78mm Drive Wheel | Impact Detect",8.83]
["RE01-0701-050078","78mm Tube Adaptor",1.68]
["RE01-1101-000120","BOX 120 End Plate Set + Screws, Mill",28.93]
["RE01-1101-050120","BOX 120 End Plate Set + Screws, Blk",31.64]
["RE01-1101-069120","BOX 120 End Plate Set + Screws, Wht",31.64]
["RE01-1101-080120","BOX 120 End Plate Set + Screws Bronze",31.64]
["RE01-1101-338120","BOX 120 End Plate Set + Screws, Gray",31.64]
["RE01-1101-352120","BOX 120 End Plate Set + Screws, Wood. Gray",31.64]
["RE01-1101-425120","BOX 120 End Plate Set + Screws, Paperbark",31.64]
["RE01-1104-000400","BOX 190 - Univ. Bracket Extrusion x 13ft (4m) Mill",337.56]
["RE01-1105-000000","BOX 190 - Two-side End plate Set + Screws Mill",264.19]
["RE01-1105-000001","BOX 190 - End Plates & Screws Only Mill",217]
["RE01-1105-018000","BOX 190 - Two-side End plate Set + Screws Anod.",347.03]
["RE01-1105-018001","BOX 190 - End Plates & Screws Only Anod",306.20999999999998]
["RE01-1105-020100","BOX 190 - Univ. Bracket Extrusion x4\" (100mm) Anod",31.34]
["RE01-1105-050000","BOX 190 - Two-side End plate Set + Screws Blk.",264.19]
["RE01-1105-050001","BOX 190 - End Plates & Screws Only Blk",223.72]
["RE01-1105-069000","BOX 190 - Two-side End plate Set + Screws Wht.",264.19]
["RE01-1105-069001","BOX 190 - End Plates & Screws Only Wht",223.72]
["RE01-3001-012067","Open Roll Bkts - SS 304 Satin",43.45]
["RE01-3002-025067","Open Roll M/S Brackets, Zinc",16.93]
["RE01-3002-050067","Open Roll M/S Brackets, Blk",16.93]
["RE01-3002-069067","Open Roll M/S Brackets, Wht",16.93]
["RE01-3002-080067","Open Roll M/S Brackets, Bronze",16.93]
["RE01-3002-352067","Open Roll M/S Brackets, Woodland Grey",16.93]
["RE01-3002-425067","Open Roll M/S Brackets, Paperbark",16.93]
["RE01-3003-050000","Open Bracket Covers + Screws Blk",8.1199999999999992]
["RE01-3003-069000","Open Bracket Covers + Screws Wht",8.1199999999999992]
["RE01-3003-080000","Open Bracket Covers + Screws Bronze",8.1199999999999992]
["RE01-3003-344000","Open Bracket Covers + Screws",8.1199999999999992]
["RE01-3003-352000","Open Bracket Covers + Screws Woodland Grey",8.1199999999999992]
["RE01-3003-425000","Open Bracket Covers + Screws Paperbark",8.1199999999999992]
["RE01-3012-033000","Zipscreen Open Bracket Template",14.11]
["RE01-3020-025000","Open Blind External Brackets | Zinc",16.93]
["RE01-3020-050000","Open Blind External Brackets | Black",16.93]
["RE01-3020-069000","Open Blind External Brackets | White",16.93]
["RE01-3020-080000","Open Blind External Brackets | Bronze",16.93]
["RE01-3020-352000","Open Blind External Brackets | Woodland Grey",16.93]
["RE01-3020-425000","Open Blind External Brackets | Paperbark",16.93]
["RE01-3021-012000","Open Blind External Brackets - S/S 304 | Natural",43.45]
["RE01-3030-025000","External Open Brackets |SQUARE - Zinc Plated",18.350000000000001]
["RE01-3030-050000","External Open Brackets |SQUARE - Black",18.350000000000001]
["RE01-3030-069000","External Open Brackets |SQUARE - Pure White",18.350000000000001]
["RE01-3030-080000","External Open Brackets |SQUARE - Bronze",18.350000000000001]
["RE01-3030-352000","External Open Brackets |SQUARE - Woodland Grey",18.350000000000001]
["RE01-3030-425000","External Open Brackets |SQUARE - Paperbark",18.350000000000001]
["RE01-3031-012000","External Open Brackets | SQUARE | SS304 Satin",44.39]
["RE15-0101-000580","F56 Weight Bar - 56mm x 5.8m (19ft) Mill",94.49]
["RE15-0101-00058C","F56 Weight Bar - Mill (Loose Load)",129.30000000000001]
["RE15-0101-050580-PF","F56 Weight Bar w/P/Film-56mm x 5.8m (19 ft)Blk",129.30000000000001]
["RE15-0101-05058C-PF","F56 Weight Bar - Blk (Loose Load)",129.30000000000001]
["RE15-0101-069580-PF","F56 Weight Bar w/P/Film 56mm x 5.8m (19ft) Wht",129.30000000000001]
["RE15-0101-06958C-PF","F56 Weight Bar - Wht (Loose Load)",129.30000000000001]
["RE15-0101-080580-PF","F56 Weight Bar w/P/Film 56mm x 5.8m (19ft)Bronze",129.30000000000001]
["RE15-0101-08058C-PF","F56 Weight Bar - Bronze (Loose Load)",129.30000000000001]
["RE15-0101-352580-PF","F56 Weight Bar w/P/Film 56mm x5.8m (19ft)WdlGry",129.30000000000001]
["RE15-0101-35258C-PF","F56 Weight Bar - WoodGry (Loose Load)",129.30000000000001]
["RE15-0101-425580-PF","F56 Weight Bar w/P/Film 56mm x5.8m (19ft)Pprbrk",129.30000000000001]
["RE15-0101-42558C-PF","F56 Weight Bar - PprBrk (Loose Load)",129.30000000000001]
["RE15-0111-050700-PF","F72 HD External Weight Bar-72mmx31mm Blk",283.3]
["RE15-0111-069700-PF","F72 HD External Weight Bar-72mmx31mm Wht",283.3]
["RE15-0112-000520","F72 HD Ext Weight Bar - 72x31mm x 17ft/5.2m",209.4]
["RE15-0112-000700","F72 HD Ext. Weight Bar -72x31mm 22.9ft (7m) Mill",224.92]
["RE15-0112-00070C","F72 HD Ext. Weight Bar - Mill (Loose Load)",283.3]
["RE15-0112-050700","F72 HD Ext. Weight Bar -72x31mm 22.9ft (7m) Blk",283.05]
["RE15-0112-050700-PF","F72 HD Ext. Weight Bar -72x31mm 22.9ft (7m) Blk",283.05]
["RE15-0112-05070C-PF","F72 HD Ext. Weight Bar - Blk (Loose Load)",283.3]
["RE15-0112-069700","F72 HD Ext. Weight Bar-72x31mm 22.9ft(7m)Wht No PF",283.05]
["RE15-0112-069700-PF","F72 HD Ext. Weight Bar -72x31mm 22.9ft (7m) Wht",283.05]
["RE15-0112-06970C-PF","F72 HD Ext. Weight Bar - Wht (Loose Load)",283.3]
["RE15-0112-080700-PF","F72 HD Ext. Weight Bar -72x31mm 22.9ft (7m) Bronze",283.05]
["RE15-0112-08070C-PF","F72 HD Ext. Weight Bar - Bronze (Loose Load)",283.3]
["RE15-0112-352700-PF","F72 HD Ext. Weight Bar -72x31mm 22.9ft (7m) WdGray",283.05]
["RE15-0112-35270C-PF","F72 HD Ext. Weight Bar - WoodGry (Loose Load)",283.3]
["RE15-0112-425700-PF","F72 HD Ext. Weight Bar -72x31mm 22.9ft (7m) Pprbrk",283.05]
["RE15-0112-42570C-PF","F72 HD Ext. Weight Bar - PprBrk (Loose Load)",283.3]
["RE15-0401-050001","Zipscreen Ultra Lock Set",20.99]
["RE15-0411-016000","Wire Guide Ultra Lock Set",20.99]
["RE15-0422-050001","Zipscreen Ultra-lock V2 (pin & latch)",31.25]
["RE15-0501-050000","F56 Weight Bar Plain End Cap Set + Screws Blk",2.1]
["RE15-0511-050000","F72 Weight Bar End Cap Set+Screw Blk",13.43]
["RE15-0511-069000","F72 Weight Bar End Cap Set+Screw Wht",13.43]
["RE15-0512-050000","F72 Multi-Bar End Cap | Zip Blk",10.28]
["RE15-0512-069000","F72 Multi-Bar End Cap | Zip White",10.28]
["RE15-0522-050000","F72 Multi-Bar End Caps | Wire Guide + screws",30.17]
["RE15-0522-069000","F72 Multi-Bar End Caps | Wire Guide + screws",30.17]
["RE15-0532-060000","F72 Multi-Bar | Cord Guide Set",9.0299999999999994]
["RE15-0540-050000","F72 Plain End Cap Set + Screws",4.99]
["RE15-0601-050001","F56 Wire Guide End Cap Set + screws Blk",3.79]
["RE15-0601-069001","F56 Wire Guide End Cap Set + screws Wht",3.79]
["RE15-0601-295001","F56 Wire Guide End Cap Set + screws Cream",3.79]
["RE15-0601-425001","F56 Wire Guide End Cap Set + screws Paperbark",3.79]
["RE15-0611-050001","F56 Skylight Wire Guide End Cap LH & RH + Screws",5.88]
["RE15-0611-069001","F56 Skylight Wire Guide End Cap LH & RH + Screws",5.88]
["RE20-0301-050078","ZIP Tube Reducer - 63/78",3.36]
["RE20-0302-050001","F56 Weight Bar Zip End Cap Set + Screws Blk",2.94]
["RE20-0302-069001","F56 Weight Bar Zip End Cap Set + Screws Wht",2.94]
["RE20-0302-080001","F56 Weight Bar Zip End Cap Set + Screws Bronze",2.94]
["RE20-0302-425001","F56 Weight Bar Zip End Cap Set + Screws Paperbark",2.94]
["RE20-0303-050002","F56 | Zipscreen - Lock End Cap Set (2 piece) Blk",3.1]
["RE20-0303-069002","F56 | Zipscreen - Lock End Cap Set (2 piece) White",3.1]
["RE24-1101-009000","Angle Bracket attachment  for Wire Guide - S/S",10.87]
["RE24-1101-025000","Angle Bracket attachment for Wire Guide Zinc",9.36]
["RE24-1304-009000","Swageless Top/Bottom Fork Terminal + screws SS 316",7.86]
["RE24-1305-009000","Swageless 3-Claw Bottom Fork Terminal SS 316",8.9]
["RE24-1306-009032","Swageless Top Fix Terminal-3.2mm Wire 316SS",43.66]
["RE24-1312-009001","Swaged RH Stud Terminal ONLY + Fixing Nuts & Wshrs",4.7699999999999996]
["RE24-1312-009002","Dome Head Terminal for 3.2mm Wire SS 316",3.95]
["RE24-1312-009300","Swaged RH Stud Terminal + 3.0 meter Wire SS 316",27.04]
["RE24-1312-009420","Swaged Dome Terminal + 4.2m Wire Cable SS 316",20.99]
["RE24-1314-009300","Swage Fork Terminal with 3m Wire",16.489999999999998]
["RE24-1314-009400","Swage Fork Terminal-4mm steel Wire-316SS, Polished",82.84]
["RE24-1316-006032","3.2mm Wire Crimp",0.85]
["RE24-1401-009040","Threaded Stud Terminal+Nut&Washer-4mm Wire 316SS",26.86]
["RE24-1401-009901","Threaded Stud Terminal - 4mm S/Steel Wire",0]
["RE24-1501-009000","Turnbuckle Set, M5",11.38]
["RE24-1601-010030","Hex Head Hollow Bolt + Nut - 30mm",2.02]
["RE24-2201-009000","Wall Mounting 'L' Bracket - 40mm x 30mm SS 316",11.24]
["RE24-2201-025000","Wall Mounting 'L' Bracket - 40mm x 30mm Zinc",9.6]
["RE24-2202-010076","Wall Mounting 'L' Bracket - 76mm x 65mm SS 316",73.010000000000005]
["RE24-2205-009000","Bottom Wire Guide Swivel Bkt - Floor/Wall Mount",28.56]
["RE24-2301-009090","Wall Mounting 'L' Bkt-LH&RH Set 90x38mm-316SS",204.54]
["RE24-2601-009040","Tensioning Bkt&Flat Head Stud Terminal 4mm SS Wire",78.349999999999994]
["RE24-2601-009901","Tensioning Bracket for Steel Cable – 4mm S/S Wire",37.53]
["RE24-2601-009902","Flat Head Stud Terminal – 4mm S/Steel Wire",17.78]
["RE24-3001-009000","Round Eye Plate (Bottom Mount) - 5mm",1.32]
["RE24-3301-009000","Box Eyelet - 3.2mm wire with fastening screw",5.9]
["RE24-3401-009004","Adjustable Stop - 3/4mm Wire",5.61]
["RE24-4001-009032","Wire Cable - Top Support",9.24]
["RE24-4002-010032","Wire Cable - Top Bracket + Screw",3.79]
["RE24-4003-013032","Tensioning L-Bracket for 3.2mm wire",5.09]
["RE24-4004-010032","Wire Guide Top Saddle Terminal Kit w/ Spring",4.53]
["RE24-9101-009050","Spring Compression 14.5 IDx50mm Long-SS",5.03]
["RE24-9201-009020","Wire Tensioning Spring - 20mm SS 316,",0.75]
["RE29-0102-050500","Pivot Arm Terminal Bar - 16.4ft (5.0m) Blk",245.34]
["RE29-0102-069500","Pivot Arm Terminal Bar - 16.4ft (5.0m) Wht",245.34]
["RE91-0100-025025","25mm Cam Buckle & Strap Assembly",7.95]
["RE91-0101-000580","Channel Guide Sys. Side Guide - 19ft (5.8m) Mill",115.37]
["RE91-0101-00058C","Channel Guide Sys. Side Guide-Mill (Loose Load)",115.37]
["RE91-0101-018580","Channel Guide Sys. Side Guide - 19ft (5.8m) Ano.",124.32]
["RE91-0101-050580","Channel Guide Sys. Side Guide - 19ft (5.8m) Blk",124.32]
["RE91-0101-05058C","Channel Guide Sys. Side Guide-Blk (Loose Load)",124.32]
["RE91-0101-069580","Channel Guide Sys. Side Guide - 19ft (5.8m) Wht",124.32]
["RE91-0101-06958C","Channel Guide Sys. Side Guide-Wht (Loose Load)",124.32]
["RE91-0101-080580","Channel Guide Sys. Side Guide - 19ft (5.8m) Bronze",124.32]
["RE91-0101-08058C","Channel Guide Sys. Side Guide-Bronze (Loose Load)",124.32]
["RE91-0101-352580","Channel Guide Sys. Side Guide - 19ft (5.8m) W.Gry",124.32]
["RE91-0101-35258C","Channel Guide Sys. Side Guide-WoodGry (Loose Load)",124.32]
["RE91-0101-425580","Channel Guide Sys. Side Guide - 19ft (5.8m) Pprbrk",124.32]
["RE91-0101-42558C","Channel Guide Sys. Side Guide-PprBrk (Loose Load)",124.32]
["RE91-1001-050000","Channel Guide Funnel & Bottom Cap Set + Screws",2.52]
["RE91-1101-013025","25mm Footmans Loop - SS 304",2.1800000000000002]
["RE91-1102-050025","25mm Strap Down Loop Black",1.68]
["RE91-1103-009050","Strap Down Spring Clip - 50mm SS 316",2.1800000000000002]
["RE91-1104-013030","Strap Down Pad Eye Saddle – 30mm SS 304",2.85]
["RE91-1111-013025","25mm Footmans Loop Kit | F72",11.55]
["RE91-2001-050000","Channel Guide Weight Bar End Cap Set + Screws Blk",3.69]
["SB03-1301-006190","Zipscreen Extreme Adptr Bkt Kit - Univ. 316SS Nat",275.06]
["SB03-1301-009190","Zipscreen Extreme Adptr Bkt Kit - Univ. 316SS Pol",275.06]
["SB04-0701-000550","ZIPSCREEN - Zip Inner Rail x 5.5m (18ft.) Mill",38.799999999999997]
["SB04-0701-00055C","ZIPSCREEN - Zip Inner Rail - Mill (Loose Load)",38.799999999999997]
["SB04-0701-050490","ZIPSCREEN - Zip Inner Rail x 4.9m (16ft) Blk",43.56]
["SB04-0701-050550","ZIPSCREEN - Zip Inner Rail x 5.5m (18ft) Blk",50.74]
["SB04-0701-05055C","ZIPSCREEN - Zip Inner Rail - Blk (Loose Load)",50.74]
["SB04-0701-069550","ZIPSCREEN - Zip Inner Rail x 5.5m (18ft) Wht",50.74]
["SB04-0701-06955C","ZIPSCREEN - Zip Inner Rail - Wht (Loose Load)",50.74]
["SB04-0701-080550","ZIPSCREEN - Zip Inner Rail x 5.5m (18ft) Bronze",50.74]
["SB04-0701-08055C","ZIPSCREEN - Zip Inner Rail - Bronze (Loose Load)",50.74]
["SB04-0701-352550","ZIPSCREEN - Zip Inner Rail x 5.5m (18ft) WoodGray",50.74]
["SB04-0701-35255C","ZIPSCREEN - Zip Inner Rail - WoodGry (Loose Load)",50.74]
["SB04-0701-425550","ZIPSCREEN - Zip Inner Rail x 5.5m (18ft) Paperbark",50.74]
["SB04-0701-42555C","ZIPSCREEN - Zip Inner Rail - PprBrk (Loose Load)",50.74]
["SB04-0702-000550","ZIPSCREEN -U Mounting Rail x 5.5m (18ft.) Mill",42.08]
["SB04-0702-00055C","ZIPSCREEN - U Mounting Rail - Mill (Loose Load)",42.08]
["SB04-0702-050550","ZIPSCREEN -U Mounting Rail x 5.5m (18ft) Blk",53.7]
["SB04-0702-05055C","ZIPSCREEN - U Mounting Rail - Blk (Loose Load)",53.7]
["SB04-0702-069550","ZIPSCREEN -U Mounting Rail x 5.5m (18ft) Wht",53.7]
["SB04-0702-06955C","ZIPSCREEN - U Mounting Rail - Wht (Loose Load)",53.7]
["SB04-0702-080550","ZIPSCREEN -U Mounting Rail x 5.5m (18ft) Bronze",53.7]
["SB04-0702-08055C","ZIPSCREEN - U Mounting Rail - Bronze (Loose Load)",53.7]
["SB04-0702-352550","ZIPSCREEN -U Mounting Rail x 5.5m (18ft) WoodGray",53.7]
["SB04-0702-35255C","ZIPSCREEN - U Mounting Rail - WoodGry (Loose Load)",53.7]
["SB04-0702-425550","ZIPSCREEN -U Mounting Rail x 5.5m (18ft) Paperbark",53.7]
["SB04-0702-42555C","ZIPSCREEN - U Mounting Rail - PprBrk (Loose Load)",53.7]
["SB04-0703-000250","ZIPSCREEN -L Fixing Rail x 2.5m (8.2ft.) Mill",17.899999999999999]
["SB04-0703-000550","ZIPSCREEN -L Fixing Rail x 5.5m (18ft.) Mill",33.229999999999997]
["SB04-0703-00055C","ZIPSCREEN - L Fixing Rail - Mill (Loose Load)",33.229999999999997]
["SB04-0703-050550","ZIPSCREEN -L Fixing Rail x 5.5m (18ft) Blk",39.89]
["SB04-0703-05055C","ZIPSCREEN - L Fixing Rail - Blk (Loose Load)",39.89]
["SB04-0703-069550","ZIPSCREEN -L Fixing Rail x 5.5m (18ft) Wht",39.89]
["SB04-0703-06955C","ZIPSCREEN - L Fixing Rail - Wht (Loose Load)",39.89]
["SB04-0703-080550","ZIPSCREEN -L Fixing Rail x 5.5m (18ft) Bronze",39.89]
["SB04-0703-08055C","ZIPSCREEN - L Fixing Rail - Bronze (Loose Load)",39.89]
["SB04-0703-352550","ZIPSCREEN -L Fixing Rail x 5.5m (18ft) WoodGray",39.89]
["SB04-0703-35255C","ZIPSCREEN - L Fixing Rail - WoodGry (Loose Load)",39.89]
["SB04-0703-425550","ZIPSCREEN -L Fixing Rail x 5.5m (18ft) Paperbark",39.89]
["SB04-0703-42555C","ZIPSCREEN - L Fixing Rail - PprBrk (Loose Load)",39.89]
["SB04-0704-000550","Fixing Rail - 40 x 40 x 3mm - 5.5m (18ft.) Mill",80.89]
["SB04-0704-050550","Fixing Rail - 40 x 40 x 3mm - 5.5m (18ft.) Blk",87.12]
["SB04-0704-069550","Fixing Rail - 40 x 40 x 3mm - 5.5m (18ft.) Wht",87.12]
["SB04-0705-000550","ZIPSCREEN - WM U-Rail x 5.5m (18ft.) Mill",46.45]
["SB04-1501-000420","z-LOCK Std Side Guide - 33x48mm x 14ft/4.2m",0]
["SB05-0330-050500","z-LOCK Inner Rail [RPVC] + LEGS - 29x17mm | 5.0 Lm",0]
["SB05-1411-050001","ZIPSCREEN-Inner Rail Funnel&StopSet+screw",3.44]
["SB05-1511-050001","ZIPSCREEN-Inner Rail Bottom Cap Set+screw B",2.46]
["SB05-1611-050001","Skylight Zipscreen Inner Rail End Cap + Screw",3.44]
["SB06-0201-020580","F4115 Flat Heavy Duty Weight Bar (19ft) Anodized",48.37]
["SB06-0201-050580","F4115 Flat Heavy Duty Weight Bar (19ft) Black",54.78]
["SB06-0201-069580","F4115 Flat Heavy Duty Weight Bar (19ft) White",54.78]
["SB06-0201-269580","F4115 Flat Heavy Duty Weight Bar (19ft) Sandstone",54.78]
["SB06-0210-050000","F4115 Flat Weight Bar, End Cap, Black",0.28000000000000003]
["SB06-0210-050003","F4115 Wire Guide End Cap, Black",0.7]
["SB06-0210-069000","F4115 Flat Weight Bar, End Cap, White",0.28000000000000003]
["SB06-0210-069003","F4115 Wire Guide End Cap, White",0.7]
["SB06-0210-269000","F4115 Flat Weight Bar, End Cap, Sandstone",0.28000000000000003]
["SB06-0210-269003","F4115 Wire Guide End Cap, Sandstone",0.7]
["SB06-0210-338000","F4115 Flat Weight Bar, End Cap, Silver Gray",0.28000000000000003]
["SB06-0210-338003","F4115 Wire Guide End Cap, Silver Gray",0.7]
["SB06-1303-000580","HD HEM Bar 2pc set ∙ 70 x 33mm x 5.8m (19ft) Mill",199.92]
["SB06-1303-018580","HD HEM Bar 2pc set ∙ 70 x 33mm x 5.8m (19ft) Anod.",238.69]
["SB06-1303-050580","HD HEM Bar 2pc set ∙ 70 x 33mm x 5.8m (19ft) Blk",254.62]
["SB06-1303-069580","HD HEM Bar 2pc set ∙ 70 x 33mm x 5.8m (19ft) Wht",254.62]
["SB06-1303-080580","HD HEM Bar 2pc set 70 x 33mm x 5.8m (19ft)Bronze",254.62]
["SB06-1303-352580","HD HEM Bar 2pc set ∙ 70x33mm x5.8m (19ft) WoodGray",254.62]
["SB06-1304-000600","FD42 Extreme Weight Bar 6m (19.6 ft.) Mill",98.13]
["SB06-1304-017600","FD42 Extreme Weight Bar 6m (19.6 ft.) Anodized",111.4]
["SB06-1304-050600","FD42 Extreme Weight Bar 6m (19.6 ft.) Black",118.03]
["SB06-1304-066600","FD42 Extreme Weight Bar 6m (19.6 ft.) Off White",118.03]
["SB06-1305-00049C","Slat Hem Bar 16’ Mill (Loose Box)",0]
["SB06-1310-050000","Z-LOCK FZ47 Bottom Rail End Cap & screws | LH & RH",2.46]
["SB06-1321-050580","Weight Bar Cover/13x3mmx5.8m(19ft)[W9/Hem Bar] Blk",9.64]
["SB06-1330-050001","HD Hem Bar-End Cap&screw-Blk",19.309999999999999]
["SB06-1330-069001","HD Hem Bar - End Cap & Screws Wht",19.309999999999999]
["SB06-1332-060020","HD Hem Bar-Wire Guide Al203 Ceramic Block-NatWht",21.27]
["SB07-1412-050001","F52 Wire Guide End Cap+screw Blk",8.9499999999999993]
["SB07-2103-050001","External Weight Bar Lock Set+screw Blk",9.1199999999999992]
["SB07-2201-022001","F56 Extern Weight Bar Pull Handle+screw, Brsh Slvr",5.6]
["SB91-0001-050580","Weight Bar Bubble Seal Strip-8x12mm 20ft. (5.8m)",19.57]
["SB91-0004-050075","Ultra Lock Seal - 75m (246ft) rolls",138.54]
["SB91-0005-001100","Bubble Seal Small 5mm x 100 meter (328 ft) Roll",0.28000000000000003]
["SB91-0007-001100","Bottom Up Rail Seal, 109yd Roll",68.33]
["SB91-0008-050050","Ultra-Lock Seal V3 – 164ft (50m) roll",2.68]
["SB91-0011-050500","Fabric Brush T Slot 5mm H x 4.8mm W - 546 yd. Roll",0.87]
["SB91-0012-050300","Fabric Brush T Slot 10mm H x 4.8mm W - 328yd roll",2.35]
["SB91-0201-050100","PVC D Section Edge Strip - Radius 2.6mm 500m Roll",0.42]
["SB91-0301-050025","F52 Weight Bar Skirt-25mm tail/100Lm (328 ft) Roll",185.56]
["SB91-0408-001015","7.2mm spline with 15mm tail 100m (328 ft) Roll Clr",89.84]
["SB91-0409-050015","7mm Fabric Spline w/ 15mm Tail (100m rolls)",378.56]
["SB91-0516-050009","Foam Tape 1.6mm x 9.0mm | 45m (147.6ft) roll",0.73]
["SB91-1005-033300","Ballast 20x5mm Galv. Flat Bar x 3m (9.8 ft)",21.84]
["SB91-1008-033300","Ballast 25x8mm Galv. Flat Bar x 3m (9.8 ft)",41.96]
["SB91-1015-050200","20 x 5mm Ballast x 2m (0.8kg/m) | Wrapped",17.989999999999998]
["SB91-1018-050200","25 x 8mm Ballast x 2m (1.6kg/m) | Wrapped",28.76]
["SH91-0115-050400","ZIP/No.5 GAUGE-Dble Sided 400mt roll Blk",7.73]
["SH91-0135-050200","ZIP/No.6 GAUGE-Dble Sided 200mt (218 yd.) roll Blk",8.35]
["SH91-0135-420200","ZIP/No.6 GAUGE-Dble Sided 50mt (54 yd.) roll Beige",8.4]
["SS91-5237-050500","RIBBED Round Spline | 3.7mm x 500mt Roll",0.24]
["SS91-5241-050500","RIBBED Round Spline | 4.1mm x 500mt Roll",0.24]
["SS91-5246-050300","RIBBED Round Spline | 4.6mm x 300mt Roll",0.24]
["SS91-5246-050500","RIBBED Round Spline|4.6mmx500mt(3/16\"x546 yd) Roll",0.24]
["RS01-0107-050050","Easy Spring Air Adapter kit, 2\" - BLK"]
["RS01-0107-069050","Easy Spring Air Adapter kit, 2\" - WHT"]
[]
[null," "]

{"sheet":"ToDo","index":14,"n_rows":53,"n_cols":19,"rows_kept":53,"cut":false,"hidden":true,"merged":[]}
[]
[]
[null,null,"ToDo",null,null,null,null,null,null,null,null,null,null,null,null,null,null,"later later"]
[null,"NOW",null,null,null,null,null,null,null,null,null,null,null,null,null,null,null,null,"Calculator"]
[null,null,null,null,null,null,null,null,null,null,null,null,null,null,null,null,null,null,"QTY breakdown and pro-rata'd recommendations for 100 shades. "]
[]
[]
[]
[]
[]
[]
[null,"LATER"]
[]
[]
[]
[]
[]
[]
[]
[]
[]
[]
[]
[]
[]
[]
[]
[]
[]
[]
[]
[]
[]
[]
[]
[]
[]
[]
[]
[]
[]
[]
[]
[null,null,"AU","=IFERROR(INDEX('AU NAV Data Externals.xlsx'!Table1[Unit Price],MATCH([@[No.]],'AU NAV Data Externals.xlsx'!Table1[No.],0)),\"\")"]
[null,null,"US","=IFERROR(INDEX('US NAV Data Externals.xlsx'!Table1[Unit Price],MATCH([@[No.]],'US NAV Data Externals.xlsx'!Table1[No.],0)),\"\")"]
[]
[]
[null,null,null,"=IFERROR(INDEX('AU NAV Data Externals.xlsx'!Table1[Description],MATCH([@[No.]],'AU NAV Data Externals.xlsx'!Table1[No.],0)),\"\")"]
[null,null,null,"=IFERROR(INDEX('AU NAV Data Externals.xlsx'!Table1[Colour Code],MATCH([@[No.]],'AU NAV Data Externals.xlsx'!Table1[No.],0)),\"\")"]
[null,null,null,"=IFERROR(INDEX('AU NAV Data Externals.xlsx'!Table1[Colour Description],MATCH([@[No.]],'AU NAV Data Externals.xlsx'!Table1[No.],0)),\"\")"]
[null,null,null,"=IFERROR(INDEX('AU NAV Data Externals.xlsx'!Table1[Base Unit of Measure],MATCH([@[No.]],'AU NAV Data Externals.xlsx'!Table1[No.],0)),\"\")"]
[null,null,null,"=IFERROR(INDEX('AU NAV Data Externals.xlsx'!Table1[Qty. per Inner],MATCH([@[No.]],'AU NAV Data Externals.xlsx'!Table1[No.],0)),\"\")"]
[null,null,null,"=IFERROR(INDEX('AU NAV Data Externals.xlsx'!Table1[Qty. per Outer],MATCH([@[No.]],'AU NAV Data Externals.xlsx'!Table1[No.],0)),\"\")"]

{"sheet":"ChangeLog","index":15,"n_rows":7,"n_cols":3,"rows_kept":7,"cut":false,"hidden":true,"merged":[]}
[]
[]
[]
[null,"xxx"]
[null,0.04,"Added 2\" components"]
[null,null,"Formatting & Headings"]
[null,null,"Changed Spring names from \"Balanced\" to \"Easy Spring Air - …\""]