{"text_format":"1","workbook":"xlsx","n_sheets":9,"sheets":["0. Intro","Inputs","BoM","Ctrl_Selections","Ctrl_Lists","Ctrl_Deductions","Ctrl_Recommendations","Item List","Sheet1"],"not_rendered":{"charts":0,"images":4,"macros":1,"external_links":0,"defined_names":134,"comments":4,"pivot_tables":0},"unopened":[],"bounds":{"document_bytes":16777216,"sheet_cells":100000,"rows_first":2000,"rows_last":500,"rows_between":2000,"halvings":0,"cell_chars":16384,"cell_head_chars":4096},"cells_cut":0,"cells_raw":0,"read":"whole","date_system":"1900"}

{"sheet":"0. Intro","index":0,"n_rows":27,"n_cols":5,"rows_kept":27,"cut":false,"hidden":false,"merged":[[3,1,5,16]]}
[]
[null,"If you are seeing this page, it means Excel Macro's have not been enabled. "]
[]
[null,"Excel Macros provide improved functionality for this file, and it will not work properly unless they are enabled. "]
[]
[]
[]
[null,"This may be caused by one of the following warnings:"]
[null,null,"Follow the steps below each warning to enable Macros."]
[]
[]
[]
[]
[]
[null,null,"Simply click 'Enable Content'"]
[]
[]
[]
[]
[]
[]
[null,null,"Find out more here: ",null,"https://docs.microsoft.com/en-us/deployoffice/security/internet-macros-blocked#remove-mark-of-the-web-from-a-file"]
[]
[null,null,"1. Close workbook"]
[null,null,"2. Right click on the Excel file and click 'Properties'"]
[null,null,"3. Tick 'Unblock' and click 'OK'"]
[null,null,"4. Re-open file"]

{"sheet":"Inputs","index":1,"n_rows":57,"n_cols":17,"rows_kept":57,"cut":false,"hidden":false,"merged":[[47,11,47,15],[45,11,45,15],[46,11,46,15],[11,15,12,15]]}
[1,1,"1",1,1,1,1,1,1,1]
["macro disabled",false]
["Row # of First Flag",null,{"$f":"ROW(INDEX(A7:OFFSET(A7,options_count-1,0),MATCH(FALSE,ISBLANK(A7:OFFSET(A7,options_count-1,0)),0)))","v":9}]
["Number of Options",null,{"$f":"COUNTA(L7:L40)","v":33},null,null,null,null,null,null,null,null,null,null,null,"Release"]
[{"$f":"SUM(A7:OFFSET(A7,options_count-1,0))","v":15},{"$f":"COUNTIF(B7:OFFSET(B7,options_count-1,0),1)","v":0},{"$f":"SUM(C7:OFFSET(C7,options_count-1,0))","v":1},null,null,null,null,null,{"$f":"\"Col: \" &COLUMN(I6)","v":"Col: 9"},{"$f":"\"Col: \" &COLUMN(J6)","v":"Col: 10"},null,null,null,null,null,"Last Updated: 30-August-2023"]
["Must Fill Flag","Check error Flag","Check Fill Flag","Input Precedent (SHOW)","Check For_1","Check For_2","Check For_3","Row Outcome",null,null,null,"OPTIONS","INPUT",null,"INSTRUCTIONS","COMMENTS ","RECOMMENDATIONS"]
[null,null,null,null,null,null,null,null,null,null,null,"Customer's Name",null,null,"← Enter Customer's Name (Optional)"]
[null,null,null,null,null,null,null,null,null,null,null,"Customer's Job Number",null,null,"← Enter Job Number (Optional)"]
[1,null,{"$f":"IF(AND(LEN(M9)>0,H9<>\"HIDE\"),1,0)","v":0},null,null,null,null,null,null,null,null,"Region",null,{"$f":"HYPERLINK(\"#\"&ADDRESS(ROW(),COLUMN()-1),CHAR(128))","v":"€"},"← Select Region (AU/US)"]
[1,null,0,null,null,null,null,null,null,null,null,"Units",null,{"$f":"HYPERLINK(\"#\"&ADDRESS(ROW(),COLUMN()-1),CHAR(128))","v":"€"},"← Select Units (Metric/Imperial)"]
[null,null,null,null,null,null,null,"HIDE",null,null,null,"Fabric",null,"€",{"$f":"_xlfn.IFNA(\"← Select Fabric Weight (\"&INDEX(T_UnitSelection[Fabric],MATCH(i_Units,T_UnitSelection[UnitSelection],0))&\")\",\"← Select Fabric Weight\")","v":"← Select Fabric Weight"},{"$f":"IF(OR(AND(i_Units=\"Imperial\",i_Fabric=12.39),AND(i_Units=\"Metric\",i_Fabric=420),i_Fabric=\"\"),\"\",\"Warning! Refer to Pre-tension Charts for Booster and Pre-turn recommendations.\")","v":""}]
[1,{"$f":"IF(P12<>\"\",1,0)","v":0},0,null,null,null,null,null,null,null,null,"Blind Width",null,null,{"$f":"_xlfn.IFNA(\"← Enter Total Blind Width (\"&INDEX(T_UnitSelection[Units],MATCH(i_Units,T_UnitSelection[UnitSelection],0))&\")\",\"← Enter Blind Width\")","v":"← Enter Blind Width"},{"$f":"IF(AND(SUM(o_SizeWarningTrigger)>0,i_ControlType<>\"\"), Warning2, IF(AND(o_BlindOutOfSpec=\"Yes\",i_Tube<>\"\",i_Width<>\"\",i_Drop<>\"\"),Warning1,\"\"))","v":""}]
[1,null,0,null,null,null,null,null,null,null,null,"Blind Drop",null,null,{"$f":"_xlfn.IFNA(\"← Enter Total Blind Drop (\"&INDEX(T_UnitSelection[Units],MATCH(i_Units,T_UnitSelection[UnitSelection],0))&\")\",\"← Enter Blind Drop\")","v":"← Enter Blind Drop"}]
[{"$f":"IF(H14=\"HIDE\",0,1)","v":1},null,{"$f":"IF(AND(LEN(M14)>0,H14<>\"HIDE\"),1,0)","v":0},null,null,null,null,null,null,null,null,"Control Type",null,{"$f":"HYPERLINK(\"#\"&ADDRESS(ROW(),COLUMN()-1),CHAR(128))","v":"€"},{"$f":"\"← Select \"&L14","v":"← Select Control Type"}]
[{"$f":"IF(H15=\"HIDE\",0,1)","v":1},null,{"$f":"IF(AND(LEN(M15)>0,H15<>\"HIDE\"),1,0)","v":0},null,null,null,null,null,null,null,null,"Installation Type",null,{"$f":"HYPERLINK(\"#\"&ADDRESS(ROW(),COLUMN()-1),CHAR(128))","v":"€"},{"$f":"\"← Select \"&L15","v":"← Select Installation Type"}]
[{"$f":"IF(H16=\"HIDE\",0,1)","v":1},null,{"$f":"IF(AND(LEN(M16)>0,H16<>\"HIDE\"),1,0)","v":0},null,null,null,null,null,null,null,null,"Tube",null,"€",{"$f":"\"← Select \"&L16","v":"← Select Tube"}]
[{"$f":"IF(H17=\"HIDE\",0,1)","v":0},null,0,"i_ControlType","Easy Spring Ultra",{"$f":"IF(i_Booster=\"Booster | COMPACT\",0,1)","v":1},null,{"$f":"IF(SUMPRODUCT(F17,--ISNUMBER(SEARCH(E17,INDIRECT(D17)))),\"SHOW\",\"HIDE\")","v":"HIDE"},null,null,null,"Spring Control",null,"€",{"$f":"\"← Select \"&L17","v":"← Select Spring Control"}]
[1,{"$f":"IFERROR(IF(Ctrl_Recommendations!J6=1,1,0),0)","v":0},0,null,null,null,null,null,null,null,null,"Booster",null,"€",{"$f":"\"← Select \"&L18","v":"← Select Booster"},{"$f":"IFERROR(IF(P11<>\"\",\"\",IF(i_Tube<>\"\",IF(o_BoosterWarningTrigger=1,o_BoosterWarning,o_BoosterTextRec),\"\")),IFERROR(o_BoosterTextRec,\"\"))","v":""}]
[{"$f":"IF(H19=\"HIDE\",0,1)","v":0},null,{"$f":"IF(AND(LEN(M19)>0,H19<>\"HIDE\"),1,0)","v":0},"i_ControlType","Easy Spring Ultra",1,null,{"$f":"IF(SUMPRODUCT(F19,--ISNUMBER(SEARCH(E19,INDIRECT(D19)))),\"SHOW\",\"HIDE\")","v":"HIDE"},null,null,null,"Pre-Tension Clip",null,"€",{"$f":"\"← Select \"&L19","v":"← Select Pre-Tension Clip"}]
[{"$f":"IF(H20=\"HIDE\",0,1)","v":0},null,{"$f":"IF(AND(LEN(M20)>0,H20<>\"HIDE\"),1,0)","v":0},"i_InstallationType","CF90","P95 Semi Cassette","Cassette",{"$f":"IF(SUMPRODUCT(--ISNUMBER(SEARCH(E20:G20,INDIRECT(D20)))),\"SHOW\",\"HIDE\")","v":"HIDE"},null,null,null,"Fixing Options",null,"€","← Select Fixing Options"]
[0,null,0,"i_InstallationType","CF90",null,null,{"$f":"IF(ISNUMBER(SEARCH(E21,INDIRECT(D21))),\"SHOW\",\"HIDE\")","v":"HIDE"},null,null,null,"Box Shape",null,"€","← Select Box Shape"]
[{"$f":"IF(H22=\"HIDE\",0,1)","v":0},null,{"$f":"IF(AND(LEN(M22)>0,H22<>\"HIDE\"),1,0)","v":0},"i_InstallationType","CF90",null,null,{"$f":"IF(SUMPRODUCT(--ISNUMBER(SEARCH(E22,INDIRECT(D22)))),\"SHOW\",\"HIDE\")","v":"HIDE"},null,null,null,{"$f":"IF(i_Location=\"US\",\"Edge Light Block\",\"dim-OUT\")","v":"dim-OUT"},null,"€","← Select dim-OUT"]
[{"$f":"IF(H23=\"HIDE\",0,1)","v":0},null,{"$f":"IF(AND(LEN(M23)>0,H23<>\"HIDE\"),1,0)","v":0},"i_InstallationType","CF90",{"$f":"IF(AND(i_InstallationType=\"Cassette 110\",i_FixingOptions=\"Mounting Bracket\"),\"Cassette 110\",\"-\")","v":"-"},null,{"$f":"IF(SUMPRODUCT(--ISNUMBER(SEARCH(E23:F23,INDIRECT(D23)))),\"SHOW\",\"HIDE\")","v":"HIDE"},null,null,null,"Cassette Brush",null,"€","← Select Cassette Brush"]
[0,null,0,"i_InstallationType","P95 Semi Cassette","Cassette 110",null,{"$f":"IF(SUMPRODUCT(--ISNUMBER(SEARCH(E24:F24,INDIRECT(D24)))),\"SHOW\",\"HIDE\")","v":"HIDE"},null,null,null,"Fabric Wrap",null,"€","← Select Fabric Wrap"]
[0,null,0,"i_InstallationType",{"$f":"IF(AND(i_InstallationType=\"P95 Semi Cassette\",M24=\"Yes\"),\"P95 Semi Cassette\",\"-\")","v":"-"},{"$f":"IF(AND(i_InstallationType=\"Cassette 110\",M24=\"Yes\"),\"Cassette 110\",\"-\")","v":"-"},null,{"$f":"IF(SUMPRODUCT(--ISNUMBER(SEARCH(E25:F25,INDIRECT(D25)))),\"SHOW\",\"HIDE\")","v":"HIDE"},null,null,null,"Spline Options",null,"€",{"$f":"\"← Select \"&L25","v":"← Select Spline Options"}]
[1,null,0,"i_ControlType","Easy Spring Ultra",null,null,{"$f":"IF(ISNUMBER(SEARCH(E26,INDIRECT(D26))),\"HIDE\",\"SHOW\")","v":"SHOW"},null,null,null,"Control Side",null,"€","← Select Control Side"]
[0,null,0,"i_InstallationType","Open","Mounting Rail",null,{"$f":"IF(AND(i_Location =\"US\",SUMPRODUCT(--ISNUMBER(SEARCH(E27:F27,INDIRECT(D27))))),\"SHOW\",\"HIDE\")","v":"HIDE"},null,null,null,"Fabric Orientation",null,"€","← Select Fabric Orientation"]
[{"$f":"IF(H28=\"HIDE\",0,1)","v":0},null,{"$f":"IF(AND(LEN(M28)>0,H28<>\"HIDE\"),1,0)","v":0},"i_Tube","S45",null,null,{"$f":"IF(ISNUMBER(SEARCH(E28,INDIRECT(D28))),\"SHOW\",\"HIDE\")","v":"HIDE"},null,null,null,"Tube Extras",null,"€","← Select Tube Extras"]
[1,null,{"$f":"IF(AND(LEN(M29)>0,H29<>\"HIDE\"),1,0)","v":0},null,null,null,null,null,null,null,null,"Bracket Options",null,"€","← Select Bracket Options"]
[{"$f":"IF(H30=\"HIDE\",0,1)","v":0},null,{"$f":"IF(AND(LEN(M30)>0,H30<>\"HIDE\"),1,0)","v":0},"i_InstallationType","OPEN","Mounting Rail",null,{"$f":"IF(SUMPRODUCT(--ISNUMBER(SEARCH(E30:F30,INDIRECT(D30)))),\"SHOW\",\"HIDE\")","v":"HIDE"},null,null,null,"Bracket Covers",null,"€",{"$f":"\"← Select \"&L30","v":"← Select Bracket Covers"}]
[1,null,0,null,null,null,null,{"$f":"IF(i_InstallationType=\"Open\",\"HIDE\",\"SHOW\")","v":"SHOW"},null,null,null,"Finish",null,"€","← Select Finish"]
[1,null,0,"i_InstallationType <> CF90",null,null,null,null,null,null,null,{"$f":"IF(i_Location=\"US\",\"Hem Bar\",\"Weight Bar\")","v":"Weight Bar"},null,"€","← Select Weight Bar"]
[0,null,0,null,null,null,null,"HIDE",null,null,null,"Weight Bar Spline",null,"€","← Select Weight Bar Spline"]
[0,null,{"$f":"IF(AND(LEN(M34)>0,H34<>\"HIDE\"),1,0)","v":0},{"$f":"IF(i_Location=\"AU\",1,0)","v":0},{"$f":"IF(i_WeightBar=\"No Weight Bar\",0,1)","v":1},{"$f":"D34*E34","v":0},null,{"$f":"IF(F34=0,\"HIDE\",\"SHOW\")","v":"HIDE"},null,null,null,"Weight Bar Ballast",null,"€","← Select Weight Bar Ballast"]
[{"$f":"IF(H35=\"HIDE\",0,1)","v":1},null,{"$f":"IF(AND(LEN(M35)>0,H35<>\"HIDE\"),1,0)","v":0},"i_WeightBar","Internal Hem Bar",{"$f":"IF(i_Location=\"US\",\"No Hem Bar\",\"No Weight Bar\")","v":"No Weight Bar"},null,{"$f":"IF(SUMPRODUCT(--ISNUMBER(SEARCH(E35:F35,INDIRECT(D35)))),\"HIDE\",\"SHOW\")","v":"SHOW"},null,null,null,{"$f":"IF(i_Location=\"US\",\"Hem Bar Spline Type\",\"Weight Bar Spline Type\")","v":"Weight Bar Spline Type"},null,"€","← Select Weight Bar Spline Type"]
[{"$f":"IF(H36=\"HIDE\",0,1)","v":0},null,{"$f":"IF(AND(LEN(M36)>0,H36<>\"HIDE\"),1,0)","v":0},"i_WeightBar","D30","F4115","Fabric Wrap",{"$f":"IF(SUMPRODUCT(--ISNUMBER(SEARCH(E36:G36,INDIRECT(D36)))),\"SHOW\",\"HIDE\")","v":"HIDE"},null,null,null,{"$f":"IF(i_Location=\"US\",\"Hem Bar Accessories\",\"Weight Bar Accessories\")","v":"Weight Bar Accessories"},null,"€","← Select Weight Bar Accessories"]
[1,{"$f":"IF(AND(i_LinkedScreens<>\"\",P37<>\"\"),1,0)","v":0},{"$f":"IF(AND(LEN(M37)>0,H37<>\"HIDE\"),1,0)","v":0},null,null,null,null,{"$f":"IF(i_BracketOptions=\"LX Skyline Brackets | 55mm Pitch\",\"HIDE\",\"SHOW\")","v":"SHOW"},null,null,null,"Link System",null,"€","← Select Link System",{"$f":"IF(AND(o_LinkReqd=\"Yes\",OR(i_LinkedScreens=\"Yes\",i_LinkedScreens=\"No\")),o_LinkWarning,\"\")","v":""}]
[{"$f":"IF(H38=\"HIDE\",0,1)","v":0},null,{"$f":"IF(AND(LEN(M38)>0,H38<>\"HIDE\"),1,0)","v":0},"i_LinkedScreens","Link","Infinite",null,{"$f":"IF(SUMPRODUCT(--ISNUMBER(SEARCH(E38:F38,INDIRECT(D38)))),\"SHOW\",\"HIDE\")","v":"HIDE"},null,1,null,"# Screens",null,"€",{"$f":"\"← Select \"&L38&\" (2 or 3)\"","v":"← Select # Screens (2 or 3)"}]
[1,null,1,null,null,null,null,null,null,null,null,null,0]
[{"$f":"IF(H40=\"HIDE\",0,1)","v":0},null,1,"i_Location","AU",null,null,{"$f":"IF(SUMPRODUCT(--ISNUMBER(SEARCH(E40,INDIRECT(D40)))),\"SHOW\",\"HIDE\")","v":"HIDE"},null,null,null,"DISCOUNT",0,null,"← Enter Discount here"]
[{"$f":"IF(H41=\"HIDE\",0,1)","v":1},null,1,null,null,null,null,null,null,null,null,"SHADE(S)",1,null,"← Enter Shade Quantity"]
[]
["Row # of First Option",null,{"$f":"ROW(L7)","v":7},null,null,null,null,null,null,null,null,"LEGEND","INSTRUCTIONS"]
["Row # of Last Option",null,{"$f":"ROW(i_nScreens)","v":38},null,null,null,null,null,null,null,null,"Enter job data","STEP 1: In order to obtain cutting lists, ensure all fields are filled in",null,null,"*Based on selected tube size w/ D30 Weight Bar (No Ballast) | 420 gsm fabric."]
[null,null,null,null,null,null,null,null,null,null,null,"Select options","STEP 2: Once Inputs are completed, click SUBMIT button to generate Bill of Materials & Cutting List",null,null," For other fabrics, refer to Pre-tension Charts for Booster and Pre-turn recommendations."]
[]
[null,null,null,null,null,null,null,null,null,null,null,"NOTE: Microsoft Excel 2007 or later required for complete functionality. MACROS MUST BE ENABLED."]
[null,null,null,null,null,null,null,null,null,null,null,"DISCLAIMER: Rollease Acmeda has used reasonable care in preparing the information included in this workbook, but makes no representations or warranties as to the completeness or accuracy of the information. Information is supplied upon the condition that the persons receiving the information will make their own determination as to is suitability for their purposes prior to use. Rollease Acmeda assumes no liability whatsoever for any damages incurred by you resulting from errors in or omissions from the information included herein. Rollease Acmeda reserves the right to make changes without further notice to any products to improve the reliability, function or design."]
[]
[]
[]
[]
[]
[]
[]
[]
[null,null,null,"i_Location","AU",null,null,"IF(SUMPRODUCT(--ISNUMBER(SEARCH(E53,INDIRECT(D53)))),\"SHOW\",\"HIDE\")"]

{"sheet":"BoM","index":2,"n_rows":256,"n_cols":69,"rows_kept":256,"cut":false,"hidden":true,"merged":[[2,2,6,2],[2,24,6,24],[2,32,6,32],[8,25,8,30],[9,13,9,14],[9,15,9,16],[8,3,8,21],[9,3,9,4],[9,5,9,6],[9,7,9,8],[9,9,9,10],[9,11,9,12],[237,53,238,53],[8,33,8,47],[8,57,9,57],[8,56,9,56],[8,55,9,55],[8,53,9,53],[9,44,10,44],[235,53,236,53],[235,55,236,55],[237,55,238,55],[13,33,13,41],[242,53,242,62],[241,53,241,62],[8,68,9,68],[8,62,9,62],[8,58,9,58],[8,67,9,67],[8,59,9,59],[8,66,9,66],[8,65,9,65],[8,60,9,60],[8,63,9,63],[8,61,9,61],[235,65,236,65],[235,66,236,66],[237,65,238,65],[237,66,238,66]]}
[1,1,1,1,1,1,1,1,1,"1",1,1,1,1,1,1,1,1,1,1,1,1,1,1,1,1,1,1,1,1,1,1,1,1,1,1,1,1,1,1,1,1,1,1,1,1,1,1,1,1,1,1,null,null,"1","1",null,1,1,1,1,1,null,null,1,1,null,1,{"$f":"IF(i_Location=\"AU\",\"\",1)","v":1}]
[null,null,null,null,null,null,null,null,null,null,null,null,null,null,null,null,null,null,null,null,null,null,null,null,null,null,null,null,null,null,null,null,null,null,null,null,null,null,null,null,null,null,null,null,null,null,null,null,null,"SHOW"]
[null,null,"CONDITIONS",null,null,null,null,null,null,null,null,null,null,null,null,null,null,null,null,null,null,null,null,null,"QTY",null,null,null,null,null,null,null,"COLOURS",null,null,null,null,null,null,null,null,null,null,null,null,null,null,null,null,"SHOW",null,null,null,null,null,null,"Customers Name:",null,null,null,null,null,{"$f":"IF(i_CustName=0,\"\",i_CustName)","v":""}]
[null,null,null,null,null,null,null,null,null,null,null,null,null,null,null,null,null,null,null,null,null,null,null,null,null,null,null,null,null,null,null,null,null,null,null,null,null,null,null,null,null,null,null,null,null,null,null,null,null,"SHOW",null,null,null,null,null,null,"Job Number:",null,null,null,null,null,{"$f":"IF(i_JobNumber=0,\"\",i_JobNumber)","v":""}]
[null,null,null,null,null,null,null,null,null,null,null,null,null,null,null,null,null,null,null,null,null,null,null,null,null,null,null,null,null,null,null,null,null,null,null,null,null,null,null,null,null,null,null,null,null,null,null,null,null,"SHOW",null,null,null,null,null,null,"Blind Width:",null,null,null,null,null,{"$f":"i_Width","v":0},{"$f":"INDEX(T_UnitSelection[Units],MATCH(i_Units,T_UnitSelection[UnitSelection],0))","v":{"$error":"#N/A"}}]
[null,null,null,null,null,null,null,null,null,null,null,null,null,null,null,null,null,null,null,null,null,null,null,null,null,null,null,null,null,null,null,null,null,null,null,null,null,null,null,null,null,null,null,null,null,null,null,null,null,"SHOW",null,null,null,null,null,null,"Blind Drop:",null,null,null,null,null,{"$f":"i_Drop","v":0},{"$f":"INDEX(T_UnitSelection[Units],MATCH(i_Units,T_UnitSelection[UnitSelection],0))","v":{"$error":"#N/A"}}]
[null,null,null,null,null,null,null,null,null,null,null,null,null,null,null,null,null,null,null,null,null,null,null,null,null,null,null,null,null,null,null,null,null,null,null,null,null,null,null,null,null,null,null,null,null,null,null,null,null,"SHOW",null,null,null,{"$f":"i_ControlType&\", \"&IF(i_BoxShape<>\"\",i_BoxShape&\" \"&i_InstallationType,i_InstallationType)&\", \"&_xlfn.SINGLE(IF(i_DimOut=\"Yes\",\"Dim Out, \"&_xlfn.SINGLE(i_ControlSide),i_ControlSide))","v":", , "}]
[null,null,null,null,null,null,null,null,null,null,null,null,null,null,null,null,null,null,null,null,null,null,null,null,null,null,null,null,null,null,null,null,null,null,null,null,null,null,null,null,null,null,null,null,null,null,null,null,null,"SHOW"]
[null,null,null,"ROW HIDE/SHOW CONDITIONS",null,null,null,null,null,null,null,null,null,null,null,null,null,null,null,null,null,null,null,null,null,"QTY Modifiers",null,null,null,null,null,null,null,"Colour Selection",null,null,null,null,null,null,null,null,null,null,null,null,null,null,null,"SHOW",null,null,null,"PART NUMBER",null,"PART NUMBER (HIDDEN INPUT)","DESCRIPTION","Std Lengths (meters) NAV","CutList?","Deduction Type",{"$f":"\"Deduction Lookup (\"&INDEX(T_UnitSelection[Units],MATCH(i_Units,T_UnitSelection[UnitSelection],0))&\")\"","v":{"$error":"#N/A"}},"Deduc Type","CUT LENGTH","U.O.M","NAV","QTY (Base)","QTY","/m or /in Cost (Lookup)",{"$f":"\"Cost (\"&i_Currency&\")\"","v":{"$error":"#N/A"}}]
[null,null,"RowCtrl","Condition_1",null,"Condition_2",null,"Condition_3",null,"Condition_4",null,"Condition_5",null,"Condition_6",null,"Condition_7",null,null,null,null,null,null,null,null,null,"Links","Distance","Other Rules_1","Other Rules_x","QTY Factor.","Comments",null,null,null,null,null,null,null,null,null,null,null,null,"System Default",null,null,null,null,null,"SHOW",null,null,null,null,null,null,null,null,null,null,null,null,null,null,"UoM",null,null,"COST $$$"]
[null,null,null,null,null,null,null,null,null,null,null,null,null,null,null,null,null,null,null,null,null,null,null,null,null,null,null,null,null,null,null,null,null,"Fallback ",null,null,null,null,null,null,null,null,null,"White",null,null,null,null,null,{"$f":"IF(AND(ISBLANK(BD11),ISBLANK(C11)),\"HIDE\",IF(PRODUCT(C11:Y11)=1,\"SHOW\",\"HIDE\"))","v":"HIDE"},null,null,null,null,null,null,null,"(NAV)"]
[null,null,null,null,null,null,null,null,null,null,null,null,null,null,null,null,null,null,null,null,null,null,null,null,null,"o_nScreens","i_Width","i_Drop",null,null,null,null,null,"Colour",null,null,null,null,null,null,null,null,null,null,null,null,null,null,null,"HIDE"]
[null,null,null,null,null,null,null,null,null,null,null,null,null,null,null,null,null,null,null,null,null,null,null,null,null,{"$f":"o_nScreens","v":1},{"$f":"IF(i_Units=\"Metric\",i_Width,CONVERT(i_Width,\"in\",\"mm\"))","v":0},{"$f":"IF(i_Units=\"Metric\",i_Drop,CONVERT(i_Drop,\"in\",\"mm\"))","v":0},null,null,null,null,null,1,2,3,4,5,6,7,8,9,null,null,null,null,null,null,null,"HIDE"]
[null,null,null,null,null,null,null,null,null,null,null,null,null,null,null,null,null,null,null,null,null,null,null,null,null,null,null,null,null,null,null,null,null,"COLOUR OPTIONS",null,null,null,null,null,null,null,null,"LOC.","DEFAULT","Col_IN Selec",null,"Col_OUT Desc","Col_OUT Code",null,"HIDE"]
[null,null,{"$f":"C16","v":"0"},null,null,null,null,null,null,null,null,null,null,null,null,null,null,null,null,null,null,null,null,null,null,null,null,null,null,null,null,null,null,null,null,null,null,null,null,null,null,null,null,null,null,null,null,null,null,"HIDE"]
[null,null,{"$f":"IF(INDIRECT($D$16)=$D$17,1,\"0\")","v":"0"},"i_InstallationType",null,"i_BracketOptions",null,"i_BracketCovers",null,"i_ControlType",null,"i_BracketOptions",null,null,null,null,null,null,null,null,null,null,null,null,null,null,null,null,null,null,null,null,null,null,null,null,null,null,null,null,null,null,null,null,null,null,null,null,null,"HIDE",null,null,null,"OPEN",null,"OPEN"]
[null,null,null,"Open",{"$f":"IFERROR(IF(ISBLANK(D17),\"\",IF(FIND(D17,INDIRECT($D$16))>0,1,0)),0)","v":0},"Limiter Bracket Set",{"$f":"IFERROR(IF(ISBLANK(F17),\"\",IF(FIND(F17,INDIRECT($F$16))>0,1,0)),0)","v":0},null,{"$f":"IFERROR(IF(ISBLANK(H17),\"\",IF(FIND(H17,INDIRECT($H$16))>0,1,0)),0)","v":""},null,{"$f":"IFERROR(IF(ISBLANK(J17),\"\",IF(FIND(J17,INDIRECT($J$16))>0,1,0)),0)","v":""},"Skyline",{"$f":"IFERROR(IF(ISBLANK(L17),\"\",IF(FIND(L17,INDIRECT($L$16))>0,1,0)),0)","v":0},null,null,null,null,null,null,null,null,null,null,null,null,null,null,null,null,{"$f":"IFERROR(IF(AND(o_nScreens>1,Z17=\"Y\",PRODUCT(AA17:AC17)=0),o_nScreens,IF(PRODUCT(AA17:AC17)=0,\"\",PRODUCT(AA17:AC17))),\"\")","v":""},null,null,null,"White","Silver Grey",null,null,null,null,null,null,null,"AU",{"$f":"IF(ISNUMBER(FIND(\"x\",BD17)),IFERROR(INDEX(AH17:AP17,0,MATCH(AS17,AH17:AP17,0)),IF(AH17<>\"\",AH17,i_DefaultColour)),\"\")","v":""},{"$f":"i_Colour","v":0},null,{"$f":"IF(ISNUMBER(FIND(\"x\",BD17)),IFERROR(INDEX(AH17:AP17,0,MATCH(AS17,AH17:AP17,0)),AR17),\"\")","v":""},{"$f":"IF(ISNUMBER(FIND(\"x\",BD17)),IFERROR(INDEX(INDIRECT(\"T_FinishColour[ColourCode-\"&IF(ISNUMBER(FIND(\"xxx\",BD17)),\"xxx\",IF(ISNUMBER(FIND(\"xx\",BD17)),\"xx\",\"error\"))&AQ17&\"]\"),MATCH(AU17,T_FinishColour[Finish / Colour],0)),\"\"),\"\")","v":""},null,"HIDE",null,null,null,{"$f":"_xlfn.IFNA(SUBSTITUTE(IF(AQ17=\"AU\",SUBSTITUTE(BD17,\"xxx\",AV17),SUBSTITUTE(SUBSTITUTE(BD17,\"xx\",AV17),\"x\",\"\")),\"LLL\",\"580\"),BD17)","v":"RB12-2501-069138"},null,"RB12-2501-069138","Single Stop Limiter Std Bracket Set 1.5\"",null,{"$f":"IF(ISBLANK(BL17),\"\",IF(OR(BL17=L_Units),\"Y\",\"N\"))","v":"N"},null,{"$f":"IFERROR(IF(BG17=\"Y\",((INDEX(T_Deduc[Deduction],MATCH(BH17,T_Deduc[Type],0),0))),\"\"),\"\")","v":""},null,{"$f":"IFERROR(IF(BG17=\"Y\",(INDIRECT(BJ17)-BI17)/IF(Z17=\"\",1,o_nScreens),\"\"),\"\")","v":""},"Set",{"$f":"IFERROR(IF(ISBLANK(BB17),\"\",INDEX(T_NAV[Base Unit of Measure],MATCH(BB17,T_NAV[No.],0))),\"\")","v":"SET"},1,{"$f":"IF(ISBLANK(BN17),\"\",PRODUCT(AD17,BN17,ShadeQuantity))","v":1},{"$f":"IFERROR(INDEX(INDIRECT(\"T_NAV[\"&i_Location&\"]\"),MATCH(1,--(BB17=T_NAV[No.])*--((INDIRECT(\"T_NAV[\"&i_Location&\"]\"))<>\"\"),0))/IF(AND(BF17<>\"\",i_Units=\"Imperial\"),CONVERT(BF17,\"m\",\"in\"),IF(AND(i_Units=\"Imperial\",BM17=\"Metre\"),39.37,IF(BF17<>\"\",BF17,1))),\"\")","v":""},{"$f":"IF(AND(AX17=\"SHOW\",BP17<>\"\"),BP17*BO17*IF(AND(BK17<>\"\",OR(BM17=\"LENGTH\",BM17=\"METRE\",BM17=\"ROLL\")),IF(BK17=\"^\",INDIRECT(BJ17),(INDIRECT(BJ17)-BI17))/IF(i_Units=\"Metric\",1000,1),1),\"\")","v":""}]
[null,null,null,"Open",0,"Skyline Standard",0,null,"",null,{"$f":"IFERROR(IF(ISBLANK(J18),\"\",IF(FIND(J18,INDIRECT($J$16))>0,1,0)),0)","v":""},null,null,null,null,null,null,null,null,null,null,null,null,null,null,null,null,null,null,{"$f":"IFERROR(IF(AND(o_nScreens>1,Z18=\"Y\",PRODUCT(AA18:AC18)=0),o_nScreens,IF(PRODUCT(AA18:AC18)=0,\"\",PRODUCT(AA18:AC18))),\"\")","v":""},null,null,null,null,null,null,null,null,null,null,null,null,"US",{"$f":"IF(ISNUMBER(FIND(\"x\",BD18)),IFERROR(INDEX(AH18:AP18,0,MATCH(AS18,AH18:AP18,0)),IF(AH18<>\"\",AH18,i_DefaultColour)),\"\")","v":"White"},0,null,{"$f":"IF(ISNUMBER(FIND(\"x\",BD18)),IFERROR(INDEX(AH18:AP18,0,MATCH(AS18,AH18:AP18,0)),AR18),\"\")","v":"White"},{"$f":"IF(ISNUMBER(FIND(\"x\",BD18)),IFERROR(INDEX(INDIRECT(\"T_FinishColour[ColourCode-\"&IF(ISNUMBER(FIND(\"xxx\",BD18)),\"xxx\",IF(ISNUMBER(FIND(\"xx\",BD18)),\"xx\",\"error\"))&AQ18&\"]\"),MATCH(AU18,T_FinishColour[Finish / Colour],0)),\"\"),\"\")","v":"W"},null,"HIDE",null,null,null,{"$f":"_xlfn.IFNA(SUBSTITUTE(IF(AQ18=\"AU\",SUBSTITUTE(BD18,\"xxx\",AV18),SUBSTITUTE(SUBSTITUTE(BD18,\"xx\",AV18),\"x\",\"\")),\"LLL\",\"580\"),BD18)","v":"SLB660W"},null,"SLB660xx","Skyline Bracket 1.5\"",null,{"$f":"IF(ISBLANK(BL18),\"\",IF(OR(BL18=L_Units),\"Y\",\"N\"))","v":"N"},null,{"$f":"IFERROR(IF(BG18=\"Y\",((INDEX(T_Deduc[Deduction],MATCH(BH18,T_Deduc[Type],0),0))),\"\"),\"\")","v":""},null,{"$f":"IFERROR(IF(BG18=\"Y\",(INDIRECT(BJ18)-BI18)/IF(Z18=\"\",1,o_nScreens),\"\"),\"\")","v":""},"Piece",{"$f":"IFERROR(IF(ISBLANK(BB18),\"\",INDEX(T_NAV[Base Unit of Measure],MATCH(BB18,T_NAV[No.],0))),\"\")","v":"PIECE"},2,{"$f":"IF(ISBLANK(BN18),\"\",PRODUCT(AD18,BN18,ShadeQuantity))","v":2},{"$f":"IFERROR(INDEX(INDIRECT(\"T_NAV[\"&i_Location&\"]\"),MATCH(1,--(BB18=T_NAV[No.])*--((INDIRECT(\"T_NAV[\"&i_Location&\"]\"))<>\"\"),0))/IF(AND(BF18<>\"\",i_Units=\"Imperial\"),CONVERT(BF18,\"m\",\"in\"),IF(AND(i_Units=\"Imperial\",BM18=\"Metre\"),39.37,IF(BF18<>\"\",BF18,1))),\"\")","v":""},""]
[null,null,null,"Open",0,"Skyline Standard",0,"Yes",0,null,{"$f":"IFERROR(IF(ISBLANK(J19),\"\",IF(FIND(J19,INDIRECT($J$16))>0,1,0)),0)","v":""},null,null,null,null,null,null,null,null,null,null,null,null,null,null,null,null,null,null,"",null,null,null,null,null,null,null,null,null,null,null,null,"US","White",0,null,"White",{"$f":"IF(ISNUMBER(FIND(\"x\",BD19)),IFERROR(INDEX(INDIRECT(\"T_FinishColour[ColourCode-\"&IF(ISNUMBER(FIND(\"xxx\",BD19)),\"xxx\",IF(ISNUMBER(FIND(\"xx\",BD19)),\"xx\",\"error\"))&AQ19&\"]\"),MATCH(AU19,T_FinishColour[Finish / Colour],0)),\"\"),\"\")","v":"W"},null,"HIDE",null,null,null,"SLBCW",null,"SLBCxx","Standard Bracket Cover",null,{"$f":"IF(ISBLANK(BL19),\"\",IF(OR(BL19=L_Units),\"Y\",\"N\"))","v":"N"},null,{"$f":"IFERROR(IF(BG19=\"Y\",((INDEX(T_Deduc[Deduction],MATCH(BH19,T_Deduc[Type],0),0))),\"\"),\"\")","v":""},null,"","Piece",{"$f":"IFERROR(IF(ISBLANK(BB19),\"\",INDEX(T_NAV[Base Unit of Measure],MATCH(BB19,T_NAV[No.],0))),\"\")","v":"EACH"},2,2,{"$f":"IFERROR(INDEX(INDIRECT(\"T_NAV[\"&i_Location&\"]\"),MATCH(1,--(BB19=T_NAV[No.])*--((INDIRECT(\"T_NAV[\"&i_Location&\"]\"))<>\"\"),0))/IF(AND(BF19<>\"\",i_Units=\"Imperial\"),CONVERT(BF19,\"m\",\"in\"),IF(AND(i_Units=\"Imperial\",BM19=\"Metre\"),39.37,IF(BF19<>\"\",BF19,1))),\"\")","v":""},""]
[null,null,null,"Open",{"$f":"IFERROR(IF(ISBLANK(D20),\"\",IF(FIND(D20,INDIRECT($D$16))>0,1,0)),0)","v":0},"Skyline Narrow",0,null,"",null,"",null,null,null,null,null,null,null,null,null,null,null,null,null,null,null,null,null,null,{"$f":"IFERROR(IF(AND(o_nScreens>1,Z20=\"Y\",PRODUCT(AA20:AC20)=0),o_nScreens,IF(PRODUCT(AA20:AC20)=0,\"\",PRODUCT(AA20:AC20))),\"\")","v":""},null,null,null,null,null,null,null,null,null,null,null,null,"US",{"$f":"IF(ISNUMBER(FIND(\"x\",BD20)),IFERROR(INDEX(AH20:AP20,0,MATCH(AS20,AH20:AP20,0)),IF(AH20<>\"\",AH20,i_DefaultColour)),\"\")","v":"White"},0,null,{"$f":"IF(ISNUMBER(FIND(\"x\",BD20)),IFERROR(INDEX(AH20:AP20,0,MATCH(AS20,AH20:AP20,0)),AR20),\"\")","v":"White"},{"$f":"IF(ISNUMBER(FIND(\"x\",BD20)),IFERROR(INDEX(INDIRECT(\"T_FinishColour[ColourCode-\"&IF(ISNUMBER(FIND(\"xxx\",BD20)),\"xxx\",IF(ISNUMBER(FIND(\"xx\",BD20)),\"xx\",\"error\"))&AQ20&\"]\"),MATCH(AU20,T_FinishColour[Finish / Colour],0)),\"\"),\"\")","v":"W"},null,"HIDE",null,null,null,{"$f":"_xlfn.IFNA(SUBSTITUTE(IF(AQ20=\"AU\",SUBSTITUTE(BD20,\"xxx\",AV20),SUBSTITUTE(SUBSTITUTE(BD20,\"xx\",AV20),\"x\",\"\")),\"LLL\",\"580\"),BD20)","v":"SLNB660W"},null,"SLNB660xx","Narrow Skyline Bracket 1.5\"",null,{"$f":"IF(ISBLANK(BL20),\"\",IF(OR(BL20=L_Units),\"Y\",\"N\"))","v":"N"},null,{"$f":"IFERROR(IF(BG20=\"Y\",((INDEX(T_Deduc[Deduction],MATCH(BH20,T_Deduc[Type],0),0))),\"\"),\"\")","v":""},null,{"$f":"IFERROR(IF(BG20=\"Y\",(INDIRECT(BJ20)-BI20)/IF(Z20=\"\",1,o_nScreens),\"\"),\"\")","v":""},"Piece",{"$f":"IFERROR(IF(ISBLANK(BB20),\"\",INDEX(T_NAV[Base Unit of Measure],MATCH(BB20,T_NAV[No.],0))),\"\")","v":"EACH"},2,{"$f":"IF(ISBLANK(BN20),\"\",PRODUCT(AD20,BN20,ShadeQuantity))","v":2},{"$f":"IFERROR(INDEX(INDIRECT(\"T_NAV[\"&i_Location&\"]\"),MATCH(1,--(BB20=T_NAV[No.])*--((INDIRECT(\"T_NAV[\"&i_Location&\"]\"))<>\"\"),0))/IF(AND(BF20<>\"\",i_Units=\"Imperial\"),CONVERT(BF20,\"m\",\"in\"),IF(AND(i_Units=\"Imperial\",BM20=\"Metre\"),39.37,IF(BF20<>\"\",BF20,1))),\"\")","v":""},""]
[null,null,null,"Open",0,"Skyline Narrow",0,"Yes",0,null,"",null,null,null,null,null,null,null,null,null,null,null,null,null,null,null,null,null,null,"",null,null,null,null,null,null,null,null,null,null,null,null,"US","White",0,null,"White",{"$f":"IF(ISNUMBER(FIND(\"x\",BD21)),IFERROR(INDEX(INDIRECT(\"T_FinishColour[ColourCode-\"&IF(ISNUMBER(FIND(\"xxx\",BD21)),\"xxx\",IF(ISNUMBER(FIND(\"xx\",BD21)),\"xx\",\"error\"))&AQ21&\"]\"),MATCH(AU21,T_FinishColour[Finish / Colour],0)),\"\"),\"\")","v":"W"},null,"HIDE",null,null,null,"SLNBC660W",null,"SLNBC660xx","Narrow Skyline Bracket Cover",null,{"$f":"IF(ISBLANK(BL21),\"\",IF(OR(BL21=L_Units),\"Y\",\"N\"))","v":"N"},null,{"$f":"IFERROR(IF(BG21=\"Y\",((INDEX(T_Deduc[Deduction],MATCH(BH21,T_Deduc[Type],0),0))),\"\"),\"\")","v":""},null,"","Piece",{"$f":"IFERROR(IF(ISBLANK(BB21),\"\",INDEX(T_NAV[Base Unit of Measure],MATCH(BB21,T_NAV[No.],0))),\"\")","v":"PIECE"},2,2,{"$f":"IFERROR(INDEX(INDIRECT(\"T_NAV[\"&i_Location&\"]\"),MATCH(1,--(BB21=T_NAV[No.])*--((INDIRECT(\"T_NAV[\"&i_Location&\"]\"))<>\"\"),0))/IF(AND(BF21<>\"\",i_Units=\"Imperial\"),CONVERT(BF21,\"m\",\"in\"),IF(AND(i_Units=\"Imperial\",BM21=\"Metre\"),39.37,IF(BF21<>\"\",BF21,1))),\"\")","v":""},""]
[null,null,null,"Open",0,"Skyline Limiter",0,"Yes",0,null,"",null,null,null,null,null,null,null,null,null,null,null,null,null,null,null,null,null,null,"",null,null,null,null,null,null,null,null,null,null,null,null,"US","White",0,null,"White",{"$f":"IF(ISNUMBER(FIND(\"x\",BD22)),IFERROR(INDEX(INDIRECT(\"T_FinishColour[ColourCode-\"&IF(ISNUMBER(FIND(\"xxx\",BD22)),\"xxx\",IF(ISNUMBER(FIND(\"xx\",BD22)),\"xx\",\"error\"))&AQ22&\"]\"),MATCH(AU22,T_FinishColour[Finish / Colour],0)),\"\"),\"\")","v":"W"},null,"HIDE",null,null,null,"SLBCW",null,"SLBCxx","Standard Bracket Cover",null,{"$f":"IF(ISBLANK(BL22),\"\",IF(OR(BL22=L_Units),\"Y\",\"N\"))","v":"N"},null,{"$f":"IFERROR(IF(BG22=\"Y\",((INDEX(T_Deduc[Deduction],MATCH(BH22,T_Deduc[Type],0),0))),\"\"),\"\")","v":""},null,"","Piece",{"$f":"IFERROR(IF(ISBLANK(BB22),\"\",INDEX(T_NAV[Base Unit of Measure],MATCH(BB22,T_NAV[No.],0))),\"\")","v":"EACH"},2,2,{"$f":"IFERROR(INDEX(INDIRECT(\"T_NAV[\"&i_Location&\"]\"),MATCH(1,--(BB22=T_NAV[No.])*--((INDIRECT(\"T_NAV[\"&i_Location&\"]\"))<>\"\"),0))/IF(AND(BF22<>\"\",i_Units=\"Imperial\"),CONVERT(BF22,\"m\",\"in\"),IF(AND(i_Units=\"Imperial\",BM22=\"Metre\"),39.37,IF(BF22<>\"\",BF22,1))),\"\")","v":""},""]
[null,null,null,"Open",0,"LX Skyline Bracket | 40mm Pitch",0,null,"",null,"",null,null,null,null,null,null,null,null,null,null,null,null,null,null,null,null,null,null,"",null,null,null,null,null,null,null,null,null,null,null,null,"AU","White",0,null,"White",{"$f":"IF(ISNUMBER(FIND(\"x\",BD23)),IFERROR(INDEX(INDIRECT(\"T_FinishColour[ColourCode-\"&IF(ISNUMBER(FIND(\"xxx\",BD23)),\"xxx\",IF(ISNUMBER(FIND(\"xx\",BD23)),\"xx\",\"error\"))&AQ23&\"]\"),MATCH(AU23,T_FinishColour[Finish / Colour],0)),\"\"),\"\")","v":"069"},null,"HIDE",null,null,null,{"$f":"_xlfn.IFNA(SUBSTITUTE(IF(AQ23=\"AU\",SUBSTITUTE(BD23,\"xxx\",AV23),SUBSTITUTE(SUBSTITUTE(BD23,\"xx\",AV23),\"x\",\"\")),\"LLL\",\"580\"),BD23)","v":"SL01-0306-069040"},null,"SL01-0306-xxx040","LX Skyline Bracket | 40mm Projection",null,{"$f":"IF(ISBLANK(BL23),\"\",IF(OR(BL23=L_Units),\"Y\",\"N\"))","v":"N"},null,{"$f":"IFERROR(IF(BG23=\"Y\",((INDEX(T_Deduc[Deduction],MATCH(BH23,T_Deduc[Type],0),0))),\"\"),\"\")","v":""},null,"","Piece",{"$f":"IFERROR(IF(ISBLANK(BB23),\"\",INDEX(T_NAV[Base Unit of Measure],MATCH(BB23,T_NAV[No.],0))),\"\")","v":"PIECE"},2,2,{"$f":"IFERROR(INDEX(INDIRECT(\"T_NAV[\"&i_Location&\"]\"),MATCH(1,--(BB23=T_NAV[No.])*--((INDIRECT(\"T_NAV[\"&i_Location&\"]\"))<>\"\"),0))/IF(AND(BF23<>\"\",i_Units=\"Imperial\"),CONVERT(BF23,\"m\",\"in\"),IF(AND(i_Units=\"Imperial\",BM23=\"Metre\"),39.37,IF(BF23<>\"\",BF23,1))),\"\")","v":""},""]
[null,null,null,"Open",{"$f":"IFERROR(IF(ISBLANK(D24),\"\",IF(FIND(D24,INDIRECT($D$16))>0,1,0)),0)","v":0},"LX Skyline Bracket | 55mm Pitch",0,null,"",null,"",null,null,null,null,null,null,null,null,null,null,null,null,null,null,null,null,null,null,{"$f":"IFERROR(IF(AND(o_nScreens>1,Z24=\"Y\",PRODUCT(AA24:AC24)=0),o_nScreens,IF(PRODUCT(AA24:AC24)=0,\"\",PRODUCT(AA24:AC24))),\"\")","v":""},null,null,null,null,null,null,null,null,null,null,null,null,"AU",{"$f":"IF(ISNUMBER(FIND(\"x\",BD24)),IFERROR(INDEX(AH24:AP24,0,MATCH(AS24,AH24:AP24,0)),IF(AH24<>\"\",AH24,i_DefaultColour)),\"\")","v":"White"},0,null,{"$f":"IF(ISNUMBER(FIND(\"x\",BD24)),IFERROR(INDEX(AH24:AP24,0,MATCH(AS24,AH24:AP24,0)),AR24),\"\")","v":"White"},{"$f":"IF(ISNUMBER(FIND(\"x\",BD24)),IFERROR(INDEX(INDIRECT(\"T_FinishColour[ColourCode-\"&IF(ISNUMBER(FIND(\"xxx\",BD24)),\"xxx\",IF(ISNUMBER(FIND(\"xx\",BD24)),\"xx\",\"error\"))&AQ24&\"]\"),MATCH(AU24,T_FinishColour[Finish / Colour],0)),\"\"),\"\")","v":"069"},null,"HIDE",null,null,null,{"$f":"_xlfn.IFNA(SUBSTITUTE(IF(AQ24=\"AU\",SUBSTITUTE(BD24,\"xxx\",AV24),SUBSTITUTE(SUBSTITUTE(BD24,\"xx\",AV24),\"x\",\"\")),\"LLL\",\"580\"),BD24)","v":"SL01-0306-069055"},null,"SL01-0306-xxx055","LX Skyline Bracket | 55mm Projection",null,{"$f":"IF(ISBLANK(BL24),\"\",IF(OR(BL24=L_Units),\"Y\",\"N\"))","v":"N"},null,{"$f":"IFERROR(IF(BG24=\"Y\",((INDEX(T_Deduc[Deduction],MATCH(BH24,T_Deduc[Type],0),0))),\"\"),\"\")","v":""},null,{"$f":"IFERROR(IF(BG24=\"Y\",(INDIRECT(BJ24)-BI24)/IF(Z24=\"\",1,o_nScreens),\"\"),\"\")","v":""},"Piece",{"$f":"IFERROR(IF(ISBLANK(BB24),\"\",INDEX(T_NAV[Base Unit of Measure],MATCH(BB24,T_NAV[No.],0))),\"\")","v":"PIECE"},2,{"$f":"IF(ISBLANK(BN24),\"\",PRODUCT(AD24,BN24,ShadeQuantity))","v":2},{"$f":"IFERROR(INDEX(INDIRECT(\"T_NAV[\"&i_Location&\"]\"),MATCH(1,--(BB24=T_NAV[No.])*--((INDIRECT(\"T_NAV[\"&i_Location&\"]\"))<>\"\"),0))/IF(AND(BF24<>\"\",i_Units=\"Imperial\"),CONVERT(BF24,\"m\",\"in\"),IF(AND(i_Units=\"Imperial\",BM24=\"Metre\"),39.37,IF(BF24<>\"\",BF24,1))),\"\")","v":""},""]
[null,null,null,"Open",0,"Easy-Lock",0,null,"",null,"",null,null,null,null,null,null,null,null,null,null,null,null,null,null,null,null,null,null,"",null,null,null,null,null,null,null,null,null,null,null,null,"AU","White",0,null,"White",{"$f":"IF(ISNUMBER(FIND(\"x\",BD25)),IFERROR(INDEX(INDIRECT(\"T_FinishColour[ColourCode-\"&IF(ISNUMBER(FIND(\"xxx\",BD25)),\"xxx\",IF(ISNUMBER(FIND(\"xx\",BD25)),\"xx\",\"error\"))&AQ25&\"]\"),MATCH(AU25,T_FinishColour[Finish / Colour],0)),\"\"),\"\")","v":"069"},null,"HIDE",null,null,null,"RB09-0352-069040",null,"RB09-0352-xxx040","Easy-Lock LX Installation Bracket",null,{"$f":"IF(ISBLANK(BL25),\"\",IF(OR(BL25=L_Units),\"Y\",\"N\"))","v":"N"},null,{"$f":"IFERROR(IF(BG25=\"Y\",((INDEX(T_Deduc[Deduction],MATCH(BH25,T_Deduc[Type],0),0))),\"\"),\"\")","v":""},null,"","Set",{"$f":"IFERROR(IF(ISBLANK(BB25),\"\",INDEX(T_NAV[Base Unit of Measure],MATCH(BB25,T_NAV[No.],0))),\"\")","v":"PAIR"},1,1,{"$f":"IFERROR(INDEX(INDIRECT(\"T_NAV[\"&i_Location&\"]\"),MATCH(1,--(BB25=T_NAV[No.])*--((INDIRECT(\"T_NAV[\"&i_Location&\"]\"))<>\"\"),0))/IF(AND(BF25<>\"\",i_Units=\"Imperial\"),CONVERT(BF25,\"m\",\"in\"),IF(AND(i_Units=\"Imperial\",BM25=\"Metre\"),39.37,IF(BF25<>\"\",BF25,1))),\"\")","v":""},""]
[null,null,null,"Open",{"$f":"IFERROR(IF(ISBLANK(D26),\"\",IF(FIND(D26,INDIRECT($D$16))>0,1,0)),0)","v":0},"LX",0,"Yes",{"$f":"IFERROR(IF(ISBLANK(H26),\"\",IF(FIND(H26,INDIRECT($H$16))>0,1,0)),0)","v":0},null,"",null,null,null,null,null,null,null,null,null,null,null,null,null,null,null,null,null,null,{"$f":"IFERROR(IF(AND(o_nScreens>1,Z26=\"Y\",PRODUCT(AA26:AC26)=0),o_nScreens,IF(PRODUCT(AA26:AC26)=0,\"\",PRODUCT(AA26:AC26))),\"\")","v":""},null,null,null,null,null,null,null,null,null,null,null,null,"AU",{"$f":"IF(ISNUMBER(FIND(\"x\",BD26)),IFERROR(INDEX(AH26:AP26,0,MATCH(AS26,AH26:AP26,0)),IF(AH26<>\"\",AH26,i_DefaultColour)),\"\")","v":"White"},0,null,{"$f":"IF(ISNUMBER(FIND(\"x\",BD26)),IFERROR(INDEX(AH26:AP26,0,MATCH(AS26,AH26:AP26,0)),AR26),\"\")","v":"White"},{"$f":"IF(ISNUMBER(FIND(\"x\",BD26)),IFERROR(INDEX(INDIRECT(\"T_FinishColour[ColourCode-\"&IF(ISNUMBER(FIND(\"xxx\",BD26)),\"xxx\",IF(ISNUMBER(FIND(\"xx\",BD26)),\"xx\",\"error\"))&AQ26&\"]\"),MATCH(AU26,T_FinishColour[Finish / Colour],0)),\"\"),\"\")","v":"069"},null,"HIDE",null,null,null,{"$f":"_xlfn.IFNA(SUBSTITUTE(IF(AQ26=\"AU\",SUBSTITUTE(BD26,\"xxx\",AV26),SUBSTITUTE(SUBSTITUTE(BD26,\"xx\",AV26),\"x\",\"\")),\"LLL\",\"580\"),BD26)","v":"RB08-4151-069040"},null,"RB08-4151-xxx040","VX/LX Bracket Cover Caps | 40mm Proj.",null,{"$f":"IF(ISBLANK(BL26),\"\",IF(OR(BL26=L_Units),\"Y\",\"N\"))","v":"N"},null,{"$f":"IFERROR(IF(BG26=\"Y\",((INDEX(T_Deduc[Deduction],MATCH(BH26,T_Deduc[Type],0),0))),\"\"),\"\")","v":""},null,{"$f":"IFERROR(IF(BG26=\"Y\",(INDIRECT(BJ26)-BI26)/IF(Z26=\"\",1,o_nScreens),\"\"),\"\")","v":""},"Set",{"$f":"IFERROR(IF(ISBLANK(BB26),\"\",INDEX(T_NAV[Base Unit of Measure],MATCH(BB26,T_NAV[No.],0))),\"\")","v":"PAIR"},1,{"$f":"IF(ISBLANK(BN26),\"\",PRODUCT(AD26,BN26,ShadeQuantity))","v":1},{"$f":"IFERROR(INDEX(INDIRECT(\"T_NAV[\"&i_Location&\"]\"),MATCH(1,--(BB26=T_NAV[No.])*--((INDIRECT(\"T_NAV[\"&i_Location&\"]\"))<>\"\"),0))/IF(AND(BF26<>\"\",i_Units=\"Imperial\"),CONVERT(BF26,\"m\",\"in\"),IF(AND(i_Units=\"Imperial\",BM26=\"Metre\"),39.37,IF(BF26<>\"\",BF26,1))),\"\")","v":""},""]
[null,null,null,"Open",0,"LX",0,"Yes",{"$f":"IFERROR(IF(ISBLANK(H27),\"\",IF(FIND(H27,INDIRECT($H$16))>0,1,0)),0)","v":0},null,"",null,null,null,null,null,null,null,null,null,null,null,null,null,null,null,null,null,null,"",null,null,null,null,null,null,null,null,null,null,null,null,"AU","White",0,null,"White",{"$f":"IF(ISNUMBER(FIND(\"x\",BD27)),IFERROR(INDEX(INDIRECT(\"T_FinishColour[ColourCode-\"&IF(ISNUMBER(FIND(\"xxx\",BD27)),\"xxx\",IF(ISNUMBER(FIND(\"xx\",BD27)),\"xx\",\"error\"))&AQ27&\"]\"),MATCH(AU27,T_FinishColour[Finish / Colour],0)),\"\"),\"\")","v":"069"},null,"HIDE",null,null,null,{"$f":"_xlfn.IFNA(SUBSTITUTE(IF(AQ27=\"AU\",SUBSTITUTE(BD27,\"xxx\",AV27),SUBSTITUTE(SUBSTITUTE(BD27,\"xx\",AV27),\"x\",\"\")),\"LLL\",\"580\"),BD27)","v":"RB08-4151-069055"},null,"RB08-4151-xxx055","VX/LX Bracket Cover Caps | 55mm Proj.",null,{"$f":"IF(ISBLANK(BL27),\"\",IF(OR(BL27=L_Units),\"Y\",\"N\"))","v":"N"},null,{"$f":"IFERROR(IF(BG27=\"Y\",((INDEX(T_Deduc[Deduction],MATCH(BH27,T_Deduc[Type],0),0))),\"\"),\"\")","v":""},null,"","Set",{"$f":"IFERROR(IF(ISBLANK(BB27),\"\",INDEX(T_NAV[Base Unit of Measure],MATCH(BB27,T_NAV[No.],0))),\"\")","v":"PAIR"},1,1,{"$f":"IFERROR(INDEX(INDIRECT(\"T_NAV[\"&i_Location&\"]\"),MATCH(1,--(BB27=T_NAV[No.])*--((INDIRECT(\"T_NAV[\"&i_Location&\"]\"))<>\"\"),0))/IF(AND(BF27<>\"\",i_Units=\"Imperial\"),CONVERT(BF27,\"m\",\"in\"),IF(AND(i_Units=\"Imperial\",BM27=\"Metre\"),39.37,IF(BF27<>\"\",BF27,1))),\"\")","v":""},""]
[null,null,null,null,null,null,null,null,null,null,null,null,null,null,null,null,null,null,null,null,null,null,null,null,null,null,null,null,null,"",null,null,null,null,null,null,null,null,null,null,null,null,null,"",null,null,"",{"$f":"IF(ISNUMBER(FIND(\"x\",BD28)),IFERROR(INDEX(INDIRECT(\"T_FinishColour[ColourCode-\"&IF(ISNUMBER(FIND(\"xxx\",BD28)),\"xxx\",IF(ISNUMBER(FIND(\"xx\",BD28)),\"xx\",\"error\"))&AQ28&\"]\"),MATCH(AU28,T_FinishColour[Finish / Colour],0)),\"\"),\"\")","v":""},null,"HIDE",null,null,null,"",null,null,null,null,{"$f":"IF(ISBLANK(BL28),\"\",IF(OR(BL28=L_Units),\"Y\",\"N\"))","v":""},null,{"$f":"IFERROR(IF(BG28=\"Y\",((INDEX(T_Deduc[Deduction],MATCH(BH28,T_Deduc[Type],0),0))),\"\"),\"\")","v":""},null,"",null,{"$f":"IFERROR(IF(ISBLANK(BB28),\"\",INDEX(T_NAV[Base Unit of Measure],MATCH(BB28,T_NAV[No.],0))),\"\")","v":""},null,"",{"$f":"IFERROR(INDEX(INDIRECT(\"T_NAV[\"&i_Location&\"]\"),MATCH(1,--(BB28=T_NAV[No.])*--((INDIRECT(\"T_NAV[\"&i_Location&\"]\"))<>\"\"),0))/IF(AND(BF28<>\"\",i_Units=\"Imperial\"),CONVERT(BF28,\"m\",\"in\"),IF(AND(i_Units=\"Imperial\",BM28=\"Metre\"),39.37,IF(BF28<>\"\",BF28,1))),\"\")","v":""},""]
[null,null,null,null,null,null,null,null,null,null,null,null,null,null,null,null,null,null,null,null,null,null,null,null,null,null,null,null,null,{"$f":"IFERROR(IF(AND(o_nScreens>1,Z29=\"Y\",PRODUCT(AA29:AC29)=0),o_nScreens,IF(PRODUCT(AA29:AC29)=0,\"\",PRODUCT(AA29:AC29))),\"\")","v":""},null,null,null,null,null,null,null,null,null,null,null,null,null,{"$f":"IF(ISNUMBER(FIND(\"x\",BD29)),IFERROR(INDEX(AH29:AP29,0,MATCH(AS29,AH29:AP29,0)),IF(AH29<>\"\",AH29,i_DefaultColour)),\"\")","v":""},null,null,{"$f":"IF(ISNUMBER(FIND(\"x\",BD29)),IFERROR(INDEX(AH29:AP29,0,MATCH(AS29,AH29:AP29,0)),AR29),\"\")","v":""},{"$f":"IF(ISNUMBER(FIND(\"x\",BD29)),IFERROR(INDEX(INDIRECT(\"T_FinishColour[ColourCode-\"&IF(ISNUMBER(FIND(\"xxx\",BD29)),\"xxx\",IF(ISNUMBER(FIND(\"xx\",BD29)),\"xx\",\"error\"))&AQ29&\"]\"),MATCH(AU29,T_FinishColour[Finish / Colour],0)),\"\"),\"\")","v":""},null,"HIDE",null,null,null,{"$f":"_xlfn.IFNA(SUBSTITUTE(IF(AQ29=\"AU\",SUBSTITUTE(BD29,\"xxx\",AV29),SUBSTITUTE(SUBSTITUTE(BD29,\"xx\",AV29),\"x\",\"\")),\"LLL\",\"580\"),BD29)","v":""},null,null,null,null,{"$f":"IF(ISBLANK(BL29),\"\",IF(OR(BL29=L_Units),\"Y\",\"N\"))","v":""},null,{"$f":"IFERROR(IF(BG29=\"Y\",((INDEX(T_Deduc[Deduction],MATCH(BH29,T_Deduc[Type],0),0))),\"\"),\"\")","v":""},null,{"$f":"IFERROR(IF(BG29=\"Y\",(INDIRECT(BJ29)-BI29)/IF(Z29=\"\",1,o_nScreens),\"\"),\"\")","v":""},null,{"$f":"IFERROR(IF(ISBLANK(BB29),\"\",INDEX(T_NAV[Base Unit of Measure],MATCH(BB29,T_NAV[No.],0))),\"\")","v":""},null,{"$f":"IF(ISBLANK(BN29),\"\",PRODUCT(AD29,BN29,ShadeQuantity))","v":""},{"$f":"IFERROR(INDEX(INDIRECT(\"T_NAV[\"&i_Location&\"]\"),MATCH(1,--(BB29=T_NAV[No.])*--((INDIRECT(\"T_NAV[\"&i_Location&\"]\"))<>\"\"),0))/IF(AND(BF29<>\"\",i_Units=\"Imperial\"),CONVERT(BF29,\"m\",\"in\"),IF(AND(i_Units=\"Imperial\",BM29=\"Metre\"),39.37,IF(BF29<>\"\",BF29,1))),\"\")","v":""},""]
[null,null,{"$f":"C31","v":"0"},null,null,null,null,null,null,null,null,null,null,null,null,null,null,null,null,null,null,null,null,null,null,null,null,null,null,"",null,null,null,null,null,null,null,null,null,null,null,null,null,"",null,null,"",{"$f":"IF(ISNUMBER(FIND(\"x\",BD30)),IFERROR(INDEX(INDIRECT(\"T_FinishColour[ColourCode-\"&IF(ISNUMBER(FIND(\"xxx\",BD30)),\"xxx\",IF(ISNUMBER(FIND(\"xx\",BD30)),\"xx\",\"error\"))&AQ30&\"]\"),MATCH(AU30,T_FinishColour[Finish / Colour],0)),\"\"),\"\")","v":""},null,"HIDE",null,null,null,"",null,null,null,null,{"$f":"IF(ISBLANK(BL30),\"\",IF(OR(BL30=L_Units),\"Y\",\"N\"))","v":""},null,{"$f":"IFERROR(IF(BG30=\"Y\",((INDEX(T_Deduc[Deduction],MATCH(BH30,T_Deduc[Type],0),0))),\"\"),\"\")","v":""},null,"",null,{"$f":"IFERROR(IF(ISBLANK(BB30),\"\",INDEX(T_NAV[Base Unit of Measure],MATCH(BB30,T_NAV[No.],0))),\"\")","v":""},null,"",{"$f":"IFERROR(INDEX(INDIRECT(\"T_NAV[\"&i_Location&\"]\"),MATCH(1,--(BB30=T_NAV[No.])*--((INDIRECT(\"T_NAV[\"&i_Location&\"]\"))<>\"\"),0))/IF(AND(BF30<>\"\",i_Units=\"Imperial\"),CONVERT(BF30,\"m\",\"in\"),IF(AND(i_Units=\"Imperial\",BM30=\"Metre\"),39.37,IF(BF30<>\"\",BF30,1))),\"\")","v":""},""]
[null,null,{"$f":"IF(INDIRECT($D$31)=$D$32,1,\"0\")","v":"0"},"i_InstallationType",null,"i_BracketOptions",null,"i_BracketCovers",null,"i_ControlType",null,null,null,null,null,null,null,null,null,null,null,null,null,null,null,null,null,null,null,"",null,null,null,null,null,null,null,null,null,null,null,null,null,"",null,null,"",{"$f":"IF(ISNUMBER(FIND(\"x\",BD31)),IFERROR(INDEX(INDIRECT(\"T_FinishColour[ColourCode-\"&IF(ISNUMBER(FIND(\"xxx\",BD31)),\"xxx\",IF(ISNUMBER(FIND(\"xx\",BD31)),\"xx\",\"error\"))&AQ31&\"]\"),MATCH(AU31,T_FinishColour[Finish / Colour],0)),\"\"),\"\")","v":""},null,"HIDE",null,null,null,"MOUNTING RAIL",null,"MOUNTING RAIL",null,null,null,null,{"$f":"IFERROR(IF(BG31=\"Y\",((INDEX(T_Deduc[Deduction],MATCH(BH31,T_Deduc[Type],0),0))),\"\"),\"\")","v":""},null,"",null,{"$f":"IFERROR(IF(ISBLANK(BB31),\"\",INDEX(T_NAV[Base Unit of Measure],MATCH(BB31,T_NAV[No.],0))),\"\")","v":""},null,"",{"$f":"IFERROR(INDEX(INDIRECT(\"T_NAV[\"&i_Location&\"]\"),MATCH(1,--(BB31=T_NAV[No.])*--((INDIRECT(\"T_NAV[\"&i_Location&\"]\"))<>\"\"),0))/IF(AND(BF31<>\"\",i_Units=\"Imperial\"),CONVERT(BF31,\"m\",\"in\"),IF(AND(i_Units=\"Imperial\",BM31=\"Metre\"),39.37,IF(BF31<>\"\",BF31,1))),\"\")","v":""},""]
[null,null,null,"Mounting Rail",{"$f":"IFERROR(IF(ISBLANK(D32),\"\",IF(FIND(D32,INDIRECT($D$75))>0,1,0)),0)","v":0},null,{"$f":"IFERROR(IF(ISBLANK(F32),\"\",IF(FIND(F32,INDIRECT($F$31))>0,1,0)),0)","v":""},null,{"$f":"IFERROR(IF(ISBLANK(H32),\"\",IF(FIND(H32,INDIRECT($J$31))>0,1,0)),0)","v":""},null,{"$f":"IFERROR(IF(ISBLANK(J32),\"\",IF(FIND(J32,INDIRECT($J$31))>0,1,0)),0)","v":""},null,null,null,null,null,null,null,null,null,null,null,null,null,null,"Y",null,null,null,"",null,null,null,"White","Anodised","Mill",null,null,null,null,null,null,"AU","",{"$f":"i_Colour","v":0},null,"",{"$f":"IF(ISNUMBER(FIND(\"x\",BD32)),IFERROR(INDEX(INDIRECT(\"T_FinishColour[ColourCode-\"&IF(ISNUMBER(FIND(\"xxx\",BD32)),\"xxx\",IF(ISNUMBER(FIND(\"xx\",BD32)),\"xx\",\"error\"))&AQ32&\"]\"),MATCH(AU32,T_FinishColour[Finish / Colour],0)),\"\"),\"\")","v":""},null,"HIDE",null,null,null,{"$f":"_xlfn.IFNA(SUBSTITUTE(IF(AQ32=\"AU\",SUBSTITUTE(BD32,\"xxx\",AV32),SUBSTITUTE(SUBSTITUTE(BD32,\"xx\",AV32),\"x\",\"\")),\"LLL\",BF32*100),BD32)","v":"RB88-2051-069480"},null,"RB88-2051-069LLL","MKII Mounting Rail | Base 50 VX/LX",{"$f":"IF(OR(i_Location=\"AU\",i_Location=\"EU\"),5.8,4.8)","v":4.8},{"$f":"IF(ISBLANK(BL32),\"\",IF(OR(BL32=L_Units),\"Y\",\"N\"))","v":{"$error":"#N/A"}},"Mounting Rail",{"$f":"IFERROR(IF(BG32=\"Y\",((INDEX(T_Deduc[Deduction],MATCH(BH32,T_Deduc[Type],0),0))),\"\"),\"\")","v":""},"i_Width",{"$f":"IFERROR(IF(BG32=\"Y\",(INDIRECT(BJ32)-BI32)/IF(Z32=\"\",1,o_nScreens),\"\"),\"\")","v":""},{"$f":"INDEX(T_UnitSelection[Units],MATCH(i_Units,T_UnitSelection[UnitSelection],0))","v":{"$error":"#N/A"}},{"$f":"IFERROR(IF(ISBLANK(BB32),\"\",INDEX(T_NAV[Base Unit of Measure],MATCH(BB32,T_NAV[No.],0))),\"\")","v":""},1,1,{"$f":"IFERROR(INDEX(INDIRECT(\"T_NAV[\"&i_Location&\"]\"),MATCH(1,--(BB32=T_NAV[No.])*--((INDIRECT(\"T_NAV[\"&i_Location&\"]\"))<>\"\"),0))/IF(AND(BF32<>\"\",i_Units=\"Imperial\"),CONVERT(BF32,\"m\",\"in\"),IF(AND(i_Units=\"Imperial\",BM32=\"Metre\"),39.37,IF(BF32<>\"\",BF32,1))),\"\")","v":""},""]
[null,null,null,"Mounting Rail",0,"LX Limiter Bracket Set",{"$f":"IFERROR(IF(ISBLANK(F33),\"\",IF(FIND(F33,INDIRECT($F$31))>0,1,0)),0)","v":0},null,"",null,"",null,null,null,null,null,null,null,null,null,null,null,null,null,null,null,null,null,null,"",null,null,null,"White","Silver Grey",null,null,null,null,null,null,null,"AU","",{"$f":"i_Colour","v":0},null,"",{"$f":"IF(ISNUMBER(FIND(\"x\",BD33)),IFERROR(INDEX(INDIRECT(\"T_FinishColour[ColourCode-\"&IF(ISNUMBER(FIND(\"xxx\",BD33)),\"xxx\",IF(ISNUMBER(FIND(\"xx\",BD33)),\"xx\",\"error\"))&AQ33&\"]\"),MATCH(AU33,T_FinishColour[Finish / Colour],0)),\"\"),\"\")","v":""},null,"HIDE",null,null,null,{"$f":"_xlfn.IFNA(SUBSTITUTE(IF(AQ33=\"AU\",SUBSTITUTE(BD33,\"xxx\",AV33),SUBSTITUTE(SUBSTITUTE(BD33,\"xx\",AV33),\"x\",\"\")),\"LLL\",\"580\"),BD33)","v":"RB12-2503-069140"},null,"RB12-2503-069140","LX Skyline & RB12 Control bracket set | 40mm",null,{"$f":"IF(ISBLANK(BL33),\"\",IF(OR(BL33=L_Units),\"Y\",\"N\"))","v":"N"},null,{"$f":"IFERROR(IF(BG33=\"Y\",((INDEX(T_Deduc[Deduction],MATCH(BH33,T_Deduc[Type],0),0))),\"\"),\"\")","v":""},null,"","Set",{"$f":"IFERROR(IF(ISBLANK(BB33),\"\",INDEX(T_NAV[Base Unit of Measure],MATCH(BB33,T_NAV[No.],0))),\"\")","v":"SET"},1,1,{"$f":"IFERROR(INDEX(INDIRECT(\"T_NAV[\"&i_Location&\"]\"),MATCH(1,--(BB33=T_NAV[No.])*--((INDIRECT(\"T_NAV[\"&i_Location&\"]\"))<>\"\"),0))/IF(AND(BF33<>\"\",i_Units=\"Imperial\"),CONVERT(BF33,\"m\",\"in\"),IF(AND(i_Units=\"Imperial\",BM33=\"Metre\"),39.37,IF(BF33<>\"\",BF33,1))),\"\")","v":""},""]
[null,null,null,"Mounting Rail",0,"LX Skyline Bracket | 40mm Pitch",{"$f":"IFERROR(IF(ISBLANK(F34),\"\",IF(FIND(F34,INDIRECT($F$31))>0,1,0)),0)","v":0},null,"",null,{"$f":"IFERROR(IF(ISBLANK(J34),\"\",IF(FIND(J34,INDIRECT($J$31))>0,1,0)),0)","v":""},null,null,null,null,null,null,null,null,null,null,null,null,null,null,null,null,null,null,"",null,null,null,"White","Silver Grey",null,null,null,null,null,null,null,"AU","White",{"$f":"i_Colour","v":0},null,"White",{"$f":"IF(ISNUMBER(FIND(\"x\",BD34)),IFERROR(INDEX(INDIRECT(\"T_FinishColour[ColourCode-\"&IF(ISNUMBER(FIND(\"xxx\",BD34)),\"xxx\",IF(ISNUMBER(FIND(\"xx\",BD34)),\"xx\",\"error\"))&AQ34&\"]\"),MATCH(AU34,T_FinishColour[Finish / Colour],0)),\"\"),\"\")","v":"069"},null,"HIDE",null,null,null,"SL01-0306-069040",null,"SL01-0306-xxx040","LX Skyline Bracket | 40mm Projection",null,{"$f":"IF(ISBLANK(BL34),\"\",IF(OR(BL34=L_Units),\"Y\",\"N\"))","v":"N"},null,{"$f":"IFERROR(IF(BG34=\"Y\",((INDEX(T_Deduc[Deduction],MATCH(BH34,T_Deduc[Type],0),0))),\"\"),\"\")","v":""},null,"","Piece",{"$f":"IFERROR(IF(ISBLANK(BB34),\"\",INDEX(T_NAV[Base Unit of Measure],MATCH(BB34,T_NAV[No.],0))),\"\")","v":"PIECE"},2,2,{"$f":"IFERROR(INDEX(INDIRECT(\"T_NAV[\"&i_Location&\"]\"),MATCH(1,--(BB34=T_NAV[No.])*--((INDIRECT(\"T_NAV[\"&i_Location&\"]\"))<>\"\"),0))/IF(AND(BF34<>\"\",i_Units=\"Imperial\"),CONVERT(BF34,\"m\",\"in\"),IF(AND(i_Units=\"Imperial\",BM34=\"Metre\"),39.37,IF(BF34<>\"\",BF34,1))),\"\")","v":""},""]
[null,null,null,"Mounting Rail",0,"LX Skyline Bracket | 55mm Pitch",0,null,"",null,{"$f":"IFERROR(IF(ISBLANK(J35),\"\",IF(FIND(J35,INDIRECT($J$31))>0,1,0)),0)","v":""},null,null,null,null,null,null,null,null,null,null,null,null,null,null,null,null,null,null,{"$f":"IFERROR(IF(AND(o_nScreens>1,Z35=\"Y\",PRODUCT(AA35:AC35)=0),o_nScreens,IF(PRODUCT(AA35:AC35)=0,\"\",PRODUCT(AA35:AC35))),\"\")","v":""},null,null,null,"White","Silver Grey",null,null,null,null,null,null,null,"AU",{"$f":"IF(ISNUMBER(FIND(\"x\",BD35)),IFERROR(INDEX(AH35:AP35,0,MATCH(AS35,AH35:AP35,0)),IF(AH35<>\"\",AH35,i_DefaultColour)),\"\")","v":"White"},{"$f":"i_Colour","v":0},null,{"$f":"IF(ISNUMBER(FIND(\"x\",BD35)),IFERROR(INDEX(AH35:AP35,0,MATCH(AS35,AH35:AP35,0)),AR35),\"\")","v":"White"},{"$f":"IF(ISNUMBER(FIND(\"x\",BD35)),IFERROR(INDEX(INDIRECT(\"T_FinishColour[ColourCode-\"&IF(ISNUMBER(FIND(\"xxx\",BD35)),\"xxx\",IF(ISNUMBER(FIND(\"xx\",BD35)),\"xx\",\"error\"))&AQ35&\"]\"),MATCH(AU35,T_FinishColour[Finish / Colour],0)),\"\"),\"\")","v":"069"},null,"HIDE",null,null,null,{"$f":"_xlfn.IFNA(SUBSTITUTE(IF(AQ35=\"AU\",SUBSTITUTE(BD35,\"xxx\",AV35),SUBSTITUTE(SUBSTITUTE(BD35,\"xx\",AV35),\"x\",\"\")),\"LLL\",\"580\"),BD35)","v":"SL01-0306-069055"},null,"SL01-0306-xxx055","LX Skyline Bracket | 55mm Projection",null,{"$f":"IF(ISBLANK(BL35),\"\",IF(OR(BL35=L_Units),\"Y\",\"N\"))","v":"N"},null,{"$f":"IFERROR(IF(BG35=\"Y\",((INDEX(T_Deduc[Deduction],MATCH(BH35,T_Deduc[Type],0),0))),\"\"),\"\")","v":""},null,{"$f":"IFERROR(IF(BG35=\"Y\",(INDIRECT(BJ35)-BI35)/IF(Z35=\"\",1,o_nScreens),\"\"),\"\")","v":""},"Piece",{"$f":"IFERROR(IF(ISBLANK(BB35),\"\",INDEX(T_NAV[Base Unit of Measure],MATCH(BB35,T_NAV[No.],0))),\"\")","v":"PIECE"},2,{"$f":"IF(ISBLANK(BN35),\"\",PRODUCT(AD35,BN35,ShadeQuantity))","v":2},{"$f":"IFERROR(INDEX(INDIRECT(\"T_NAV[\"&i_Location&\"]\"),MATCH(1,--(BB35=T_NAV[No.])*--((INDIRECT(\"T_NAV[\"&i_Location&\"]\"))<>\"\"),0))/IF(AND(BF35<>\"\",i_Units=\"Imperial\"),CONVERT(BF35,\"m\",\"in\"),IF(AND(i_Units=\"Imperial\",BM35=\"Metre\"),39.37,IF(BF35<>\"\",BF35,1))),\"\")","v":""},""]
[null,null,null,"Mounting Rail",0,"Easy-Lock",0,null,"",null,"",null,null,null,null,null,null,null,null,null,null,null,null,null,null,null,null,null,null,"",null,null,null,null,null,null,null,null,null,null,null,null,"AU","White",{"$f":"i_Colour","v":0},null,"White",{"$f":"IF(ISNUMBER(FIND(\"x\",BD36)),IFERROR(INDEX(INDIRECT(\"T_FinishColour[ColourCode-\"&IF(ISNUMBER(FIND(\"xxx\",BD36)),\"xxx\",IF(ISNUMBER(FIND(\"xx\",BD36)),\"xx\",\"error\"))&AQ36&\"]\"),MATCH(AU36,T_FinishColour[Finish / Colour],0)),\"\"),\"\")","v":"069"},null,"HIDE",null,null,null,"RB09-0352-069040",null,"RB09-0352-xxx040","Easy-Lock LX Installation Bracket",null,{"$f":"IF(ISBLANK(BL36),\"\",IF(OR(BL36=L_Units),\"Y\",\"N\"))","v":"N"},null,{"$f":"IFERROR(IF(BG36=\"Y\",((INDEX(T_Deduc[Deduction],MATCH(BH36,T_Deduc[Type],0),0))),\"\"),\"\")","v":""},null,"","Set",{"$f":"IFERROR(IF(ISBLANK(BB36),\"\",INDEX(T_NAV[Base Unit of Measure],MATCH(BB36,T_NAV[No.],0))),\"\")","v":"PAIR"},1,1,{"$f":"IFERROR(INDEX(INDIRECT(\"T_NAV[\"&i_Location&\"]\"),MATCH(1,--(BB36=T_NAV[No.])*--((INDIRECT(\"T_NAV[\"&i_Location&\"]\"))<>\"\"),0))/IF(AND(BF36<>\"\",i_Units=\"Imperial\"),CONVERT(BF36,\"m\",\"in\"),IF(AND(i_Units=\"Imperial\",BM36=\"Metre\"),39.37,IF(BF36<>\"\",BF36,1))),\"\")","v":""},""]
[null,null,null,"Mounting Rail",0,null,"","Yes",{"$f":"IFERROR(IF(ISBLANK(H37),\"\",IF(FIND(H37,INDIRECT($J$31))>0,1,0)),0)","v":0},null,"",null,null,null,null,null,null,null,null,null,null,null,null,null,null,null,null,null,null,"",null,null,null,null,null,null,null,null,null,null,null,null,"AU","White",null,null,"White",{"$f":"IF(ISNUMBER(FIND(\"x\",BD37)),IFERROR(INDEX(INDIRECT(\"T_FinishColour[ColourCode-\"&IF(ISNUMBER(FIND(\"xxx\",BD37)),\"xxx\",IF(ISNUMBER(FIND(\"xx\",BD37)),\"xx\",\"error\"))&AQ37&\"]\"),MATCH(AU37,T_FinishColour[Finish / Colour],0)),\"\"),\"\")","v":"069"},null,"HIDE",null,null,null,"RB88-4151-069040",null,"RB88-4151-xxx040","VX/LX Bracket Cover Caps - MKII Mounting Rail Base 50 | 40mm",null,{"$f":"IF(ISBLANK(BL37),\"\",IF(OR(BL37=L_Units),\"Y\",\"N\"))","v":"N"},null,{"$f":"IFERROR(IF(BG37=\"Y\",((INDEX(T_Deduc[Deduction],MATCH(BH37,T_Deduc[Type],0),0))),\"\"),\"\")","v":""},null,"","Set",{"$f":"IFERROR(IF(ISBLANK(BB37),\"\",INDEX(T_NAV[Base Unit of Measure],MATCH(BB37,T_NAV[No.],0))),\"\")","v":"PAIR"},1,1,{"$f":"IFERROR(INDEX(INDIRECT(\"T_NAV[\"&i_Location&\"]\"),MATCH(1,--(BB37=T_NAV[No.])*--((INDIRECT(\"T_NAV[\"&i_Location&\"]\"))<>\"\"),0))/IF(AND(BF37<>\"\",i_Units=\"Imperial\"),CONVERT(BF37,\"m\",\"in\"),IF(AND(i_Units=\"Imperial\",BM37=\"Metre\"),39.37,IF(BF37<>\"\",BF37,1))),\"\")","v":""},""]
[null,null,null,"Mounting Rail",0,null,"","Yes",0,null,"",null,null,null,null,null,null,null,null,null,null,null,null,null,null,null,null,null,null,{"$f":"IFERROR(IF(AND(o_nScreens>1,Z38=\"Y\",PRODUCT(AA38:AC38)=0),o_nScreens,IF(PRODUCT(AA38:AC38)=0,\"\",PRODUCT(AA38:AC38))),\"\")","v":""},null,null,null,null,null,null,null,null,null,null,null,null,"AU",{"$f":"IF(ISNUMBER(FIND(\"x\",BD38)),IFERROR(INDEX(AH38:AP38,0,MATCH(AS38,AH38:AP38,0)),IF(AH38<>\"\",AH38,i_DefaultColour)),\"\")","v":"White"},null,null,{"$f":"IF(ISNUMBER(FIND(\"x\",BD38)),IFERROR(INDEX(AH38:AP38,0,MATCH(AS38,AH38:AP38,0)),AR38),\"\")","v":"White"},{"$f":"IF(ISNUMBER(FIND(\"x\",BD38)),IFERROR(INDEX(INDIRECT(\"T_FinishColour[ColourCode-\"&IF(ISNUMBER(FIND(\"xxx\",BD38)),\"xxx\",IF(ISNUMBER(FIND(\"xx\",BD38)),\"xx\",\"error\"))&AQ38&\"]\"),MATCH(AU38,T_FinishColour[Finish / Colour],0)),\"\"),\"\")","v":"069"},null,"HIDE",null,null,null,{"$f":"_xlfn.IFNA(SUBSTITUTE(IF(AQ38=\"AU\",SUBSTITUTE(BD38,\"xxx\",AV38),SUBSTITUTE(SUBSTITUTE(BD38,\"xx\",AV38),\"x\",\"\")),\"LLL\",\"580\"),BD38)","v":"RB88-4151-069055"},null,"RB88-4151-xxx055","VX/LX Bracket Cover Caps - MKII Mounting Rail Base 50 | 55mm",null,{"$f":"IF(ISBLANK(BL38),\"\",IF(OR(BL38=L_Units),\"Y\",\"N\"))","v":"N"},null,{"$f":"IFERROR(IF(BG38=\"Y\",((INDEX(T_Deduc[Deduction],MATCH(BH38,T_Deduc[Type],0),0))),\"\"),\"\")","v":""},null,{"$f":"IFERROR(IF(BG38=\"Y\",(INDIRECT(BJ38)-BI38)/IF(Z38=\"\",1,o_nScreens),\"\"),\"\")","v":""},"Set",{"$f":"IFERROR(IF(ISBLANK(BB38),\"\",INDEX(T_NAV[Base Unit of Measure],MATCH(BB38,T_NAV[No.],0))),\"\")","v":"PAIR"},1,{"$f":"IF(ISBLANK(BN38),\"\",PRODUCT(AD38,BN38,ShadeQuantity))","v":1},{"$f":"IFERROR(INDEX(INDIRECT(\"T_NAV[\"&i_Location&\"]\"),MATCH(1,--(BB38=T_NAV[No.])*--((INDIRECT(\"T_NAV[\"&i_Location&\"]\"))<>\"\"),0))/IF(AND(BF38<>\"\",i_Units=\"Imperial\"),CONVERT(BF38,\"m\",\"in\"),IF(AND(i_Units=\"Imperial\",BM38=\"Metre\"),39.37,IF(BF38<>\"\",BF38,1))),\"\")","v":""},""]
[null,null,null,"Mounting Rail",0,null,null,null,"",null,"",null,null,null,null,null,null,null,null,null,null,null,null,null,null,"Y",{"$f":"ROUNDUP(metric_width/600,0)+1","v":1},null,null,1,"600 MAX",null,null,null,null,null,null,null,null,null,null,null,"AU","",{"$f":"i_Colour","v":0},null,"",{"$f":"IF(ISNUMBER(FIND(\"x\",BD39)),IFERROR(INDEX(INDIRECT(\"T_FinishColour[ColourCode-\"&IF(ISNUMBER(FIND(\"xxx\",BD39)),\"xxx\",IF(ISNUMBER(FIND(\"xx\",BD39)),\"xx\",\"error\"))&AQ39&\"]\"),MATCH(AU39,T_FinishColour[Finish / Colour],0)),\"\"),\"\")","v":""},null,"HIDE",null,null,null,"RB88-2092-069001",null,"RB88-2092-069001","Mounting Rail - Slimline Spring Clip Bracket",null,{"$f":"IF(ISBLANK(BL39),\"\",IF(OR(BL39=L_Units),\"Y\",\"N\"))","v":"N"},null,{"$f":"IFERROR(IF(BG39=\"Y\",((INDEX(T_Deduc[Deduction],MATCH(BH39,T_Deduc[Type],0),0))),\"\"),\"\")","v":""},null,"","Piece",{"$f":"IFERROR(IF(ISBLANK(BB39),\"\",INDEX(T_NAV[Base Unit of Measure],MATCH(BB39,T_NAV[No.],0))),\"\")","v":"PIECE"},1,1,{"$f":"IFERROR(INDEX(INDIRECT(\"T_NAV[\"&i_Location&\"]\"),MATCH(1,--(BB39=T_NAV[No.])*--((INDIRECT(\"T_NAV[\"&i_Location&\"]\"))<>\"\"),0))/IF(AND(BF39<>\"\",i_Units=\"Imperial\"),CONVERT(BF39,\"m\",\"in\"),IF(AND(i_Units=\"Imperial\",BM39=\"Metre\"),39.37,IF(BF39<>\"\",BF39,1))),\"\")","v":""},""]
[null,null,null,"Mounting Rail",0,null,null,null,"",null,"",null,null,null,null,null,null,null,null,null,null,null,null,null,null,null,null,{"$f":"o_nScreens+1","v":2},null,2,null,null,null,null,null,null,null,null,null,null,null,null,null,"",null,null,"",{"$f":"IF(ISNUMBER(FIND(\"x\",BD40)),IFERROR(INDEX(INDIRECT(\"T_FinishColour[ColourCode-\"&IF(ISNUMBER(FIND(\"xxx\",BD40)),\"xxx\",IF(ISNUMBER(FIND(\"xx\",BD40)),\"xx\",\"error\"))&AQ40&\"]\"),MATCH(AU40,T_FinishColour[Finish / Colour],0)),\"\"),\"\")","v":""},null,"HIDE",null,null,null,"HD82-1904-025010",null,"HD82-1904-025010","Screw - Self Tapper, C/Sunk Head, #4 x 3/8",null,{"$f":"IF(ISBLANK(BL40),\"\",IF(OR(BL40=L_Units),\"Y\",\"N\"))","v":"N"},null,{"$f":"IFERROR(IF(BG40=\"Y\",((INDEX(T_Deduc[Deduction],MATCH(BH40,T_Deduc[Type],0),0))),\"\"),\"\")","v":""},null,"","Piece",{"$f":"IFERROR(IF(ISBLANK(BB40),\"\",INDEX(T_NAV[Base Unit of Measure],MATCH(BB40,T_NAV[No.],0))),\"\")","v":"PIECE"},2,4,{"$f":"IFERROR(INDEX(INDIRECT(\"T_NAV[\"&i_Location&\"]\"),MATCH(1,--(BB40=T_NAV[No.])*--((INDIRECT(\"T_NAV[\"&i_Location&\"]\"))<>\"\"),0))/IF(AND(BF40<>\"\",i_Units=\"Imperial\"),CONVERT(BF40,\"m\",\"in\"),IF(AND(i_Units=\"Imperial\",BM40=\"Metre\"),39.37,IF(BF40<>\"\",BF40,1))),\"\")","v":""},""]
[null,null,null,null,null,null,null,null,null,null,null,null,null,null,null,null,null,null,null,null,null,null,null,null,null,null,null,null,null,"",null,null,null,null,null,null,null,null,null,null,null,null,null,"",null,null,"",{"$f":"IF(ISNUMBER(FIND(\"x\",BD41)),IFERROR(INDEX(INDIRECT(\"T_FinishColour[ColourCode-\"&IF(ISNUMBER(FIND(\"xxx\",BD41)),\"xxx\",IF(ISNUMBER(FIND(\"xx\",BD41)),\"xx\",\"error\"))&AQ41&\"]\"),MATCH(AU41,T_FinishColour[Finish / Colour],0)),\"\"),\"\")","v":""},null,"HIDE",null,null,null,"",null,null,null,null,{"$f":"IF(ISBLANK(BL41),\"\",IF(OR(BL41=L_Units),\"Y\",\"N\"))","v":""},null,{"$f":"IFERROR(IF(BG41=\"Y\",((INDEX(T_Deduc[Deduction],MATCH(BH41,T_Deduc[Type],0),0))),\"\"),\"\")","v":""},null,"",null,{"$f":"IFERROR(IF(ISBLANK(BB41),\"\",INDEX(T_NAV[Base Unit of Measure],MATCH(BB41,T_NAV[No.],0))),\"\")","v":""},null,"",{"$f":"IFERROR(INDEX(INDIRECT(\"T_NAV[\"&i_Location&\"]\"),MATCH(1,--(BB41=T_NAV[No.])*--((INDIRECT(\"T_NAV[\"&i_Location&\"]\"))<>\"\"),0))/IF(AND(BF41<>\"\",i_Units=\"Imperial\"),CONVERT(BF41,\"m\",\"in\"),IF(AND(i_Units=\"Imperial\",BM41=\"Metre\"),39.37,IF(BF41<>\"\",BF41,1))),\"\")","v":""},""]
[null,null,null,null,null,null,null,null,null,null,null,null,null,null,null,null,null,null,null,null,null,null,null,null,null,null,null,null,null,"",null,null,null,null,null,null,null,null,null,null,null,null,null,"",null,null,"",{"$f":"IF(ISNUMBER(FIND(\"x\",BD42)),IFERROR(INDEX(INDIRECT(\"T_FinishColour[ColourCode-\"&IF(ISNUMBER(FIND(\"xxx\",BD42)),\"xxx\",IF(ISNUMBER(FIND(\"xx\",BD42)),\"xx\",\"error\"))&AQ42&\"]\"),MATCH(AU42,T_FinishColour[Finish / Colour],0)),\"\"),\"\")","v":""},null,{"$f":"IF(AND(ISBLANK(BD42),ISBLANK(C42)),\"HIDE\",IF(PRODUCT(C42:Y42)=1,\"SHOW\",\"HIDE\"))","v":"HIDE"},null,null,null,"",null,null,null,null,{"$f":"IF(ISBLANK(BL42),\"\",IF(OR(BL42=L_Units),\"Y\",\"N\"))","v":""},null,{"$f":"IFERROR(IF(BG42=\"Y\",((INDEX(T_Deduc[Deduction],MATCH(BH42,T_Deduc[Type],0),0))),\"\"),\"\")","v":""},null,"",null,{"$f":"IFERROR(IF(ISBLANK(BB42),\"\",INDEX(T_NAV[Base Unit of Measure],MATCH(BB42,T_NAV[No.],0))),\"\")","v":""},null,"",{"$f":"IFERROR(INDEX(INDIRECT(\"T_NAV[\"&i_Location&\"]\"),MATCH(1,--(BB42=T_NAV[No.])*--((INDIRECT(\"T_NAV[\"&i_Location&\"]\"))<>\"\"),0))/IF(AND(BF42<>\"\",i_Units=\"Imperial\"),CONVERT(BF42,\"m\",\"in\"),IF(AND(i_Units=\"Imperial\",BM42=\"Metre\"),39.37,IF(BF42<>\"\",BF42,1))),\"\")","v":""},""]
[null,null,{"$f":"C44","v":0},null,null,null,null,null,null,null,null,null,null,null,null,null,null,null,null,null,null,null,null,null,null,null,null,null,null,{"$f":"IFERROR(IF(AND(o_nScreens>1,Z43=\"Y\",PRODUCT(AA43:AC43)=0),o_nScreens,IF(PRODUCT(AA43:AC43)=0,\"\",PRODUCT(AA43:AC43))),\"\")","v":""},null,null,null,null,null,null,null,null,null,null,null,null,null,{"$f":"IF(ISNUMBER(FIND(\"x\",BD43)),IFERROR(INDEX(AH43:AP43,0,MATCH(AS43,AH43:AP43,0)),IF(AH43<>\"\",AH43,i_DefaultColour)),\"\")","v":""},null,null,{"$f":"IF(ISNUMBER(FIND(\"x\",BD43)),IFERROR(INDEX(AH43:AP43,0,MATCH(AS43,AH43:AP43,0)),AR43),\"\")","v":""},{"$f":"IF(ISNUMBER(FIND(\"x\",BD43)),IFERROR(INDEX(INDIRECT(\"T_FinishColour[ColourCode-\"&IF(ISNUMBER(FIND(\"xxx\",BD43)),\"xxx\",IF(ISNUMBER(FIND(\"xx\",BD43)),\"xx\",\"error\"))&AQ43&\"]\"),MATCH(AU43,T_FinishColour[Finish / Colour],0)),\"\"),\"\")","v":""},null,"HIDE",null,null,null,{"$f":"_xlfn.IFNA(SUBSTITUTE(IF(AQ43=\"AU\",SUBSTITUTE(BD43,\"xxx\",AV43),SUBSTITUTE(SUBSTITUTE(BD43,\"xx\",AV43),\"x\",\"\")),\"LLL\",\"580\"),BD43)","v":""},null,null,null,null,{"$f":"IF(ISBLANK(BL43),\"\",IF(OR(BL43=L_Units),\"Y\",\"N\"))","v":""},null,{"$f":"IFERROR(IF(BG43=\"Y\",((INDEX(T_Deduc[Deduction],MATCH(BH43,T_Deduc[Type],0),0))),\"\"),\"\")","v":""},null,{"$f":"IFERROR(IF(BG43=\"Y\",(INDIRECT(BJ43)-BI43)/IF(Z43=\"\",1,o_nScreens),\"\"),\"\")","v":""},null,{"$f":"IFERROR(IF(ISBLANK(BB43),\"\",INDEX(T_NAV[Base Unit of Measure],MATCH(BB43,T_NAV[No.],0))),\"\")","v":""},null,{"$f":"IF(ISBLANK(BN43),\"\",PRODUCT(AD43,BN43,ShadeQuantity))","v":""},{"$f":"IFERROR(INDEX(INDIRECT(\"T_NAV[\"&i_Location&\"]\"),MATCH(1,--(BB43=T_NAV[No.])*--((INDIRECT(\"T_NAV[\"&i_Location&\"]\"))<>\"\"),0))/IF(AND(BF43<>\"\",i_Units=\"Imperial\"),CONVERT(BF43,\"m\",\"in\"),IF(AND(i_Units=\"Imperial\",BM43=\"Metre\"),39.37,IF(BF43<>\"\",BF43,1))),\"\")","v":""},""]
[null,null,{"$f":"IFERROR(IF(FIND(D45,INDIRECT($D$44))>0,1,0),0)","v":0},"i_InstallationType",null,"i_BracketOptions",null,"i_BracketCovers",null,null,null,null,null,null,null,null,null,null,null,null,null,null,null,null,null,null,null,null,null,"",null,null,null,null,null,null,null,null,null,null,null,null,null,"",null,null,"",{"$f":"IF(ISNUMBER(FIND(\"x\",BD44)),IFERROR(INDEX(INDIRECT(\"T_FinishColour[ColourCode-\"&IF(ISNUMBER(FIND(\"xxx\",BD44)),\"xxx\",IF(ISNUMBER(FIND(\"xx\",BD44)),\"xx\",\"error\"))&AQ44&\"]\"),MATCH(AU44,T_FinishColour[Finish / Colour],0)),\"\"),\"\")","v":""},null,"HIDE",null,null,null,"SKYLINE FASCIA",null,"SKYLINE FASCIA",null,null,null,null,{"$f":"IFERROR(IF(BG44=\"Y\",((INDEX(T_Deduc[Deduction],MATCH(BH44,T_Deduc[Type],0),0))),\"\"),\"\")","v":""},null,"",null,{"$f":"IFERROR(IF(ISBLANK(BB44),\"\",INDEX(T_NAV[Base Unit of Measure],MATCH(BB44,T_NAV[No.],0))),\"\")","v":""},null,"",{"$f":"IFERROR(INDEX(INDIRECT(\"T_NAV[\"&i_Location&\"]\"),MATCH(1,--(BB44=T_NAV[No.])*--((INDIRECT(\"T_NAV[\"&i_Location&\"]\"))<>\"\"),0))/IF(AND(BF44<>\"\",i_Units=\"Imperial\"),CONVERT(BF44,\"m\",\"in\"),IF(AND(i_Units=\"Imperial\",BM44=\"Metre\"),39.37,IF(BF44<>\"\",BF44,1))),\"\")","v":""},""]
[null,null,null,"Skyline Fascia",{"$f":"IFERROR(IF(ISBLANK(D45),\"\",IF(FIND(D45,INDIRECT($D$44))>0,1,0)),0)","v":0},"Skyline 3\"",{"$f":"IFERROR(IF(ISBLANK(F45),\"\",IF(FIND(F45,INDIRECT($H$44))>0,1,0)),0)","v":0},null,{"$f":"IFERROR(IF(ISBLANK(H45),\"\",IF(FIND(H45,INDIRECT($J$75))>0,1,0)),0)","v":""},null,{"$f":"IFERROR(IF(INDIRECT($J$55)=J45,1,IF(ISBLANK(J45),\"\",0)),\"\")","v":1},null,null,null,null,null,{"$f":"IFERROR(IF(INDIRECT($H$55)=#REF!,1,IF(ISBLANK(#REF!),\"\",0)),\"\")","v":""},null,null,null,null,null,{"$f":"IFERROR(IF(INDIRECT($H$55)=#REF!,1,IF(ISBLANK(#REF!),\"\",0)),\"\")","v":""},null,null,null,null,null,null,"",null,null,null,"White","Anodised","Vanilla","Bronze","Black",null,null,null,null,"US","White",{"$f":"i_Colour","v":0},null,"White",{"$f":"IF(ISNUMBER(FIND(\"x\",BD45)),IFERROR(INDEX(INDIRECT(\"T_FinishColour[ColourCode-\"&IF(ISNUMBER(FIND(\"xxx\",BD45)),\"xxx\",IF(ISNUMBER(FIND(\"xx\",BD45)),\"xx\",\"error\"))&AQ45&\"]\"),MATCH(AU45,T_FinishColour[Finish / Colour],0)),\"\"),\"\")","v":"W"},null,"HIDE",null,null,null,"SLSFW16",null,"SLSFxx16","Skyline Square Fascia 3\"",null,{"$f":"IF(ISBLANK(BL45),\"\",IF(OR(BL45=L_Units),\"Y\",\"N\"))","v":{"$error":"#N/A"}},"Cassette",{"$f":"IFERROR(IF(BG45=\"Y\",((INDEX(T_Deduc[Deduction],MATCH(BH45,T_Deduc[Type],0),0))),\"\"),\"\")","v":""},"i_Width","",{"$f":"INDEX(T_UnitSelection[Units],MATCH(i_Units,T_UnitSelection[UnitSelection],0))","v":{"$error":"#N/A"}},{"$f":"IFERROR(IF(ISBLANK(BB45),\"\",INDEX(T_NAV[Base Unit of Measure],MATCH(BB45,T_NAV[No.],0))),\"\")","v":"LENGTH"},1,1,{"$f":"IFERROR(INDEX(INDIRECT(\"T_NAV[\"&i_Location&\"]\"),MATCH(1,--(BB45=T_NAV[No.])*--((INDIRECT(\"T_NAV[\"&i_Location&\"]\"))<>\"\"),0))/IF(AND(BF45<>\"\",i_Units=\"Imperial\"),CONVERT(BF45,\"m\",\"in\"),IF(AND(i_Units=\"Imperial\",BM45=\"Metre\"),39.37,IF(BF45<>\"\",BF45,1))),\"\")","v":""},""]
[null,null,null,"Skyline Fascia",0,"Skyline 3\"",0,null,null,null,1,null,null,null,null,null,{"$f":"IFERROR(IF(INDIRECT($H$55)=#REF!,1,IF(ISBLANK(#REF!),\"\",0)),\"\")","v":""},null,null,null,null,null,{"$f":"IFERROR(IF(INDIRECT($H$55)=#REF!,1,IF(ISBLANK(#REF!),\"\",0)),\"\")","v":""},null,null,null,{"$f":"ROUNDUP(metric_width/600,0)+1","v":1},null,null,null,"600 MAX",null,null,"Zinc Plated","Exterior","White","Vanilla","Brown","Black",null,null,null,"US","Zinc Plated",0,null,"Zinc Plated","W",null,"HIDE",null,null,null,"SLFBKT3W",null,"SLFBKT3xx","Skyline Fascia Bracket 3\"",null,{"$f":"IF(ISBLANK(BL46),\"\",IF(OR(BL46=L_Units),\"Y\",\"N\"))","v":"N"},null,{"$f":"IFERROR(IF(BG46=\"Y\",((INDEX(T_Deduc[Deduction],MATCH(BH46,T_Deduc[Type],0),0))),\"\"),\"\")","v":""},null,"","Set",{"$f":"IFERROR(IF(ISBLANK(BB46),\"\",INDEX(T_NAV[Base Unit of Measure],MATCH(BB46,T_NAV[No.],0))),\"\")","v":"PAIR"},1,{"$f":"IF(ISBLANK(BN46),\"\",PRODUCT(AD46,BN46,ShadeQuantity))","v":1},{"$f":"IFERROR(INDEX(INDIRECT(\"T_NAV[\"&i_Location&\"]\"),MATCH(1,--(BB46=T_NAV[No.])*--((INDIRECT(\"T_NAV[\"&i_Location&\"]\"))<>\"\"),0))/IF(AND(BF46<>\"\",i_Units=\"Imperial\"),CONVERT(BF46,\"m\",\"in\"),IF(AND(i_Units=\"Imperial\",BM46=\"Metre\"),39.37,IF(BF46<>\"\",BF46,1))),\"\")","v":""},""]
[null,null,null,"Skyline Fascia",{"$f":"IFERROR(IF(ISBLANK(D47),\"\",IF(FIND(D47,INDIRECT($D$44))>0,1,0)),0)","v":0},"Skyline 3\"",{"$f":"IFERROR(IF(ISBLANK(F47),\"\",IF(FIND(F47,INDIRECT($H$44))>0,1,0)),0)","v":0},null,null,null,1,null,null,null,null,null,{"$f":"IFERROR(IF(INDIRECT($H$55)=#REF!,1,IF(ISBLANK(#REF!),\"\",0)),\"\")","v":""},null,null,null,null,null,{"$f":"IFERROR(IF(INDIRECT($H$55)=#REF!,1,IF(ISBLANK(#REF!),\"\",0)),\"\")","v":""},null,null,null,null,null,null,"",null,null,null,"White","Vanilla","Gray","Bronze","Black",null,null,null,null,"US","White",0,null,"White",{"$f":"IF(ISNUMBER(FIND(\"x\",BD47)),IFERROR(INDEX(INDIRECT(\"T_FinishColour[ColourCode-\"&IF(ISNUMBER(FIND(\"xxx\",BD47)),\"xxx\",IF(ISNUMBER(FIND(\"xx\",BD47)),\"xx\",\"error\"))&AQ47&\"]\"),MATCH(AU47,T_FinishColour[Finish / Colour],0)),\"\"),\"\")","v":"W"},null,"HIDE",null,null,null,"SLSECW",null,"SLSECxx","Skyline Square End Cap 3\"",null,{"$f":"IF(ISBLANK(BL47),\"\",IF(OR(BL47=L_Units),\"Y\",\"N\"))","v":"N"},null,{"$f":"IFERROR(IF(BG47=\"Y\",((INDEX(T_Deduc[Deduction],MATCH(BH47,T_Deduc[Type],0),0))),\"\"),\"\")","v":""},null,"","Piece",{"$f":"IFERROR(IF(ISBLANK(BB47),\"\",INDEX(T_NAV[Base Unit of Measure],MATCH(BB47,T_NAV[No.],0))),\"\")","v":"PIECE"},2,2,{"$f":"IFERROR(INDEX(INDIRECT(\"T_NAV[\"&i_Location&\"]\"),MATCH(1,--(BB47=T_NAV[No.])*--((INDIRECT(\"T_NAV[\"&i_Location&\"]\"))<>\"\"),0))/IF(AND(BF47<>\"\",i_Units=\"Imperial\"),CONVERT(BF47,\"m\",\"in\"),IF(AND(i_Units=\"Imperial\",BM47=\"Metre\"),39.37,IF(BF47<>\"\",BF47,1))),\"\")","v":""},""]
[null,null,null,"Skyline Fascia",{"$f":"IFERROR(IF(ISBLANK(D48),\"\",IF(FIND(D48,INDIRECT($D$44))>0,1,0)),0)","v":0},"Skyline 4\"",{"$f":"IFERROR(IF(ISBLANK(F48),\"\",IF(FIND(F48,INDIRECT($H$44))>0,1,0)),0)","v":0},null,null,null,1,null,null,null,null,null,{"$f":"IFERROR(IF(INDIRECT($H$55)=#REF!,1,IF(ISBLANK(#REF!),\"\",0)),\"\")","v":""},null,null,null,null,null,{"$f":"IFERROR(IF(INDIRECT($H$55)=#REF!,1,IF(ISBLANK(#REF!),\"\",0)),\"\")","v":""},null,null,null,null,null,null,"",null,null,null,"White","Anodised","Vanilla","Bronze","Black",null,null,null,null,"US","White",0,null,"White",{"$f":"IF(ISNUMBER(FIND(\"x\",BD48)),IFERROR(INDEX(INDIRECT(\"T_FinishColour[ColourCode-\"&IF(ISNUMBER(FIND(\"xxx\",BD48)),\"xxx\",IF(ISNUMBER(FIND(\"xx\",BD48)),\"xx\",\"error\"))&AQ48&\"]\"),MATCH(AU48,T_FinishColour[Finish / Colour],0)),\"\"),\"\")","v":"W"},null,"HIDE",null,null,null,"SLSF4W16",null,"SLSF4xx16","Skyline Square Fascia 4\"",null,"Y","Cassette",{"$f":"IFERROR(IF(BG48=\"Y\",((INDEX(T_Deduc[Deduction],MATCH(BH48,T_Deduc[Type],0),0))),\"\"),\"\")","v":""},"i_Width","",{"$f":"INDEX(T_UnitSelection[Units],MATCH(i_Units,T_UnitSelection[UnitSelection],0))","v":{"$error":"#N/A"}},null,1,1,{"$f":"IFERROR(INDEX(INDIRECT(\"T_NAV[\"&i_Location&\"]\"),MATCH(1,--(BB48=T_NAV[No.])*--((INDIRECT(\"T_NAV[\"&i_Location&\"]\"))<>\"\"),0))/IF(AND(BF48<>\"\",i_Units=\"Imperial\"),CONVERT(BF48,\"m\",\"in\"),IF(AND(i_Units=\"Imperial\",BM48=\"Metre\"),39.37,IF(BF48<>\"\",BF48,1))),\"\")","v":""},""]
[null,null,null,"Skyline Fascia",0,"Skyline 4\"",0,null,null,null,1,null,null,null,null,null,{"$f":"IFERROR(IF(INDIRECT($H$55)=#REF!,1,IF(ISBLANK(#REF!),\"\",0)),\"\")","v":""},null,null,null,null,null,{"$f":"IFERROR(IF(INDIRECT($H$55)=#REF!,1,IF(ISBLANK(#REF!),\"\",0)),\"\")","v":""},null,null,null,{"$f":"ROUNDUP(metric_width/600,0)+1","v":1},null,null,null,"600 MAX",null,null,"Zinc Plated","Exterior","White","Vanilla","Brown","Black",null,null,null,"US","Zinc Plated",0,null,"Zinc Plated","W",null,"HIDE",null,null,null,"SLFBKT4W",null,"SLFBKT4xx","Skyline Fascia Bracket 4\"",null,{"$f":"IF(ISBLANK(BL49),\"\",IF(OR(BL49=L_Units),\"Y\",\"N\"))","v":"N"},null,{"$f":"IFERROR(IF(BG49=\"Y\",((INDEX(T_Deduc[Deduction],MATCH(BH49,T_Deduc[Type],0),0))),\"\"),\"\")","v":""},null,"","Set",{"$f":"IFERROR(IF(ISBLANK(BB49),\"\",INDEX(T_NAV[Base Unit of Measure],MATCH(BB49,T_NAV[No.],0))),\"\")","v":"PIECE"},1,1,{"$f":"IFERROR(INDEX(INDIRECT(\"T_NAV[\"&i_Location&\"]\"),MATCH(1,--(BB49=T_NAV[No.])*--((INDIRECT(\"T_NAV[\"&i_Location&\"]\"))<>\"\"),0))/IF(AND(BF49<>\"\",i_Units=\"Imperial\"),CONVERT(BF49,\"m\",\"in\"),IF(AND(i_Units=\"Imperial\",BM49=\"Metre\"),39.37,IF(BF49<>\"\",BF49,1))),\"\")","v":""},""]
[null,null,null,"Skyline Fascia",0,"Skyline 4\"",0,null,null,null,1,null,null,null,null,null,{"$f":"IFERROR(IF(INDIRECT($H$55)=#REF!,1,IF(ISBLANK(#REF!),\"\",0)),\"\")","v":""},null,null,null,null,null,{"$f":"IFERROR(IF(INDIRECT($H$55)=#REF!,1,IF(ISBLANK(#REF!),\"\",0)),\"\")","v":""},null,null,null,null,null,null,"",null,null,null,"White","Vanilla","Gray","Bronze","Black",null,null,null,null,"US","White",0,null,"White",{"$f":"IF(ISNUMBER(FIND(\"x\",BD50)),IFERROR(INDEX(INDIRECT(\"T_FinishColour[ColourCode-\"&IF(ISNUMBER(FIND(\"xxx\",BD50)),\"xxx\",IF(ISNUMBER(FIND(\"xx\",BD50)),\"xx\",\"error\"))&AQ50&\"]\"),MATCH(AU50,T_FinishColour[Finish / Colour],0)),\"\"),\"\")","v":"W"},null,"HIDE",null,null,null,{"$f":"_xlfn.IFNA(SUBSTITUTE(IF(AQ50=\"AU\",SUBSTITUTE(BD50,\"xxx\",AV50),SUBSTITUTE(SUBSTITUTE(BD50,\"xx\",AV50),\"x\",\"\")),\"LLL\",\"580\"),BD50)","v":"SLFCVR4W"},null,"SLFCVR4xx","Skyline Bracket Cover 4\"",null,{"$f":"IF(ISBLANK(BL50),\"\",IF(OR(BL50=L_Units),\"Y\",\"N\"))","v":"N"},null,{"$f":"IFERROR(IF(BG50=\"Y\",((INDEX(T_Deduc[Deduction],MATCH(BH50,T_Deduc[Type],0),0))),\"\"),\"\")","v":""},null,"","Piece",{"$f":"IFERROR(IF(ISBLANK(BB50),\"\",INDEX(T_NAV[Base Unit of Measure],MATCH(BB50,T_NAV[No.],0))),\"\")","v":"PIECE"},2,2,{"$f":"IFERROR(INDEX(INDIRECT(\"T_NAV[\"&i_Location&\"]\"),MATCH(1,--(BB50=T_NAV[No.])*--((INDIRECT(\"T_NAV[\"&i_Location&\"]\"))<>\"\"),0))/IF(AND(BF50<>\"\",i_Units=\"Imperial\"),CONVERT(BF50,\"m\",\"in\"),IF(AND(i_Units=\"Imperial\",BM50=\"Metre\"),39.37,IF(BF50<>\"\",BF50,1))),\"\")","v":""},""]
[null,null,null,"Skyline Fascia",0,"Skyline 4\"",0,null,null,null,{"$f":"IFERROR(IF(ISBLANK(J51),\"\",IF(FIND(J51,INDIRECT($J$55))>0,1,0)),0)","v":""},null,null,null,null,null,{"$f":"IFERROR(IF(INDIRECT($H$55)=#REF!,1,IF(ISBLANK(#REF!),\"\",0)),\"\")","v":""},null,null,null,null,null,{"$f":"IFERROR(IF(INDIRECT($H$55)=#REF!,1,IF(ISBLANK(#REF!),\"\",0)),\"\")","v":""},null,null,null,null,null,null,"",null,null,null,"Zinc Plated",null,null,null,null,null,null,null,null,"US","",0,null,"",{"$f":"IF(ISNUMBER(FIND(\"x\",BD51)),IFERROR(INDEX(INDIRECT(\"T_FinishColour[ColourCode-\"&IF(ISNUMBER(FIND(\"xxx\",BD51)),\"xxx\",IF(ISNUMBER(FIND(\"xx\",BD51)),\"xx\",\"error\"))&AQ51&\"]\"),MATCH(AU51,T_FinishColour[Finish / Colour],0)),\"\"),\"\")","v":""},null,"HIDE",null,null,null,"SLFBKTCLP4",null,"SLFBKTCLP4","Skyline Bracket Clip",null,{"$f":"IF(ISBLANK(BL51),\"\",IF(OR(BL51=L_Units),\"Y\",\"N\"))","v":"N"},null,{"$f":"IFERROR(IF(BG51=\"Y\",((INDEX(T_Deduc[Deduction],MATCH(BH51,T_Deduc[Type],0),0))),\"\"),\"\")","v":""},null,"","Piece",{"$f":"IFERROR(IF(ISBLANK(BB51),\"\",INDEX(T_NAV[Base Unit of Measure],MATCH(BB51,T_NAV[No.],0))),\"\")","v":"PIECE"},2,2,{"$f":"IFERROR(INDEX(INDIRECT(\"T_NAV[\"&i_Location&\"]\"),MATCH(1,--(BB51=T_NAV[No.])*--((INDIRECT(\"T_NAV[\"&i_Location&\"]\"))<>\"\"),0))/IF(AND(BF51<>\"\",i_Units=\"Imperial\"),CONVERT(BF51,\"m\",\"in\"),IF(AND(i_Units=\"Imperial\",BM51=\"Metre\"),39.37,IF(BF51<>\"\",BF51,1))),\"\")","v":""},""]
[null,null,null,null,null,null,null,null,{"$f":"IFERROR(IF(ISBLANK(H52),\"\",IF(FIND(H52,INDIRECT($H$75))>0,1,0)),0)","v":""},null,null,null,null,null,null,null,null,null,null,null,null,null,null,null,null,null,null,null,null,"",null,null,null,null,null,null,null,null,null,null,null,null,null,"",null,null,"",{"$f":"IF(ISNUMBER(FIND(\"x\",BD52)),IFERROR(INDEX(INDIRECT(\"T_FinishColour[ColourCode-\"&IF(ISNUMBER(FIND(\"xxx\",BD52)),\"xxx\",IF(ISNUMBER(FIND(\"xx\",BD52)),\"xx\",\"error\"))&AQ52&\"]\"),MATCH(AU52,T_FinishColour[Finish / Colour],0)),\"\"),\"\")","v":""},null,"HIDE",null,null,null,"",null,null,null,null,{"$f":"IF(ISBLANK(BL52),\"\",IF(OR(BL52=L_Units),\"Y\",\"N\"))","v":""},null,{"$f":"IFERROR(IF(BG52=\"Y\",((INDEX(T_Deduc[Deduction],MATCH(BH52,T_Deduc[Type],0),0))),\"\"),\"\")","v":""},null,"",null,{"$f":"IFERROR(IF(ISBLANK(BB52),\"\",INDEX(T_NAV[Base Unit of Measure],MATCH(BB52,T_NAV[No.],0))),\"\")","v":""},null,"",{"$f":"IFERROR(INDEX(INDIRECT(\"T_NAV[\"&i_Location&\"]\"),MATCH(1,--(BB52=T_NAV[No.])*--((INDIRECT(\"T_NAV[\"&i_Location&\"]\"))<>\"\"),0))/IF(AND(BF52<>\"\",i_Units=\"Imperial\"),CONVERT(BF52,\"m\",\"in\"),IF(AND(i_Units=\"Imperial\",BM52=\"Metre\"),39.37,IF(BF52<>\"\",BF52,1))),\"\")","v":""},""]
[null,null,null,null,null,null,null,null,{"$f":"IFERROR(IF(ISBLANK(H53),\"\",IF(FIND(H53,INDIRECT($H$75))>0,1,0)),0)","v":""},null,null,null,null,null,null,null,null,null,null,null,null,null,null,null,null,null,null,null,null,"",null,null,null,null,null,null,null,null,null,null,null,null,null,"",null,null,"",{"$f":"IF(ISNUMBER(FIND(\"x\",BD53)),IFERROR(INDEX(INDIRECT(\"T_FinishColour[ColourCode-\"&IF(ISNUMBER(FIND(\"xxx\",BD53)),\"xxx\",IF(ISNUMBER(FIND(\"xx\",BD53)),\"xx\",\"error\"))&AQ53&\"]\"),MATCH(AU53,T_FinishColour[Finish / Colour],0)),\"\"),\"\")","v":""},null,"HIDE",null,null,null,"",null,null,null,null,{"$f":"IF(ISBLANK(BL53),\"\",IF(OR(BL53=L_Units),\"Y\",\"N\"))","v":""},null,{"$f":"IFERROR(IF(BG53=\"Y\",((INDEX(T_Deduc[Deduction],MATCH(BH53,T_Deduc[Type],0),0))),\"\"),\"\")","v":""},null,"",null,{"$f":"IFERROR(IF(ISBLANK(BB53),\"\",INDEX(T_NAV[Base Unit of Measure],MATCH(BB53,T_NAV[No.],0))),\"\")","v":""},null,"",{"$f":"IFERROR(INDEX(INDIRECT(\"T_NAV[\"&i_Location&\"]\"),MATCH(1,--(BB53=T_NAV[No.])*--((INDIRECT(\"T_NAV[\"&i_Location&\"]\"))<>\"\"),0))/IF(AND(BF53<>\"\",i_Units=\"Imperial\"),CONVERT(BF53,\"m\",\"in\"),IF(AND(i_Units=\"Imperial\",BM53=\"Metre\"),39.37,IF(BF53<>\"\",BF53,1))),\"\")","v":""},""]
[null,null,{"$f":"C55","v":0},null,null,null,null,null,null,null,null,null,null,null,null,null,null,null,null,null,null,null,null,null,null,null,null,null,null,"",null,null,null,null,null,null,null,null,null,null,null,null,null,"",null,null,"",{"$f":"IF(ISNUMBER(FIND(\"x\",BD54)),IFERROR(INDEX(INDIRECT(\"T_FinishColour[ColourCode-\"&IF(ISNUMBER(FIND(\"xxx\",BD54)),\"xxx\",IF(ISNUMBER(FIND(\"xx\",BD54)),\"xx\",\"error\"))&AQ54&\"]\"),MATCH(AU54,T_FinishColour[Finish / Colour],0)),\"\"),\"\")","v":""},null,"HIDE",null,null,null,"",null,null,null,null,{"$f":"IF(ISBLANK(BL54),\"\",IF(OR(BL54=L_Units),\"Y\",\"N\"))","v":""},null,{"$f":"IFERROR(IF(BG54=\"Y\",((INDEX(T_Deduc[Deduction],MATCH(BH54,T_Deduc[Type],0),0))),\"\"),\"\")","v":""},null,"",null,{"$f":"IFERROR(IF(ISBLANK(BB54),\"\",INDEX(T_NAV[Base Unit of Measure],MATCH(BB54,T_NAV[No.],0))),\"\")","v":""},null,"",{"$f":"IFERROR(INDEX(INDIRECT(\"T_NAV[\"&i_Location&\"]\"),MATCH(1,--(BB54=T_NAV[No.])*--((INDIRECT(\"T_NAV[\"&i_Location&\"]\"))<>\"\"),0))/IF(AND(BF54<>\"\",i_Units=\"Imperial\"),CONVERT(BF54,\"m\",\"in\"),IF(AND(i_Units=\"Imperial\",BM54=\"Metre\"),39.37,IF(BF54<>\"\",BF54,1))),\"\")","v":""},""]
[null,null,{"$f":"IFERROR(IF(FIND(D62,INDIRECT($D$55))>0,1,0),0)","v":0},"i_InstallationType",null,"i_FixingOptions",null,"i_PelmetSpline",null,"i_ControlType",null,"i_BracketOptions",null,null,null,null,null,null,null,null,null,null,null,null,null,null,null,null,null,"",null,null,null,null,null,null,null,null,null,null,null,null,null,"",null,null,"",{"$f":"IF(ISNUMBER(FIND(\"x\",BD55)),IFERROR(INDEX(INDIRECT(\"T_FinishColour[ColourCode-\"&IF(ISNUMBER(FIND(\"xxx\",BD55)),\"xxx\",IF(ISNUMBER(FIND(\"xx\",BD55)),\"xx\",\"error\"))&AQ55&\"]\"),MATCH(AU55,T_FinishColour[Finish / Colour],0)),\"\"),\"\")","v":""},null,"HIDE",null,null,null,"CASSETTE 100/110/120",null,"CASSETTE 100/110/120",null,null,null,null,{"$f":"IFERROR(IF(BG55=\"Y\",((INDEX(T_Deduc[Deduction],MATCH(BH55,T_Deduc[Type],0),0))),\"\"),\"\")","v":""},null,"",null,{"$f":"IFERROR(IF(ISBLANK(BB55),\"\",INDEX(T_NAV[Base Unit of Measure],MATCH(BB55,T_NAV[No.],0))),\"\")","v":""},null,"",{"$f":"IFERROR(INDEX(INDIRECT(\"T_NAV[\"&i_Location&\"]\"),MATCH(1,--(BB55=T_NAV[No.])*--((INDIRECT(\"T_NAV[\"&i_Location&\"]\"))<>\"\"),0))/IF(AND(BF55<>\"\",i_Units=\"Imperial\"),CONVERT(BF55,\"m\",\"in\"),IF(AND(i_Units=\"Imperial\",BM55=\"Metre\"),39.37,IF(BF55<>\"\",BF55,1))),\"\")","v":""},""]
[null,null,null,"Cassette 100",{"$f":"IFERROR(IF(ISBLANK(D56),\"\",IF(FIND(D56,INDIRECT($D$55))>0,1,0)),0)","v":0},null,{"$f":"IFERROR(IF(ISBLANK(F56),\"\",IF(FIND(F56,INDIRECT($F$55))>0,1,0)),0)","v":""},null,{"$f":"IFERROR(IF(ISBLANK(H56),\"\",IF(FIND(H56,INDIRECT($H$55))>0,1,0)),0)","v":""},null,{"$f":"IFERROR(IF(INDIRECT($J$55)=J56,1,IF(ISBLANK(J56),\"\",0)),\"\")","v":1},null,null,null,null,null,{"$f":"IFERROR(IF(INDIRECT($H$55)=#REF!,1,IF(ISBLANK(#REF!),\"\",0)),\"\")","v":""},null,null,null,null,null,{"$f":"IFERROR(IF(INDIRECT($H$55)=#REF!,1,IF(ISBLANK(#REF!),\"\",0)),\"\")","v":""},null,null,null,null,null,null,"",null,null,null,"White","Anodised","Vanilla","Bronze","Black",null,null,null,null,"US","White",{"$f":"i_Colour","v":0},null,"White",{"$f":"IF(ISNUMBER(FIND(\"x\",BD56)),IFERROR(INDEX(INDIRECT(\"T_FinishColour[ColourCode-\"&IF(ISNUMBER(FIND(\"xxx\",BD56)),\"xxx\",IF(ISNUMBER(FIND(\"xx\",BD56)),\"xx\",\"error\"))&AQ56&\"]\"),MATCH(AU56,T_FinishColour[Finish / Colour],0)),\"\"),\"\")","v":"W"},null,"HIDE",null,null,null,"CRV100W",null,"CRV100xx","Cassette 100 Headrail",4.9000000000000004,{"$f":"IF(ISBLANK(BL56),\"\",IF(OR(BL56=L_Units),\"Y\",\"N\"))","v":{"$error":"#N/A"}},"Cassette",{"$f":"IFERROR(IF(BG56=\"Y\",((INDEX(T_Deduc[Deduction],MATCH(BH56,T_Deduc[Type],0),0))),\"\"),\"\")","v":""},"i_Width","",{"$f":"INDEX(T_UnitSelection[Units],MATCH(i_Units,T_UnitSelection[UnitSelection],0))","v":{"$error":"#N/A"}},{"$f":"IFERROR(IF(ISBLANK(BB56),\"\",INDEX(T_NAV[Base Unit of Measure],MATCH(BB56,T_NAV[No.],0))),\"\")","v":"LENGTH"},1,1,{"$f":"IFERROR(INDEX(INDIRECT(\"T_NAV[\"&i_Location&\"]\"),MATCH(1,--(BB56=T_NAV[No.])*--((INDIRECT(\"T_NAV[\"&i_Location&\"]\"))<>\"\"),0))/IF(AND(BF56<>\"\",i_Units=\"Imperial\"),CONVERT(BF56,\"m\",\"in\"),IF(AND(i_Units=\"Imperial\",BM56=\"Metre\"),39.37,IF(BF56<>\"\",BF56,1))),\"\")","v":""},""]
[null,null,null,null,{"$f":"IFERROR(IF(ISBLANK(D57),\"\",IF(FIND(D57,INDIRECT($D$55))>0,1,0)),0)","v":""},"100/110 Mounting Bracket",{"$f":"IFERROR(IF(ISBLANK(F57),\"\",IF(FIND(F57,INDIRECT($F$55))>0,1,0)),0)","v":0},null,"",null,1,null,null,null,null,null,{"$f":"IFERROR(IF(INDIRECT($H$55)=#REF!,1,IF(ISBLANK(#REF!),\"\",0)),\"\")","v":""},null,null,null,null,null,{"$f":"IFERROR(IF(INDIRECT($H$55)=#REF!,1,IF(ISBLANK(#REF!),\"\",0)),\"\")","v":""},null,null,null,{"$f":"ROUNDUP(metric_width/600,0)+1","v":1},null,null,1,"600 MAX",null,null,"White","Exterior","Vanilla","Brown","Black",null,null,null,null,"US","White",0,null,{"$f":"IF(ISNUMBER(FIND(\"x\",BD57)),IFERROR(INDEX(AH57:AP57,0,MATCH(AS57,AH57:AP57,0)),AR57),\"\")","v":"White"},{"$f":"IF(ISNUMBER(FIND(\"x\",BD57)),IFERROR(INDEX(INDIRECT(\"T_FinishColour[ColourCode-\"&IF(ISNUMBER(FIND(\"xxx\",BD57)),\"xxx\",IF(ISNUMBER(FIND(\"xx\",BD57)),\"xx\",\"error\"))&AQ57&\"]\"),MATCH(AU57,T_FinishColour[Finish / Colour],0)),\"\"),\"\")","v":"075"},null,"HIDE",null,null,null,{"$f":"_xlfn.IFNA(SUBSTITUTE(IF(AQ57=\"AU\",SUBSTITUTE(BD57,\"xxx\",AV57),SUBSTITUTE(SUBSTITUTE(BD57,\"xx\",AV57),\"x\",\"\")),\"LLL\",\"580\"),BD57)","v":"SB20-0202-075100"},null,"SB20-0202-xxx100","Cassette 100/110 Mounting Brackets",null,{"$f":"IF(ISBLANK(BL57),\"\",IF(OR(BL57=L_Units),\"Y\",\"N\"))","v":"N"},null,{"$f":"IFERROR(IF(BG57=\"Y\",((INDEX(T_Deduc[Deduction],MATCH(BH57,T_Deduc[Type],0),0))),\"\"),\"\")","v":""},null,"","Piece",{"$f":"IFERROR(IF(ISBLANK(BB57),\"\",INDEX(T_NAV[Base Unit of Measure],MATCH(BB57,T_NAV[No.],0))),\"\")","v":"PIECE"},1,1,{"$f":"IFERROR(INDEX(INDIRECT(\"T_NAV[\"&i_Location&\"]\"),MATCH(1,--(BB57=T_NAV[No.])*--((INDIRECT(\"T_NAV[\"&i_Location&\"]\"))<>\"\"),0))/IF(AND(BF57<>\"\",i_Units=\"Imperial\"),CONVERT(BF57,\"m\",\"in\"),IF(AND(i_Units=\"Imperial\",BM57=\"Metre\"),39.37,IF(BF57<>\"\",BF57,1))),\"\")","v":""},""]
[null,null,null,"Cassette 100",0,null,{"$f":"IFERROR(IF(ISBLANK(F58),\"\",IF(FIND(F58,INDIRECT($F$55))>0,1,0)),0)","v":""},null,"",null,1,null,null,null,null,null,{"$f":"IFERROR(IF(INDIRECT($H$55)=#REF!,1,IF(ISBLANK(#REF!),\"\",0)),\"\")","v":""},null,null,null,null,null,{"$f":"IFERROR(IF(INDIRECT($H$55)=#REF!,1,IF(ISBLANK(#REF!),\"\",0)),\"\")","v":""},null,null,null,null,null,null,"",null,null,null,"White","Vanilla","Gray","Bronze","Black",null,null,null,null,"US","White",0,null,"White",{"$f":"IF(ISNUMBER(FIND(\"x\",BD58)),IFERROR(INDEX(INDIRECT(\"T_FinishColour[ColourCode-\"&IF(ISNUMBER(FIND(\"xxx\",BD58)),\"xxx\",IF(ISNUMBER(FIND(\"xx\",BD58)),\"xx\",\"error\"))&AQ58&\"]\"),MATCH(AU58,T_FinishColour[Finish / Colour],0)),\"\"),\"\")","v":"W"},null,"HIDE",null,null,null,"CREC100W",null,"CREC100xx","Cassette 100 End Caps",null,{"$f":"IF(ISBLANK(BL58),\"\",IF(OR(BL58=L_Units),\"Y\",\"N\"))","v":"N"},null,{"$f":"IFERROR(IF(BG58=\"Y\",((INDEX(T_Deduc[Deduction],MATCH(BH58,T_Deduc[Type],0),0))),\"\"),\"\")","v":""},null,"","Piece",{"$f":"IFERROR(IF(ISBLANK(BB58),\"\",INDEX(T_NAV[Base Unit of Measure],MATCH(BB58,T_NAV[No.],0))),\"\")","v":"PIECE"},2,2,{"$f":"IFERROR(INDEX(INDIRECT(\"T_NAV[\"&i_Location&\"]\"),MATCH(1,--(BB58=T_NAV[No.])*--((INDIRECT(\"T_NAV[\"&i_Location&\"]\"))<>\"\"),0))/IF(AND(BF58<>\"\",i_Units=\"Imperial\"),CONVERT(BF58,\"m\",\"in\"),IF(AND(i_Units=\"Imperial\",BM58=\"Metre\"),39.37,IF(BF58<>\"\",BF58,1))),\"\")","v":""},""]
[null,null,null,"Cassette 120",0,null,"",null,"",null,1,null,null,null,null,null,{"$f":"IFERROR(IF(INDIRECT($H$55)=#REF!,1,IF(ISBLANK(#REF!),\"\",0)),\"\")","v":""},null,null,null,null,null,{"$f":"IFERROR(IF(INDIRECT($H$55)=#REF!,1,IF(ISBLANK(#REF!),\"\",0)),\"\")","v":""},null,null,null,null,null,null,"",null,null,null,"White","Anodised","Vanilla","Bronze","Black",null,null,null,null,"US","White",0,null,"White",{"$f":"IF(ISNUMBER(FIND(\"x\",BD59)),IFERROR(INDEX(INDIRECT(\"T_FinishColour[ColourCode-\"&IF(ISNUMBER(FIND(\"xxx\",BD59)),\"xxx\",IF(ISNUMBER(FIND(\"xx\",BD59)),\"xx\",\"error\"))&AQ59&\"]\"),MATCH(AU59,T_FinishColour[Finish / Colour],0)),\"\"),\"\")","v":"075"},null,"HIDE",null,null,null,{"$f":"_xlfn.IFNA(SUBSTITUTE(IF(AQ59=\"AU\",SUBSTITUTE(BD59,\"xxx\",AV59),SUBSTITUTE(SUBSTITUTE(BD59,\"xx\",AV59),\"x\",\"\")),\"LLL\",\"490\"),BD59)","v":"SB20-0304-075490"},null,"SB20-0304-xxxLLL","Cassette 120 Headrail",4.9000000000000004,"Y","Cassette",{"$f":"IFERROR(IF(BG59=\"Y\",((INDEX(T_Deduc[Deduction],MATCH(BH59,T_Deduc[Type],0),0))),\"\"),\"\")","v":""},"i_Width",{"$f":"IFERROR(IF(BG59=\"Y\",(INDIRECT(BJ59)-BI59)/IF(Z59=\"\",1,o_nScreens),\"\"),\"\")","v":""},{"$f":"INDEX(T_UnitSelection[Units],MATCH(i_Units,T_UnitSelection[UnitSelection],0))","v":{"$error":"#N/A"}},{"$f":"IFERROR(IF(ISBLANK(BB59),\"\",INDEX(T_NAV[Base Unit of Measure],MATCH(BB59,T_NAV[No.],0))),\"\")","v":""},1,1,{"$f":"IFERROR(INDEX(INDIRECT(\"T_NAV[\"&i_Location&\"]\"),MATCH(1,--(BB59=T_NAV[No.])*--((INDIRECT(\"T_NAV[\"&i_Location&\"]\"))<>\"\"),0))/IF(AND(BF59<>\"\",i_Units=\"Imperial\"),CONVERT(BF59,\"m\",\"in\"),IF(AND(i_Units=\"Imperial\",BM59=\"Metre\"),39.37,IF(BF59<>\"\",BF59,1))),\"\")","v":""},""]
[null,null,null,null,"","120 Mounting Bracket",0,null,"",null,1,null,null,null,null,null,{"$f":"IFERROR(IF(INDIRECT($H$55)=#REF!,1,IF(ISBLANK(#REF!),\"\",0)),\"\")","v":""},null,null,null,null,null,{"$f":"IFERROR(IF(INDIRECT($H$55)=#REF!,1,IF(ISBLANK(#REF!),\"\",0)),\"\")","v":""},null,null,null,{"$f":"ROUNDUP(metric_width/600,0)+1","v":1},null,null,1,"600 MAX",null,null,"Zinc Plated","Exterior","White","Vanilla","Brown","Black",null,null,null,"US","Zinc Plated",0,null,"Zinc Plated",{"$f":"IF(ISNUMBER(FIND(\"x\",BD60)),IFERROR(INDEX(INDIRECT(\"T_FinishColour[ColourCode-\"&IF(ISNUMBER(FIND(\"xxx\",BD60)),\"xxx\",IF(ISNUMBER(FIND(\"xx\",BD60)),\"xx\",\"error\"))&AQ60&\"]\"),MATCH(AU60,T_FinishColour[Finish / Colour],0)),\"\"),\"\")","v":""},null,"HIDE",null,null,null,{"$f":"_xlfn.IFNA(SUBSTITUTE(IF(AQ60=\"AU\",SUBSTITUTE(BD60,\"xxx\",AV60),SUBSTITUTE(SUBSTITUTE(BD60,\"xx\",AV60),\"x\",\"\")),\"LLL\",\"580\"),BD60)","v":"V2BKT"},null,"V2BKTx","Cassette 120 Mounting Brackets",null,{"$f":"IF(ISBLANK(BL60),\"\",IF(OR(BL60=L_Units),\"Y\",\"N\"))","v":"N"},null,{"$f":"IFERROR(IF(BG60=\"Y\",((INDEX(T_Deduc[Deduction],MATCH(BH60,T_Deduc[Type],0),0))),\"\"),\"\")","v":""},null,"","Piece",{"$f":"IFERROR(IF(ISBLANK(BB60),\"\",INDEX(T_NAV[Base Unit of Measure],MATCH(BB60,T_NAV[No.],0))),\"\")","v":"PIECE"},1,1,{"$f":"IFERROR(INDEX(INDIRECT(\"T_NAV[\"&i_Location&\"]\"),MATCH(1,--(BB60=T_NAV[No.])*--((INDIRECT(\"T_NAV[\"&i_Location&\"]\"))<>\"\"),0))/IF(AND(BF60<>\"\",i_Units=\"Imperial\"),CONVERT(BF60,\"m\",\"in\"),IF(AND(i_Units=\"Imperial\",BM60=\"Metre\"),39.37,IF(BF60<>\"\",BF60,1))),\"\")","v":""},""]
[null,null,null,"Cassette 120",0,null,{"$f":"IFERROR(IF(ISBLANK(F61),\"\",IF(FIND(F61,INDIRECT($F$55))>0,1,0)),0)","v":""},null,"",null,1,null,null,null,null,null,{"$f":"IFERROR(IF(INDIRECT($H$55)=#REF!,1,IF(ISBLANK(#REF!),\"\",0)),\"\")","v":""},null,null,null,null,null,{"$f":"IFERROR(IF(INDIRECT($H$55)=#REF!,1,IF(ISBLANK(#REF!),\"\",0)),\"\")","v":""},null,null,null,null,null,null,"",null,null,null,"White","Vanilla","Gray","Bronze","Black",null,null,null,null,"US","White",0,null,"White",{"$f":"IF(ISNUMBER(FIND(\"x\",BD61)),IFERROR(INDEX(INDIRECT(\"T_FinishColour[ColourCode-\"&IF(ISNUMBER(FIND(\"xxx\",BD61)),\"xxx\",IF(ISNUMBER(FIND(\"xx\",BD61)),\"xx\",\"error\"))&AQ61&\"]\"),MATCH(AU61,T_FinishColour[Finish / Colour],0)),\"\"),\"\")","v":"075"},null,"HIDE",null,null,null,"SB20-0303-075120",null,"SB20-0303-xxx120","Cassette 120 End Caps",null,{"$f":"IF(ISBLANK(BL61),\"\",IF(OR(BL61=L_Units),\"Y\",\"N\"))","v":"N"},null,{"$f":"IFERROR(IF(BG61=\"Y\",((INDEX(T_Deduc[Deduction],MATCH(BH61,T_Deduc[Type],0),0))),\"\"),\"\")","v":""},null,"","Piece",{"$f":"IFERROR(IF(ISBLANK(BB61),\"\",INDEX(T_NAV[Base Unit of Measure],MATCH(BB61,T_NAV[No.],0))),\"\")","v":"PIECE"},2,2,{"$f":"IFERROR(INDEX(INDIRECT(\"T_NAV[\"&i_Location&\"]\"),MATCH(1,--(BB61=T_NAV[No.])*--((INDIRECT(\"T_NAV[\"&i_Location&\"]\"))<>\"\"),0))/IF(AND(BF61<>\"\",i_Units=\"Imperial\"),CONVERT(BF61,\"m\",\"in\"),IF(AND(i_Units=\"Imperial\",BM61=\"Metre\"),39.37,IF(BF61<>\"\",BF61,1))),\"\")","v":""},""]
[null,null,null,"Cassette 1",{"$f":"IFERROR(IF(ISBLANK(D62),\"\",IF(FIND(D62,INDIRECT($D$55))>0,1,0)),0)","v":0},null,"",null,{"$f":"IFERROR(IF(ISBLANK(H62),\"\",IF(FIND(H62,INDIRECT($H$55))>0,1,0)),0)","v":""},null,{"$f":"IFERROR(IF(ISBLANK(J62),\"\",IF(FIND(J62,INDIRECT($J$55))>0,1,0)),0)","v":""},"100/120",{"$f":"IFERROR(IF(ISBLANK(L62),\"\",IF(FIND(L62,INDIRECT($L$55))>0,1,0)),0)","v":0},null,null,null,{"$f":"IFERROR(IF(INDIRECT($H$55)=#REF!,1,IF(ISBLANK(#REF!),\"\",0)),\"\")","v":""},null,null,null,null,null,{"$f":"IFERROR(IF(INDIRECT($H$55)=#REF!,1,IF(ISBLANK(#REF!),\"\",0)),\"\")","v":""},null,null,null,null,null,null,"",null,null,null,"Zinc Plated",null,null,null,null,null,null,null,null,"US","Zinc Plated",0,null,"Zinc Plated",{"$f":"IF(ISNUMBER(FIND(\"x\",BD62)),IFERROR(INDEX(INDIRECT(\"T_FinishColour[ColourCode-\"&IF(ISNUMBER(FIND(\"xxx\",BD62)),\"xxx\",IF(ISNUMBER(FIND(\"xx\",BD62)),\"xx\",\"error\"))&AQ62&\"]\"),MATCH(AU62,T_FinishColour[Finish / Colour],0)),\"\"),\"\")","v":""},null,"HIDE",null,null,null,"CRUSLB660",null,"CRUSLB660xx","Cassette 100 & 120 Skyline Bracket",null,{"$f":"IF(ISBLANK(BL62),\"\",IF(OR(BL62=L_Units),\"Y\",\"N\"))","v":"N"},null,{"$f":"IFERROR(IF(BG62=\"Y\",((INDEX(T_Deduc[Deduction],MATCH(BH62,T_Deduc[Type],0),0))),\"\"),\"\")","v":""},null,"","Piece",{"$f":"IFERROR(IF(ISBLANK(BB62),\"\",INDEX(T_NAV[Base Unit of Measure],MATCH(BB62,T_NAV[No.],0))),\"\")","v":""},2,2,{"$f":"IFERROR(INDEX(INDIRECT(\"T_NAV[\"&i_Location&\"]\"),MATCH(1,--(BB62=T_NAV[No.])*--((INDIRECT(\"T_NAV[\"&i_Location&\"]\"))<>\"\"),0))/IF(AND(BF62<>\"\",i_Units=\"Imperial\"),CONVERT(BF62,\"m\",\"in\"),IF(AND(i_Units=\"Imperial\",BM62=\"Metre\"),39.37,IF(BF62<>\"\",BF62,1))),\"\")","v":""},""]
[null,null,null,"Cassette 110",{"$f":"IFERROR(IF(ISBLANK(D63),\"\",IF(FIND(D63,INDIRECT($D$55))>0,1,0)),0)","v":0},null,{"$f":"IFERROR(IF(ISBLANK(F63),\"\",IF(FIND(F63,INDIRECT($F$55))>0,1,0)),0)","v":""},null,{"$f":"IFERROR(IF(ISBLANK(H63),\"\",IF(FIND(H63,INDIRECT($H$55))>0,1,0)),0)","v":""},null,null,null,{"$f":"IFERROR(IF(ISBLANK(L63),\"\",IF(FIND(L63,INDIRECT($D$55))>0,1,0)),0)","v":""},null,null,null,{"$f":"IFERROR(IF(INDIRECT($H$55)=#REF!,1,IF(ISBLANK(#REF!),\"\",0)),\"\")","v":""},null,null,null,null,null,{"$f":"IFERROR(IF(INDIRECT($H$55)=#REF!,1,IF(ISBLANK(#REF!),\"\",0)),\"\")","v":""},null,null,null,null,null,null,{"$f":"IFERROR(IF(AND(o_nScreens>1,Z63=\"Y\",PRODUCT(AA63:AC63)=0),o_nScreens,IF(PRODUCT(AA63:AC63)=0,\"\",PRODUCT(AA63:AC63))),\"\")","v":""},null,null,null,"White",null,null,null,null,null,null,null,null,"US",{"$f":"IF(ISNUMBER(FIND(\"x\",BD63)),IFERROR(INDEX(AH63:AP63,0,MATCH(AS63,AH63:AP63,0)),IF(AH63<>\"\",AH63,i_DefaultColour)),\"\")","v":""},0,null,{"$f":"IF(ISNUMBER(FIND(\"x\",BD63)),IFERROR(INDEX(AH63:AP63,0,MATCH(AS63,AH63:AP63,0)),AR63),\"\")","v":""},{"$f":"IF(ISNUMBER(FIND(\"x\",BD63)),IFERROR(INDEX(INDIRECT(\"T_FinishColour[ColourCode-\"&IF(ISNUMBER(FIND(\"xxx\",BD63)),\"xxx\",IF(ISNUMBER(FIND(\"xx\",BD63)),\"xx\",\"error\"))&AQ63&\"]\"),MATCH(AU63,T_FinishColour[Finish / Colour],0)),\"\"),\"\")","v":""},null,"HIDE",null,null,null,"SB20-0504-069490",null,"SB20-0504-069490","Cassette 110 Headrail",4.9000000000000004,"Y","Cassette",{"$f":"IFERROR(IF(BG63=\"Y\",((INDEX(T_Deduc[Deduction],MATCH(BH63,T_Deduc[Type],0),0))),\"\"),\"\")","v":""},"i_Width",{"$f":"IFERROR(IF(BG63=\"Y\",(INDIRECT(BJ63)-BI63)/IF(Z63=\"\",1,o_nScreens),\"\"),\"\")","v":""},{"$f":"INDEX(T_UnitSelection[Units],MATCH(i_Units,T_UnitSelection[UnitSelection],0))","v":{"$error":"#N/A"}},{"$f":"IFERROR(IF(ISBLANK(BB63),\"\",INDEX(T_NAV[Base Unit of Measure],MATCH(BB63,T_NAV[No.],0))),\"\")","v":""},1,{"$f":"IF(ISBLANK(BN63),\"\",PRODUCT(AD63,BN63,ShadeQuantity))","v":1},null,""]
[null,null,null,"Cassette 110",0,null,"",null,"",null,null,null,"",null,null,null,{"$f":"IFERROR(IF(INDIRECT($H$55)=#REF!,1,IF(ISBLANK(#REF!),\"\",0)),\"\")","v":""},null,null,null,null,null,{"$f":"IFERROR(IF(INDIRECT($H$55)=#REF!,1,IF(ISBLANK(#REF!),\"\",0)),\"\")","v":""},null,null,null,null,null,null,"",null,null,null,"White",null,null,null,null,null,null,null,null,"US","",0,null,"",{"$f":"IF(ISNUMBER(FIND(\"x\",BD64)),IFERROR(INDEX(INDIRECT(\"T_FinishColour[ColourCode-\"&IF(ISNUMBER(FIND(\"xxx\",BD64)),\"xxx\",IF(ISNUMBER(FIND(\"xx\",BD64)),\"xx\",\"error\"))&AQ64&\"]\"),MATCH(AU64,T_FinishColour[Finish / Colour],0)),\"\"),\"\")","v":""},null,"HIDE",null,null,null,"SB20-0503-069000",null,"SB20-0503-069000","Cassette 110 End Caps",null,{"$f":"IF(ISBLANK(BL64),\"\",IF(OR(BL64=L_Units),\"Y\",\"N\"))","v":"N"},null,{"$f":"IFERROR(IF(BG64=\"Y\",((INDEX(T_Deduc[Deduction],MATCH(BH64,T_Deduc[Type],0),0))),\"\"),\"\")","v":""},null,"","Piece",{"$f":"IFERROR(IF(ISBLANK(BB64),\"\",INDEX(T_NAV[Base Unit of Measure],MATCH(BB64,T_NAV[No.],0))),\"\")","v":""},2,2,null,""]
[null,null,null,"Cassette 110",{"$f":"IFERROR(IF(ISBLANK(D65),\"\",IF(FIND(D65,INDIRECT($D$16))>0,1,0)),0)","v":0},null,{"$f":"IFERROR(IF(ISBLANK(F65),\"\",IF(FIND(F65,INDIRECT($F$16))>0,1,0)),0)","v":""},null,{"$f":"IF(G67=1,0,G65)","v":""},null,null,null,null,null,null,null,null,null,null,null,null,null,null,null,null,null,null,null,null,"",null,null,null,null,null,null,null,null,null,null,null,null,"AU","White",0,null,"White",{"$f":"IF(ISNUMBER(FIND(\"x\",BD65)),IFERROR(INDEX(INDIRECT(\"T_FinishColour[ColourCode-\"&IF(ISNUMBER(FIND(\"xxx\",BD65)),\"xxx\",IF(ISNUMBER(FIND(\"xx\",BD65)),\"xx\",\"error\"))&AQ65&\"]\"),MATCH(AU65,T_FinishColour[Finish / Colour],0)),\"\"),\"\")","v":"069"},null,"HIDE",null,null,null,{"$f":"_xlfn.IFNA(SUBSTITUTE(IF(AQ65=\"AU\",SUBSTITUTE(BD65,\"xxx\",AV65),SUBSTITUTE(SUBSTITUTE(BD65,\"xx\",AV65),\"x\",\"\")),\"LLL\",\"580\"),BD65)","v":"SL01-0306-069040"},null,"SL01-0306-xxx040","LX Skyline Bracket | 40mm Projection",null,{"$f":"IF(ISBLANK(BL65),\"\",IF(OR(BL65=L_Units),\"Y\",\"N\"))","v":"N"},null,{"$f":"IFERROR(IF(BG65=\"Y\",((INDEX(T_Deduc[Deduction],MATCH(BH65,T_Deduc[Type],0),0))),\"\"),\"\")","v":""},null,{"$f":"IFERROR(IF(BG65=\"Y\",(INDIRECT(BJ65)-BI65)/IF(Z65=\"\",1,o_nScreens),\"\"),\"\")","v":""},"Piece",{"$f":"IFERROR(IF(ISBLANK(BB65),\"\",INDEX(T_NAV[Base Unit of Measure],MATCH(BB65,T_NAV[No.],0))),\"\")","v":"PIECE"},2,{"$f":"IF(ISBLANK(BN65),\"\",PRODUCT(AD65,BN65,ShadeQuantity))","v":2},{"$f":"IFERROR(INDEX(INDIRECT(\"T_NAV[\"&i_Location&\"]\"),MATCH(1,--(BB65=T_NAV[No.])*--((INDIRECT(\"T_NAV[\"&i_Location&\"]\"))<>\"\"),0))/IF(AND(BF65<>\"\",i_Units=\"Imperial\"),CONVERT(BF65,\"m\",\"in\"),IF(AND(i_Units=\"Imperial\",BM65=\"Metre\"),39.37,IF(BF65<>\"\",BF65,1))),\"\")","v":""},""]
[null,null,null,"Cassette 110",{"$f":"IFERROR(IF(ISBLANK(D66),\"\",IF(FIND(D66,INDIRECT($D$16))>0,1,0)),0)","v":0},null,{"$f":"IFERROR(IF(ISBLANK(F66),\"\",IF(FIND(F66,INDIRECT($F$16))>0,1,0)),0)","v":""},null,{"$f":"IF(G68=1,0,G66)","v":""},null,null,null,null,null,null,null,null,null,null,null,null,null,null,null,null,null,null,null,null,{"$f":"IFERROR(IF(AND(o_nScreens>1,Z66=\"Y\",PRODUCT(AA66:AC66)=0),o_nScreens,IF(PRODUCT(AA66:AC66)=0,\"\",PRODUCT(AA66:AC66))),\"\")","v":""},null,null,null,null,null,null,null,null,null,null,null,null,"AU",{"$f":"IF(ISNUMBER(FIND(\"x\",BD66)),IFERROR(INDEX(AH66:AP66,0,MATCH(AS66,AH66:AP66,0)),IF(AH66<>\"\",AH66,i_DefaultColour)),\"\")","v":""},0,null,{"$f":"IF(ISNUMBER(FIND(\"x\",BD66)),IFERROR(INDEX(AH66:AP66,0,MATCH(AS66,AH66:AP66,0)),AR66),\"\")","v":""},{"$f":"IF(ISNUMBER(FIND(\"x\",BD66)),IFERROR(INDEX(INDIRECT(\"T_FinishColour[ColourCode-\"&IF(ISNUMBER(FIND(\"xxx\",BD66)),\"xxx\",IF(ISNUMBER(FIND(\"xx\",BD66)),\"xx\",\"error\"))&AQ66&\"]\"),MATCH(AU66,T_FinishColour[Finish / Colour],0)),\"\"),\"\")","v":""},null,"HIDE",null,null,null,{"$f":"_xlfn.IFNA(SUBSTITUTE(IF(AQ66=\"AU\",SUBSTITUTE(BD66,\"xxx\",AV66),SUBSTITUTE(SUBSTITUTE(BD66,\"xx\",AV66),\"x\",\"\")),\"LLL\",\"580\"),BD66)","v":"SC6375H25"},null,"SC6375H25","Flanged Hex Head Screw, #6, 3/8\"",null,{"$f":"IF(ISBLANK(BL66),\"\",IF(OR(BL66=L_Units),\"Y\",\"N\"))","v":"N"},null,{"$f":"IFERROR(IF(BG66=\"Y\",((INDEX(T_Deduc[Deduction],MATCH(BH66,T_Deduc[Type],0),0))),\"\"),\"\")","v":""},null,{"$f":"IFERROR(IF(BG66=\"Y\",(INDIRECT(BJ66)-BI66)/IF(Z66=\"\",1,o_nScreens),\"\"),\"\")","v":""},"Piece",{"$f":"IFERROR(IF(ISBLANK(BB66),\"\",INDEX(T_NAV[Base Unit of Measure],MATCH(BB66,T_NAV[No.],0))),\"\")","v":""},2,{"$f":"IF(ISBLANK(BN66),\"\",PRODUCT(AD66,BN66,ShadeQuantity))","v":2},{"$f":"IFERROR(INDEX(INDIRECT(\"T_NAV[\"&i_Location&\"]\"),MATCH(1,--(BB66=T_NAV[No.])*--((INDIRECT(\"T_NAV[\"&i_Location&\"]\"))<>\"\"),0))/IF(AND(BF66<>\"\",i_Units=\"Imperial\"),CONVERT(BF66,\"m\",\"in\"),IF(AND(i_Units=\"Imperial\",BM66=\"Metre\"),39.37,IF(BF66<>\"\",BF66,1))),\"\")","v":""},""]
[null,null,null,"Cassette 110",{"$f":"IFERROR(IF(ISBLANK(D67),\"\",IF(FIND(D67,INDIRECT($D$75))>0,1,0)),0)","v":0},null,{"$f":"IFERROR(IF(ISBLANK(F67),\"\",IF(FIND(F67,INDIRECT($F$75))>0,1,0)),0)","v":""},"4.6mm",{"$f":"IFERROR(IF(ISBLANK(H67),\"\",IF(FIND(H67,INDIRECT($H$75))>0,1,0)),0)","v":0},null,{"$f":"IFERROR(IF(ISBLANK(J67),\"\",IF(FIND(J67,INDIRECT($J$75))>0,1,0)),0)","v":""},null,{"$f":"IFERROR(IF(ISBLANK(L67),\"\",IF(FIND(L67,INDIRECT($L$75))>0,1,0)),0)","v":""},null,null,null,null,null,null,null,null,null,null,null,null,null,null,null,null,"",null,null,null,null,null,null,null,null,null,null,null,null,"AU","",0,null,"",{"$f":"IF(ISNUMBER(FIND(\"x\",BD67)),IFERROR(INDEX(INDIRECT(\"T_FinishColour[ColourCode-\"&IF(ISNUMBER(FIND(\"xxx\",BD67)),\"xxx\",IF(ISNUMBER(FIND(\"xx\",BD67)),\"xx\",\"error\"))&AQ67&\"]\"),MATCH(AU67,T_FinishColour[Finish / Colour],0)),\"\"),\"\")","v":""},null,"HIDE",null,null,null,"SS91-5246-050300",null,"SS91-5246-050300","Ribbed Round Spline - 4.6mm x 300m Roll",null,{"$f":"IF(ISBLANK(BL67),\"\",IF(OR(BL67=L_Units),\"Y\",\"N\"))","v":{"$error":"#N/A"}},"Cassette",{"$f":"IFERROR(IF(BG67=\"Y\",((INDEX(T_Deduc[Deduction],MATCH(BH67,T_Deduc[Type],0),0))),\"\"),\"\")","v":""},"i_Width",{"$f":"IFERROR(IF(BG67=\"Y\",(INDIRECT(BJ67)-BI67)/IF(Z67=\"\",1,o_nScreens),\"\"),\"\")","v":""},{"$f":"INDEX(T_UnitSelection[Units],MATCH(i_Units,T_UnitSelection[UnitSelection],0))","v":{"$error":"#N/A"}},{"$f":"IFERROR(IF(ISBLANK(BB67),\"\",INDEX(T_NAV[Base Unit of Measure],MATCH(BB67,T_NAV[No.],0))),\"\")","v":"METRE"},1,{"$f":"IF(ISBLANK(BN67),\"\",PRODUCT(AD67,BN67,ShadeQuantity))","v":1},{"$f":"IFERROR(INDEX(INDIRECT(\"T_NAV[\"&i_Location&\"]\"),MATCH(1,--(BB67=T_NAV[No.])*--((INDIRECT(\"T_NAV[\"&i_Location&\"]\"))<>\"\"),0))/IF(AND(BF67<>\"\",i_Units=\"Imperial\"),CONVERT(BF67,\"m\",\"in\"),IF(AND(i_Units=\"Imperial\",BM67=\"Metre\"),39.37,IF(BF67<>\"\",BF67,1))),\"\")","v":""},""]
[null,null,null,"Cassette 110",{"$f":"IFERROR(IF(ISBLANK(D68),\"\",IF(FIND(D68,INDIRECT($D$75))>0,1,0)),0)","v":0},null,{"$f":"IFERROR(IF(ISBLANK(F68),\"\",IF(FIND(F68,INDIRECT($F$75))>0,1,0)),0)","v":""},"Flat Spline No Tape",{"$f":"IFERROR(IF(ISBLANK(H68),\"\",IF(FIND(H68,INDIRECT($H$75))>0,1,0)),0)","v":0},null,{"$f":"IFERROR(IF(ISBLANK(J68),\"\",IF(FIND(J68,INDIRECT($J$75))>0,1,0)),0)","v":""},null,{"$f":"IFERROR(IF(ISBLANK(L68),\"\",IF(FIND(L68,INDIRECT($L$75))>0,1,0)),0)","v":""},null,null,null,null,null,null,null,null,null,null,null,null,null,null,null,null,"",null,null,null,null,null,null,null,null,null,null,null,null,"AU","",0,null,"",{"$f":"IF(ISNUMBER(FIND(\"x\",BD68)),IFERROR(INDEX(INDIRECT(\"T_FinishColour[ColourCode-\"&IF(ISNUMBER(FIND(\"xxx\",BD68)),\"xxx\",IF(ISNUMBER(FIND(\"xx\",BD68)),\"xx\",\"error\"))&AQ68&\"]\"),MATCH(AU68,T_FinishColour[Finish / Colour],0)),\"\"),\"\")","v":""},null,"HIDE",null,null,null,"RB92-0901-001100",null,"RB92-0901-001100","9mm ACM Flat Spline - No Tape",100,{"$f":"IF(ISBLANK(BL68),\"\",IF(OR(BL68=L_Units),\"Y\",\"N\"))","v":{"$error":"#N/A"}},"Cassette",{"$f":"IFERROR(IF(BG68=\"Y\",((INDEX(T_Deduc[Deduction],MATCH(BH68,T_Deduc[Type],0),0))),\"\"),\"\")","v":""},"i_Width",{"$f":"IFERROR(IF(BG68=\"Y\",(INDIRECT(BJ68)-BI68)/IF(Z68=\"\",1,o_nScreens),\"\"),\"\")","v":""},{"$f":"INDEX(T_UnitSelection[Units],MATCH(i_Units,T_UnitSelection[UnitSelection],0))","v":{"$error":"#N/A"}},{"$f":"IFERROR(IF(ISBLANK(BB68),\"\",INDEX(T_NAV[Base Unit of Measure],MATCH(BB68,T_NAV[No.],0))),\"\")","v":"ROLL"},1,1,{"$f":"IFERROR(INDEX(INDIRECT(\"T_NAV[\"&i_Location&\"]\"),MATCH(1,--(BB68=T_NAV[No.])*--((INDIRECT(\"T_NAV[\"&i_Location&\"]\"))<>\"\"),0))/IF(AND(BF68<>\"\",i_Units=\"Imperial\"),CONVERT(BF68,\"m\",\"in\"),IF(AND(i_Units=\"Imperial\",BM68=\"Metre\"),39.37,IF(BF68<>\"\",BF68,1))),\"\")","v":""},""]
[null,null,null,"Cassette 110",{"$f":"IFERROR(IF(ISBLANK(D69),\"\",IF(FIND(D69,INDIRECT($D$75))>0,1,0)),0)","v":0},null,{"$f":"IFERROR(IF(ISBLANK(F69),\"\",IF(FIND(F69,INDIRECT($F$75))>0,1,0)),0)","v":""},"Flat Spline DBL Side Tape x1 Side",{"$f":"IFERROR(IF(ISBLANK(H69),\"\",IF(FIND(H69,INDIRECT($H$75))>0,1,0)),0)","v":0},null,{"$f":"IFERROR(IF(ISBLANK(J69),\"\",IF(FIND(J69,INDIRECT($J$75))>0,1,0)),0)","v":""},null,{"$f":"IFERROR(IF(ISBLANK(L69),\"\",IF(FIND(L69,INDIRECT($L$75))>0,1,0)),0)","v":""},null,null,null,null,null,null,null,null,null,null,null,null,null,null,null,null,"",null,null,null,null,null,null,null,null,null,null,null,null,"AU","",0,null,"",{"$f":"IF(ISNUMBER(FIND(\"x\",BD69)),IFERROR(INDEX(INDIRECT(\"T_FinishColour[ColourCode-\"&IF(ISNUMBER(FIND(\"xxx\",BD69)),\"xxx\",IF(ISNUMBER(FIND(\"xx\",BD69)),\"xx\",\"error\"))&AQ69&\"]\"),MATCH(AU69,T_FinishColour[Finish / Colour],0)),\"\"),\"\")","v":""},null,"HIDE",null,null,null,"RB92-1003-001075",null,"RB92-1003-001075","10mm ACM Flat Spline-Dbl Side MP-HR Tape-75Lm Roll",75,{"$f":"IF(ISBLANK(BL69),\"\",IF(OR(BL69=L_Units),\"Y\",\"N\"))","v":{"$error":"#N/A"}},"Cassette",{"$f":"IFERROR(IF(BG69=\"Y\",((INDEX(T_Deduc[Deduction],MATCH(BH69,T_Deduc[Type],0),0))),\"\"),\"\")","v":""},"i_Width","",{"$f":"INDEX(T_UnitSelection[Units],MATCH(i_Units,T_UnitSelection[UnitSelection],0))","v":{"$error":"#N/A"}},{"$f":"IFERROR(IF(ISBLANK(BB69),\"\",INDEX(T_NAV[Base Unit of Measure],MATCH(BB69,T_NAV[No.],0))),\"\")","v":"ROLL"},1,1,{"$f":"IFERROR(INDEX(INDIRECT(\"T_NAV[\"&i_Location&\"]\"),MATCH(1,--(BB69=T_NAV[No.])*--((INDIRECT(\"T_NAV[\"&i_Location&\"]\"))<>\"\"),0))/IF(AND(BF69<>\"\",i_Units=\"Imperial\"),CONVERT(BF69,\"m\",\"in\"),IF(AND(i_Units=\"Imperial\",BM69=\"Metre\"),39.37,IF(BF69<>\"\",BF69,1))),\"\")","v":""},""]
[null,null,null,"Cassette 110",{"$f":"IFERROR(IF(ISBLANK(D70),\"\",IF(FIND(D70,INDIRECT($D$75))>0,1,0)),0)","v":0},null,{"$f":"IFERROR(IF(ISBLANK(F70),\"\",IF(FIND(F70,INDIRECT($F$75))>0,1,0)),0)","v":""},"Flat Spline DBL Side Tape x2 Side",{"$f":"IFERROR(IF(ISBLANK(H70),\"\",IF(FIND(H70,INDIRECT($H$75))>0,1,0)),0)","v":0},null,{"$f":"IFERROR(IF(ISBLANK(J70),\"\",IF(FIND(J70,INDIRECT($J$75))>0,1,0)),0)","v":""},null,{"$f":"IFERROR(IF(ISBLANK(L70),\"\",IF(FIND(L70,INDIRECT($L$75))>0,1,0)),0)","v":""},null,null,null,null,null,null,null,null,null,null,null,null,null,null,null,null,"",null,null,null,null,null,null,null,null,null,null,null,null,"AU","",0,null,"",{"$f":"IF(ISNUMBER(FIND(\"x\",BD70)),IFERROR(INDEX(INDIRECT(\"T_FinishColour[ColourCode-\"&IF(ISNUMBER(FIND(\"xxx\",BD70)),\"xxx\",IF(ISNUMBER(FIND(\"xx\",BD70)),\"xx\",\"error\"))&AQ70&\"]\"),MATCH(AU70,T_FinishColour[Finish / Colour],0)),\"\"),\"\")","v":""},null,"HIDE",null,null,null,"RB92-0903-001075",null,"RB92-0903-001075","9mm ACM Flat Spline - Double Sided Tape Both Sides",75,{"$f":"IF(ISBLANK(BL70),\"\",IF(OR(BL70=L_Units),\"Y\",\"N\"))","v":{"$error":"#N/A"}},"Cassette",{"$f":"IFERROR(IF(BG70=\"Y\",((INDEX(T_Deduc[Deduction],MATCH(BH70,T_Deduc[Type],0),0))),\"\"),\"\")","v":""},"i_Width","",{"$f":"INDEX(T_UnitSelection[Units],MATCH(i_Units,T_UnitSelection[UnitSelection],0))","v":{"$error":"#N/A"}},{"$f":"IFERROR(IF(ISBLANK(BB70),\"\",INDEX(T_NAV[Base Unit of Measure],MATCH(BB70,T_NAV[No.],0))),\"\")","v":"ROLL"},1,1,{"$f":"IFERROR(INDEX(INDIRECT(\"T_NAV[\"&i_Location&\"]\"),MATCH(1,--(BB70=T_NAV[No.])*--((INDIRECT(\"T_NAV[\"&i_Location&\"]\"))<>\"\"),0))/IF(AND(BF70<>\"\",i_Units=\"Imperial\"),CONVERT(BF70,\"m\",\"in\"),IF(AND(i_Units=\"Imperial\",BM70=\"Metre\"),39.37,IF(BF70<>\"\",BF70,1))),\"\")","v":""},""]
[null,null,null,null,"",null,null,null,{"$f":"IFERROR(IF(ISBLANK(H71),\"\",IF(FIND(H71,INDIRECT($H$55))>0,1,0)),0)","v":""},null,null,null,{"$f":"IFERROR(IF(ISBLANK(L71),\"\",IF(FIND(L71,INDIRECT($L$55))>0,1,0)),0)","v":""},null,null,null,null,null,null,null,null,null,null,null,null,null,null,null,null,"",null,null,null,null,null,null,null,null,null,null,null,null,null,"",null,null,"",{"$f":"IF(ISNUMBER(FIND(\"x\",BD71)),IFERROR(INDEX(INDIRECT(\"T_FinishColour[ColourCode-\"&IF(ISNUMBER(FIND(\"xxx\",BD71)),\"xxx\",IF(ISNUMBER(FIND(\"xx\",BD71)),\"xx\",\"error\"))&AQ71&\"]\"),MATCH(AU71,T_FinishColour[Finish / Colour],0)),\"\"),\"\")","v":""},null,"HIDE",null,null,null,"HD82-1904-025010",null,"HD82-1904-025010","Self Tapping Screws | Philips counter Sunk Head",null,{"$f":"IF(ISBLANK(BL71),\"\",IF(OR(BL71=L_Units),\"Y\",\"N\"))","v":"N"},null,{"$f":"IFERROR(IF(BG71=\"Y\",((INDEX(T_Deduc[Deduction],MATCH(BH71,T_Deduc[Type],0),0))),\"\"),\"\")","v":""},null,"","Piece",{"$f":"IFERROR(IF(ISBLANK(BB71),\"\",INDEX(T_NAV[Base Unit of Measure],MATCH(BB71,T_NAV[No.],0))),\"\")","v":"PIECE"},1,1,{"$f":"IFERROR(INDEX(INDIRECT(\"T_NAV[\"&i_Location&\"]\"),MATCH(1,--(BB71=T_NAV[No.])*--((INDIRECT(\"T_NAV[\"&i_Location&\"]\"))<>\"\"),0))/IF(AND(BF71<>\"\",i_Units=\"Imperial\"),CONVERT(BF71,\"m\",\"in\"),IF(AND(i_Units=\"Imperial\",BM71=\"Metre\"),39.37,IF(BF71<>\"\",BF71,1))),\"\")","v":""},""]
[null,null,null,null,null,null,null,null,null,null,null,null,null,null,null,null,null,null,null,null,null,null,null,null,null,null,null,null,null,{"$f":"IFERROR(IF(AND(o_nScreens>1,Z72=\"Y\",PRODUCT(AA72:AC72)=0),o_nScreens,IF(PRODUCT(AA72:AC72)=0,\"\",PRODUCT(AA72:AC72))),\"\")","v":""},null,null,null,null,null,null,null,null,null,null,null,null,null,{"$f":"IF(ISNUMBER(FIND(\"x\",BD72)),IFERROR(INDEX(AH72:AP72,0,MATCH(AS72,AH72:AP72,0)),IF(AH72<>\"\",AH72,i_DefaultColour)),\"\")","v":""},null,null,{"$f":"IF(ISNUMBER(FIND(\"x\",BD72)),IFERROR(INDEX(AH72:AP72,0,MATCH(AS72,AH72:AP72,0)),AR72),\"\")","v":""},{"$f":"IF(ISNUMBER(FIND(\"x\",BD72)),IFERROR(INDEX(INDIRECT(\"T_FinishColour[ColourCode-\"&IF(ISNUMBER(FIND(\"xxx\",BD72)),\"xxx\",IF(ISNUMBER(FIND(\"xx\",BD72)),\"xx\",\"error\"))&AQ72&\"]\"),MATCH(AU72,T_FinishColour[Finish / Colour],0)),\"\"),\"\")","v":""},null,"HIDE",null,null,null,{"$f":"_xlfn.IFNA(SUBSTITUTE(IF(AQ72=\"AU\",SUBSTITUTE(BD72,\"xxx\",AV72),SUBSTITUTE(SUBSTITUTE(BD72,\"xx\",AV72),\"x\",\"\")),\"LLL\",\"580\"),BD72)","v":""},null,null,null,null,{"$f":"IF(ISBLANK(BL72),\"\",IF(OR(BL72=L_Units),\"Y\",\"N\"))","v":""},null,{"$f":"IFERROR(IF(BG72=\"Y\",((INDEX(T_Deduc[Deduction],MATCH(BH72,T_Deduc[Type],0),0))),\"\"),\"\")","v":""},null,{"$f":"IFERROR(IF(BG72=\"Y\",(INDIRECT(BJ72)-BI72)/IF(Z72=\"\",1,o_nScreens),\"\"),\"\")","v":""},null,{"$f":"IFERROR(IF(ISBLANK(BB72),\"\",INDEX(T_NAV[Base Unit of Measure],MATCH(BB72,T_NAV[No.],0))),\"\")","v":""},null,{"$f":"IF(ISBLANK(BN72),\"\",PRODUCT(AD72,BN72,ShadeQuantity))","v":""},{"$f":"IFERROR(INDEX(INDIRECT(\"T_NAV[\"&i_Location&\"]\"),MATCH(1,--(BB72=T_NAV[No.])*--((INDIRECT(\"T_NAV[\"&i_Location&\"]\"))<>\"\"),0))/IF(AND(BF72<>\"\",i_Units=\"Imperial\"),CONVERT(BF72,\"m\",\"in\"),IF(AND(i_Units=\"Imperial\",BM72=\"Metre\"),39.37,IF(BF72<>\"\",BF72,1))),\"\")","v":""},""]
[null,null,null,null,null,null,null,null,null,null,null,null,null,null,null,null,null,null,null,null,null,null,null,null,null,null,null,null,null,{"$f":"IFERROR(IF(AND(o_nScreens>1,Z73=\"Y\",PRODUCT(AA73:AC73)=0),o_nScreens,IF(PRODUCT(AA73:AC73)=0,\"\",PRODUCT(AA73:AC73))),\"\")","v":""},null,null,null,null,null,null,null,null,null,null,null,null,null,{"$f":"IF(ISNUMBER(FIND(\"x\",BD73)),IFERROR(INDEX(AH73:AP73,0,MATCH(AS73,AH73:AP73,0)),IF(AH73<>\"\",AH73,i_DefaultColour)),\"\")","v":""},null,null,{"$f":"IF(ISNUMBER(FIND(\"x\",BD73)),IFERROR(INDEX(AH73:AP73,0,MATCH(AS73,AH73:AP73,0)),AR73),\"\")","v":""},{"$f":"IF(ISNUMBER(FIND(\"x\",BD73)),IFERROR(INDEX(INDIRECT(\"T_FinishColour[ColourCode-\"&IF(ISNUMBER(FIND(\"xxx\",BD73)),\"xxx\",IF(ISNUMBER(FIND(\"xx\",BD73)),\"xx\",\"error\"))&AQ73&\"]\"),MATCH(AU73,T_FinishColour[Finish / Colour],0)),\"\"),\"\")","v":""},null,{"$f":"IF(AND(ISBLANK(BD73),ISBLANK(C73)),\"HIDE\",IF(PRODUCT(C73:Y73)=1,\"SHOW\",\"HIDE\"))","v":"HIDE"},null,null,null,{"$f":"_xlfn.IFNA(SUBSTITUTE(IF(AQ73=\"AU\",SUBSTITUTE(BD73,\"xxx\",AV73),SUBSTITUTE(SUBSTITUTE(BD73,\"xx\",AV73),\"x\",\"\")),\"LLL\",\"580\"),BD73)","v":""},null,null,null,null,{"$f":"IF(ISBLANK(BL73),\"\",IF(OR(BL73=L_Units),\"Y\",\"N\"))","v":""},null,{"$f":"IFERROR(IF(BG73=\"Y\",((INDEX(T_Deduc[Deduction],MATCH(BH73,T_Deduc[Type],0),0))),\"\"),\"\")","v":""},null,{"$f":"IFERROR(IF(BG73=\"Y\",(INDIRECT(BJ73)-BI73)/IF(Z73=\"\",1,o_nScreens),\"\"),\"\")","v":""},null,{"$f":"IFERROR(IF(ISBLANK(BB73),\"\",INDEX(T_NAV[Base Unit of Measure],MATCH(BB73,T_NAV[No.],0))),\"\")","v":""},null,{"$f":"IF(ISBLANK(BN73),\"\",PRODUCT(AD73,BN73,ShadeQuantity))","v":""},{"$f":"IFERROR(INDEX(INDIRECT(\"T_NAV[\"&i_Location&\"]\"),MATCH(1,--(BB73=T_NAV[No.])*--((INDIRECT(\"T_NAV[\"&i_Location&\"]\"))<>\"\"),0))/IF(AND(BF73<>\"\",i_Units=\"Imperial\"),CONVERT(BF73,\"m\",\"in\"),IF(AND(i_Units=\"Imperial\",BM73=\"Metre\"),39.37,IF(BF73<>\"\",BF73,1))),\"\")","v":""},""]
[null,null,{"$f":"C75","v":"0"},null,null,null,null,null,null,null,null,null,null,null,null,null,null,null,null,null,null,null,null,null,null,null,null,null,null,{"$f":"IFERROR(IF(AND(o_nScreens>1,Z74=\"Y\",PRODUCT(AA74:AC74)=0),o_nScreens,IF(PRODUCT(AA74:AC74)=0,\"\",PRODUCT(AA74:AC74))),\"\")","v":""},null,null,null,null,null,null,null,null,null,null,null,null,null,{"$f":"IF(ISNUMBER(FIND(\"x\",BD74)),IFERROR(INDEX(AH74:AP74,0,MATCH(AS74,AH74:AP74,0)),IF(AH74<>\"\",AH74,i_DefaultColour)),\"\")","v":""},null,null,{"$f":"IF(ISNUMBER(FIND(\"x\",BD74)),IFERROR(INDEX(AH74:AP74,0,MATCH(AS74,AH74:AP74,0)),AR74),\"\")","v":""},{"$f":"IF(ISNUMBER(FIND(\"x\",BD74)),IFERROR(INDEX(INDIRECT(\"T_FinishColour[ColourCode-\"&IF(ISNUMBER(FIND(\"xxx\",BD74)),\"xxx\",IF(ISNUMBER(FIND(\"xx\",BD74)),\"xx\",\"error\"))&AQ74&\"]\"),MATCH(AU74,T_FinishColour[Finish / Colour],0)),\"\"),\"\")","v":""},null,"HIDE",null,null,null,{"$f":"_xlfn.IFNA(SUBSTITUTE(IF(AQ74=\"AU\",SUBSTITUTE(BD74,\"xxx\",AV74),SUBSTITUTE(SUBSTITUTE(BD74,\"xx\",AV74),\"x\",\"\")),\"LLL\",\"580\"),BD74)","v":""},null,null,null,null,{"$f":"IF(ISBLANK(BL74),\"\",IF(OR(BL74=L_Units),\"Y\",\"N\"))","v":""},null,{"$f":"IFERROR(IF(BG74=\"Y\",((INDEX(T_Deduc[Deduction],MATCH(BH74,T_Deduc[Type],0),0))),\"\"),\"\")","v":""},null,{"$f":"IFERROR(IF(BG74=\"Y\",(INDIRECT(BJ74)-BI74)/IF(Z74=\"\",1,o_nScreens),\"\"),\"\")","v":""},null,{"$f":"IFERROR(IF(ISBLANK(BB74),\"\",INDEX(T_NAV[Base Unit of Measure],MATCH(BB74,T_NAV[No.],0))),\"\")","v":""},null,{"$f":"IF(ISBLANK(BN74),\"\",PRODUCT(AD74,BN74,ShadeQuantity))","v":""},{"$f":"IFERROR(INDEX(INDIRECT(\"T_NAV[\"&i_Location&\"]\"),MATCH(1,--(BB74=T_NAV[No.])*--((INDIRECT(\"T_NAV[\"&i_Location&\"]\"))<>\"\"),0))/IF(AND(BF74<>\"\",i_Units=\"Imperial\"),CONVERT(BF74,\"m\",\"in\"),IF(AND(i_Units=\"Imperial\",BM74=\"Metre\"),39.37,IF(BF74<>\"\",BF74,1))),\"\")","v":""},""]
[null,null,{"$f":"IF(INDIRECT($D$75)=$D$76,1,\"0\")","v":"0"},"i_InstallationType",null,"i_FixingOptions",null,"i_PelmetSpline",null,"i_BracketOptions",null,null,null,null,null,null,null,null,null,null,null,null,null,null,null,null,null,null,null,{"$f":"IFERROR(IF(AND(o_nScreens>1,Z75=\"Y\",PRODUCT(AA75:AC75)=0),o_nScreens,IF(PRODUCT(AA75:AC75)=0,\"\",PRODUCT(AA75:AC75))),\"\")","v":""},null,null,null,null,null,null,null,null,null,null,null,null,null,{"$f":"IF(ISNUMBER(FIND(\"x\",BD75)),IFERROR(INDEX(AH75:AP75,0,MATCH(AS75,AH75:AP75,0)),IF(AH75<>\"\",AH75,i_DefaultColour)),\"\")","v":""},null,null,{"$f":"IF(ISNUMBER(FIND(\"x\",BD75)),IFERROR(INDEX(AH75:AP75,0,MATCH(AS75,AH75:AP75,0)),AR75),\"\")","v":""},{"$f":"IF(ISNUMBER(FIND(\"x\",BD75)),IFERROR(INDEX(INDIRECT(\"T_FinishColour[ColourCode-\"&IF(ISNUMBER(FIND(\"xxx\",BD75)),\"xxx\",IF(ISNUMBER(FIND(\"xx\",BD75)),\"xx\",\"error\"))&AQ75&\"]\"),MATCH(AU75,T_FinishColour[Finish / Colour],0)),\"\"),\"\")","v":""},null,"HIDE",null,null,null,{"$f":"_xlfn.IFNA(SUBSTITUTE(IF(AQ75=\"AU\",SUBSTITUTE(BD75,\"xxx\",AV75),SUBSTITUTE(SUBSTITUTE(BD75,\"xx\",AV75),\"x\",\"\")),\"LLL\",\"580\"),BD75)","v":"P95 SEMI CASSETTE"},null,"P95 SEMI CASSETTE",null,null,null,null,{"$f":"IFERROR(IF(BG75=\"Y\",((INDEX(T_Deduc[Deduction],MATCH(BH75,T_Deduc[Type],0),0))),\"\"),\"\")","v":""},null,{"$f":"IFERROR(IF(BG75=\"Y\",(INDIRECT(BJ75)-BI75)/IF(Z75=\"\",1,o_nScreens),\"\"),\"\")","v":""},null,{"$f":"IFERROR(IF(ISBLANK(BB75),\"\",INDEX(T_NAV[Base Unit of Measure],MATCH(BB75,T_NAV[No.],0))),\"\")","v":""},null,{"$f":"IF(ISBLANK(BN75),\"\",PRODUCT(AD75,BN75,ShadeQuantity))","v":""},{"$f":"IFERROR(INDEX(INDIRECT(\"T_NAV[\"&i_Location&\"]\"),MATCH(1,--(BB75=T_NAV[No.])*--((INDIRECT(\"T_NAV[\"&i_Location&\"]\"))<>\"\"),0))/IF(AND(BF75<>\"\",i_Units=\"Imperial\"),CONVERT(BF75,\"m\",\"in\"),IF(AND(i_Units=\"Imperial\",BM75=\"Metre\"),39.37,IF(BF75<>\"\",BF75,1))),\"\")","v":""},""]
[null,null,null,"P95",{"$f":"IFERROR(IF(ISBLANK(D76),\"\",IF(FIND(D76,INDIRECT($D$75))>0,1,0)),0)","v":0},null,{"$f":"IFERROR(IF(ISBLANK(F76),\"\",IF(FIND(F76,INDIRECT($F$75))>0,1,0)),0)","v":""},null,{"$f":"IFERROR(IF(ISBLANK(H76),\"\",IF(FIND(H76,INDIRECT($H$75))>0,1,0)),0)","v":""},null,{"$f":"IFERROR(IF(ISBLANK(J76),\"\",IF(FIND(J76,INDIRECT($J$75))>0,1,0)),0)","v":""},null,{"$f":"IFERROR(IF(ISBLANK(L76),\"\",IF(FIND(L76,INDIRECT($L$75))>0,1,0)),0)","v":""},null,null,null,null,null,null,null,null,null,null,null,null,"Y",null,null,null,null,null,null,null,"White","Anodised","Mill",null,null,null,null,null,null,"AU",{"$f":"IF(ISNUMBER(FIND(\"x\",BD76)),IFERROR(INDEX(AH76:AP76,0,MATCH(AS76,AH76:AP76,0)),IF(AH76<>\"\",AH76,i_DefaultColour)),\"\")","v":"White"},{"$f":"i_Colour","v":0},null,{"$f":"IF(ISNUMBER(FIND(\"x\",BD76)),IFERROR(INDEX(AH76:AP76,0,MATCH(AS76,AH76:AP76,0)),AR76),\"\")","v":"White"},{"$f":"IF(ISNUMBER(FIND(\"x\",BD76)),IFERROR(INDEX(INDIRECT(\"T_FinishColour[ColourCode-\"&IF(ISNUMBER(FIND(\"xxx\",BD76)),\"xxx\",IF(ISNUMBER(FIND(\"xx\",BD76)),\"xx\",\"error\"))&AQ76&\"]\"),MATCH(AU76,T_FinishColour[Finish / Colour],0)),\"\"),\"\")","v":"069"},null,"HIDE",null,null,null,{"$f":"_xlfn.IFNA(SUBSTITUTE(IF(AQ76=\"AU\",SUBSTITUTE(BD76,\"xxx\",AV76),SUBSTITUTE(SUBSTITUTE(BD76,\"xx\",AV76),\"x\",\"\")),\"LLL\",BF76*100),BD76)","v":"RB88-0150-069580"},null,"RB88-0150-xxx580",{"$f":"IF(OR(i_Location=\"AU\",i_Location=\"EU\"),\"P95 Semi Cassette - Base 50 5.8m\",\"P95 Semi Cassette - Base 50 LX 4.87m | 16ft\")","v":"P95 Semi Cassette - Base 50 LX 4.87m | 16ft"},{"$f":"IF(OR(i_Location=\"AU\",i_Location=\"EU\"),5.8,4.9)","v":4.9000000000000004},{"$f":"IF(ISBLANK(BL76),\"\",IF(OR(BL76=L_Units),\"Y\",\"N\"))","v":{"$error":"#N/A"}},"Mounting Rail",{"$f":"IFERROR(IF(BG76=\"Y\",((INDEX(T_Deduc[Deduction],MATCH(BH76,T_Deduc[Type],0),0))),\"\"),\"\")","v":""},"i_Width",{"$f":"IFERROR(IF(BG76=\"Y\",(INDIRECT(BJ76)-BI76)/IF(Z76=\"\",1,o_nScreens),\"\"),\"\")","v":""},{"$f":"INDEX(T_UnitSelection[Units],MATCH(i_Units,T_UnitSelection[UnitSelection],0))","v":{"$error":"#N/A"}},"LENGTH",1,{"$f":"IF(ISBLANK(BN76),\"\",PRODUCT(AD76,BN76,ShadeQuantity))","v":1},{"$f":"IFERROR(INDEX(INDIRECT(\"T_NAV[\"&i_Location&\"]\"),MATCH(1,--(BB76=T_NAV[No.])*--((INDIRECT(\"T_NAV[\"&i_Location&\"]\"))<>\"\"),0))/IF(AND(BF76<>\"\",i_Units=\"Imperial\"),CONVERT(BF76,\"m\",\"in\"),IF(AND(i_Units=\"Imperial\",BM76=\"Metre\"),39.37,IF(BF76<>\"\",BF76,1))),\"\")","v":""},""]
[null,null,null,"P95",0,"Universal",0,null,"",null,"",null,"",null,null,null,null,null,null,null,null,null,null,null,null,null,null,null,null,{"$f":"IFERROR(IF(AND(o_nScreens>1,Z77=\"Y\",PRODUCT(AA77:AC77)=0),o_nScreens,IF(PRODUCT(AA77:AC77)=0,\"\",PRODUCT(AA77:AC77))),\"\")","v":""},null,null,null,"White","Silver Grey",null,null,null,null,null,null,null,"AU",{"$f":"IF(ISNUMBER(FIND(\"x\",BD77)),IFERROR(INDEX(AH77:AP77,0,MATCH(AS77,AH77:AP77,0)),IF(AH77<>\"\",AH77,i_DefaultColour)),\"\")","v":""},0,null,{"$f":"IF(ISNUMBER(FIND(\"x\",BD77)),IFERROR(INDEX(AH77:AP77,0,MATCH(AS77,AH77:AP77,0)),AR77),\"\")","v":""},{"$f":"IF(ISNUMBER(FIND(\"x\",BD77)),IFERROR(INDEX(INDIRECT(\"T_FinishColour[ColourCode-\"&IF(ISNUMBER(FIND(\"xxx\",BD77)),\"xxx\",IF(ISNUMBER(FIND(\"xx\",BD77)),\"xx\",\"error\"))&AQ77&\"]\"),MATCH(AU77,T_FinishColour[Finish / Colour],0)),\"\"),\"\")","v":""},null,"HIDE",null,null,null,{"$f":"_xlfn.IFNA(SUBSTITUTE(IF(AQ77=\"AU\",SUBSTITUTE(BD77,\"xxx\",AV77),SUBSTITUTE(SUBSTITUTE(BD77,\"xx\",AV77),\"x\",\"\")),\"LLL\",\"580\"),BD77)","v":"RB88-0122-025001"},null,"RB88-0122-025001","P95 Semi Cassette - Spring Loaded Bracket - Universal Fix",null,{"$f":"IF(ISBLANK(BL77),\"\",IF(OR(BL77=L_Units),\"Y\",\"N\"))","v":"N"},null,{"$f":"IFERROR(IF(BG77=\"Y\",((INDEX(T_Deduc[Deduction],MATCH(BH77,T_Deduc[Type],0),0))),\"\"),\"\")","v":""},null,{"$f":"IFERROR(IF(BG77=\"Y\",(INDIRECT(BJ77)-BI77)/IF(Z77=\"\",1,o_nScreens),\"\"),\"\")","v":""},"Piece",{"$f":"IFERROR(IF(ISBLANK(BB77),\"\",INDEX(T_NAV[Base Unit of Measure],MATCH(BB77,T_NAV[No.],0))),\"\")","v":"PIECE"},2,{"$f":"IF(ISBLANK(BN77),\"\",PRODUCT(AD77,BN77,ShadeQuantity))","v":2},{"$f":"IFERROR(INDEX(INDIRECT(\"T_NAV[\"&i_Location&\"]\"),MATCH(1,--(BB77=T_NAV[No.])*--((INDIRECT(\"T_NAV[\"&i_Location&\"]\"))<>\"\"),0))/IF(AND(BF77<>\"\",i_Units=\"Imperial\"),CONVERT(BF77,\"m\",\"in\"),IF(AND(i_Units=\"Imperial\",BM77=\"Metre\"),39.37,IF(BF77<>\"\",BF77,1))),\"\")","v":""},""]
[null,null,null,"P95",0,"Top",{"$f":"IFERROR(IF(ISBLANK(F78),\"\",IF(FIND(F78,INDIRECT($F$75))>0,1,0)),0)","v":0},null,"",null,"",null,"",null,null,null,null,null,null,null,null,null,null,null,null,null,null,null,null,{"$f":"IFERROR(IF(AND(o_nScreens>1,Z78=\"Y\",PRODUCT(AA78:AC78)=0),o_nScreens,IF(PRODUCT(AA78:AC78)=0,\"\",PRODUCT(AA78:AC78))),\"\")","v":""},null,null,null,"White","Silver Grey",null,null,null,null,null,null,null,"AU",{"$f":"IF(ISNUMBER(FIND(\"x\",BD78)),IFERROR(INDEX(AH78:AP78,0,MATCH(AS78,AH78:AP78,0)),IF(AH78<>\"\",AH78,i_DefaultColour)),\"\")","v":""},0,null,{"$f":"IF(ISNUMBER(FIND(\"x\",BD78)),IFERROR(INDEX(AH78:AP78,0,MATCH(AS78,AH78:AP78,0)),AR78),\"\")","v":""},{"$f":"IF(ISNUMBER(FIND(\"x\",BD78)),IFERROR(INDEX(INDIRECT(\"T_FinishColour[ColourCode-\"&IF(ISNUMBER(FIND(\"xxx\",BD78)),\"xxx\",IF(ISNUMBER(FIND(\"xx\",BD78)),\"xx\",\"error\"))&AQ78&\"]\"),MATCH(AU78,T_FinishColour[Finish / Colour],0)),\"\"),\"\")","v":""},null,"HIDE",null,null,null,{"$f":"_xlfn.IFNA(SUBSTITUTE(IF(AQ78=\"AU\",SUBSTITUTE(BD78,\"xxx\",AV78),SUBSTITUTE(SUBSTITUTE(BD78,\"xx\",AV78),\"x\",\"\")),\"LLL\",\"580\"),BD78)","v":"RB88-0121-025001"},null,"RB88-0121-025001","P95 Semi Cassette - Spring Loaded Bracket - Top/Ceiling Fix",null,{"$f":"IF(ISBLANK(BL78),\"\",IF(OR(BL78=L_Units),\"Y\",\"N\"))","v":"N"},null,{"$f":"IFERROR(IF(BG78=\"Y\",((INDEX(T_Deduc[Deduction],MATCH(BH78,T_Deduc[Type],0),0))),\"\"),\"\")","v":""},null,{"$f":"IFERROR(IF(BG78=\"Y\",(INDIRECT(BJ78)-BI78)/IF(Z78=\"\",1,o_nScreens),\"\"),\"\")","v":""},"Piece",{"$f":"IFERROR(IF(ISBLANK(BB78),\"\",INDEX(T_NAV[Base Unit of Measure],MATCH(BB78,T_NAV[No.],0))),\"\")","v":"PIECE"},2,{"$f":"IF(ISBLANK(BN78),\"\",PRODUCT(AD78,BN78,ShadeQuantity))","v":2},{"$f":"IFERROR(INDEX(INDIRECT(\"T_NAV[\"&i_Location&\"]\"),MATCH(1,--(BB78=T_NAV[No.])*--((INDIRECT(\"T_NAV[\"&i_Location&\"]\"))<>\"\"),0))/IF(AND(BF78<>\"\",i_Units=\"Imperial\"),CONVERT(BF78,\"m\",\"in\"),IF(AND(i_Units=\"Imperial\",BM78=\"Metre\"),39.37,IF(BF78<>\"\",BF78,1))),\"\")","v":""},""]
[null,null,null,"P95",0,null,"",null,"",null,"",null,"",null,null,null,null,null,null,null,null,null,null,null,null,null,null,null,null,{"$f":"IFERROR(IF(AND(o_nScreens>1,Z79=\"Y\",PRODUCT(AA79:AC79)=0),o_nScreens,IF(PRODUCT(AA79:AC79)=0,\"\",PRODUCT(AA79:AC79))),\"\")","v":""},null,null,null,null,null,null,null,null,null,null,null,null,"AU",{"$f":"IF(ISNUMBER(FIND(\"x\",BD79)),IFERROR(INDEX(AH79:AP79,0,MATCH(AS79,AH79:AP79,0)),IF(AH79<>\"\",AH79,i_DefaultColour)),\"\")","v":"White"},0,null,{"$f":"IF(ISNUMBER(FIND(\"x\",BD79)),IFERROR(INDEX(AH79:AP79,0,MATCH(AS79,AH79:AP79,0)),AR79),\"\")","v":"White"},{"$f":"IF(ISNUMBER(FIND(\"x\",BD79)),IFERROR(INDEX(INDIRECT(\"T_FinishColour[ColourCode-\"&IF(ISNUMBER(FIND(\"xxx\",BD79)),\"xxx\",IF(ISNUMBER(FIND(\"xx\",BD79)),\"xx\",\"error\"))&AQ79&\"]\"),MATCH(AU79,T_FinishColour[Finish / Colour],0)),\"\"),\"\")","v":"069"},null,"HIDE",null,null,null,{"$f":"_xlfn.IFNA(SUBSTITUTE(IF(AQ79=\"AU\",SUBSTITUTE(BD79,\"xxx\",AV79),SUBSTITUTE(SUBSTITUTE(BD79,\"xx\",AV79),\"x\",\"\")),\"LLL\",\"580\"),BD79)","v":"RB88-0101-069001"},null,"RB88-0101-xxx001","P95 Semi Cassette - End Cap Set + Fixing Screws",null,{"$f":"IF(ISBLANK(BL79),\"\",IF(OR(BL79=L_Units),\"Y\",\"N\"))","v":"N"},null,{"$f":"IFERROR(IF(BG79=\"Y\",((INDEX(T_Deduc[Deduction],MATCH(BH79,T_Deduc[Type],0),0))),\"\"),\"\")","v":""},null,{"$f":"IFERROR(IF(BG79=\"Y\",(INDIRECT(BJ79)-BI79)/IF(Z79=\"\",1,o_nScreens),\"\"),\"\")","v":""},"Set",{"$f":"IFERROR(IF(ISBLANK(BB79),\"\",INDEX(T_NAV[Base Unit of Measure],MATCH(BB79,T_NAV[No.],0))),\"\")","v":"SET"},1,{"$f":"IF(ISBLANK(BN79),\"\",PRODUCT(AD79,BN79,ShadeQuantity))","v":1},{"$f":"IFERROR(INDEX(INDIRECT(\"T_NAV[\"&i_Location&\"]\"),MATCH(1,--(BB79=T_NAV[No.])*--((INDIRECT(\"T_NAV[\"&i_Location&\"]\"))<>\"\"),0))/IF(AND(BF79<>\"\",i_Units=\"Imperial\"),CONVERT(BF79,\"m\",\"in\"),IF(AND(i_Units=\"Imperial\",BM79=\"Metre\"),39.37,IF(BF79<>\"\",BF79,1))),\"\")","v":""},""]
[null,null,null,"P95",0,null,"","4.1mm",0,null,"",null,"",null,null,null,null,null,null,null,null,null,null,null,null,null,null,null,null,{"$f":"IFERROR(IF(AND(o_nScreens>1,Z80=\"Y\",PRODUCT(AA80:AC80)=0),o_nScreens,IF(PRODUCT(AA80:AC80)=0,\"\",PRODUCT(AA80:AC80))),\"\")","v":""},null,null,null,null,null,null,null,null,null,null,null,null,"AU",{"$f":"IF(ISNUMBER(FIND(\"x\",BD80)),IFERROR(INDEX(AH80:AP80,0,MATCH(AS80,AH80:AP80,0)),IF(AH80<>\"\",AH80,i_DefaultColour)),\"\")","v":""},0,null,{"$f":"IF(ISNUMBER(FIND(\"x\",BD80)),IFERROR(INDEX(AH80:AP80,0,MATCH(AS80,AH80:AP80,0)),AR80),\"\")","v":""},{"$f":"IF(ISNUMBER(FIND(\"x\",BD80)),IFERROR(INDEX(INDIRECT(\"T_FinishColour[ColourCode-\"&IF(ISNUMBER(FIND(\"xxx\",BD80)),\"xxx\",IF(ISNUMBER(FIND(\"xx\",BD80)),\"xx\",\"error\"))&AQ80&\"]\"),MATCH(AU80,T_FinishColour[Finish / Colour],0)),\"\"),\"\")","v":""},null,"HIDE",null,null,null,{"$f":"_xlfn.IFNA(SUBSTITUTE(IF(AQ80=\"AU\",SUBSTITUTE(BD80,\"xxx\",AV80),SUBSTITUTE(SUBSTITUTE(BD80,\"xx\",AV80),\"x\",\"\")),\"LLL\",\"580\"),BD80)","v":"SS91-5241-050500"},null,"SS91-5241-050500","Ribbed Round Spline - 4.1mm x 500m Roll",null,{"$f":"IF(ISBLANK(BL80),\"\",IF(OR(BL80=L_Units),\"Y\",\"N\"))","v":{"$error":"#N/A"}},"Mounting Rail",{"$f":"IFERROR(IF(BG80=\"Y\",((INDEX(T_Deduc[Deduction],MATCH(BH80,T_Deduc[Type],0),0))),\"\"),\"\")","v":""},"i_Width",{"$f":"IFERROR(IF(BG80=\"Y\",(INDIRECT(BJ80)-BI80)/IF(Z80=\"\",1,o_nScreens),\"\"),\"\")","v":""},{"$f":"INDEX(T_UnitSelection[Units],MATCH(i_Units,T_UnitSelection[UnitSelection],0))","v":{"$error":"#N/A"}},{"$f":"IFERROR(IF(ISBLANK(BB80),\"\",INDEX(T_NAV[Base Unit of Measure],MATCH(BB80,T_NAV[No.],0))),\"\")","v":"METRE"},1,{"$f":"IF(ISBLANK(BN80),\"\",PRODUCT(AD80,BN80,ShadeQuantity))","v":1},{"$f":"IFERROR(INDEX(INDIRECT(\"T_NAV[\"&i_Location&\"]\"),MATCH(1,--(BB80=T_NAV[No.])*--((INDIRECT(\"T_NAV[\"&i_Location&\"]\"))<>\"\"),0))/IF(AND(BF80<>\"\",i_Units=\"Imperial\"),CONVERT(BF80,\"m\",\"in\"),IF(AND(i_Units=\"Imperial\",BM80=\"Metre\"),39.37,IF(BF80<>\"\",BF80,1))),\"\")","v":""},""]
[null,null,null,"P95",0,null,"","4.6mm",0,null,"",null,"",null,null,null,null,null,null,null,null,null,null,null,null,null,null,null,null,"",null,null,null,null,null,null,null,null,null,null,null,null,"AU","",0,null,"",{"$f":"IF(ISNUMBER(FIND(\"x\",BD81)),IFERROR(INDEX(INDIRECT(\"T_FinishColour[ColourCode-\"&IF(ISNUMBER(FIND(\"xxx\",BD81)),\"xxx\",IF(ISNUMBER(FIND(\"xx\",BD81)),\"xx\",\"error\"))&AQ81&\"]\"),MATCH(AU81,T_FinishColour[Finish / Colour],0)),\"\"),\"\")","v":""},null,"HIDE",null,null,null,{"$f":"_xlfn.IFNA(SUBSTITUTE(IF(AQ81=\"AU\",SUBSTITUTE(BD81,\"xxx\",AV81),SUBSTITUTE(SUBSTITUTE(BD81,\"xx\",AV81),\"x\",\"\")),\"LLL\",\"580\"),BD81)","v":"SS91-5246-050300"},null,"SS91-5246-050300","Ribbed Round Spline - 4.6mm x 300m Roll",null,{"$f":"IF(ISBLANK(BL81),\"\",IF(OR(BL81=L_Units),\"Y\",\"N\"))","v":{"$error":"#N/A"}},"Mounting Rail",{"$f":"IFERROR(IF(BG81=\"Y\",((INDEX(T_Deduc[Deduction],MATCH(BH81,T_Deduc[Type],0),0))),\"\"),\"\")","v":""},"i_Width",{"$f":"IFERROR(IF(BG81=\"Y\",(INDIRECT(BJ81)-BI81)/IF(Z81=\"\",1,o_nScreens),\"\"),\"\")","v":""},{"$f":"INDEX(T_UnitSelection[Units],MATCH(i_Units,T_UnitSelection[UnitSelection],0))","v":{"$error":"#N/A"}},{"$f":"IFERROR(IF(ISBLANK(BB81),\"\",INDEX(T_NAV[Base Unit of Measure],MATCH(BB81,T_NAV[No.],0))),\"\")","v":"METRE"},1,{"$f":"IF(ISBLANK(BN81),\"\",PRODUCT(AD81,BN81,ShadeQuantity))","v":1},{"$f":"IFERROR(INDEX(INDIRECT(\"T_NAV[\"&i_Location&\"]\"),MATCH(1,--(BB81=T_NAV[No.])*--((INDIRECT(\"T_NAV[\"&i_Location&\"]\"))<>\"\"),0))/IF(AND(BF81<>\"\",i_Units=\"Imperial\"),CONVERT(BF81,\"m\",\"in\"),IF(AND(i_Units=\"Imperial\",BM81=\"Metre\"),39.37,IF(BF81<>\"\",BF81,1))),\"\")","v":""},""]
[null,null,null,"P95",0,null,"","Flat Spline No Tape",0,null,"",null,"",null,null,null,null,null,null,null,null,null,null,null,null,null,null,null,null,"",null,null,null,null,null,null,null,null,null,null,null,null,"AU","",0,null,"",{"$f":"IF(ISNUMBER(FIND(\"x\",BD82)),IFERROR(INDEX(INDIRECT(\"T_FinishColour[ColourCode-\"&IF(ISNUMBER(FIND(\"xxx\",BD82)),\"xxx\",IF(ISNUMBER(FIND(\"xx\",BD82)),\"xx\",\"error\"))&AQ82&\"]\"),MATCH(AU82,T_FinishColour[Finish / Colour],0)),\"\"),\"\")","v":""},null,"HIDE",null,null,null,{"$f":"_xlfn.IFNA(SUBSTITUTE(IF(AQ82=\"AU\",SUBSTITUTE(BD82,\"xxx\",AV82),SUBSTITUTE(SUBSTITUTE(BD82,\"xx\",AV82),\"x\",\"\")),\"LLL\",\"580\"),BD82)","v":"RB92-0901-001100"},null,"RB92-0901-001100","9mm ACM Flat Spline - No Tape",100,{"$f":"IF(ISBLANK(BL82),\"\",IF(OR(BL82=L_Units),\"Y\",\"N\"))","v":{"$error":"#N/A"}},"Mounting Rail",{"$f":"IFERROR(IF(BG82=\"Y\",((INDEX(T_Deduc[Deduction],MATCH(BH82,T_Deduc[Type],0),0))),\"\"),\"\")","v":""},"i_Width","",{"$f":"INDEX(T_UnitSelection[Units],MATCH(i_Units,T_UnitSelection[UnitSelection],0))","v":{"$error":"#N/A"}},{"$f":"IFERROR(IF(ISBLANK(BB82),\"\",INDEX(T_NAV[Base Unit of Measure],MATCH(BB82,T_NAV[No.],0))),\"\")","v":"ROLL"},1,{"$f":"IF(ISBLANK(BN82),\"\",PRODUCT(AD82,BN82,ShadeQuantity))","v":1},{"$f":"IFERROR(INDEX(INDIRECT(\"T_NAV[\"&i_Location&\"]\"),MATCH(1,--(BB82=T_NAV[No.])*--((INDIRECT(\"T_NAV[\"&i_Location&\"]\"))<>\"\"),0))/IF(AND(BF82<>\"\",i_Units=\"Imperial\"),CONVERT(BF82,\"m\",\"in\"),IF(AND(i_Units=\"Imperial\",BM82=\"Metre\"),39.37,IF(BF82<>\"\",BF82,1))),\"\")","v":""},""]
[null,null,null,"P95",0,null,"","Flat Spline DBL Side Tape x1 Side",0,null,"",null,"",null,null,null,null,null,null,null,null,null,null,null,null,null,null,null,null,"",null,null,null,null,null,null,null,null,null,null,null,null,"AU","",0,null,"",{"$f":"IF(ISNUMBER(FIND(\"x\",BD83)),IFERROR(INDEX(INDIRECT(\"T_FinishColour[ColourCode-\"&IF(ISNUMBER(FIND(\"xxx\",BD83)),\"xxx\",IF(ISNUMBER(FIND(\"xx\",BD83)),\"xx\",\"error\"))&AQ83&\"]\"),MATCH(AU83,T_FinishColour[Finish / Colour],0)),\"\"),\"\")","v":""},null,"HIDE",null,null,null,{"$f":"_xlfn.IFNA(SUBSTITUTE(IF(AQ83=\"AU\",SUBSTITUTE(BD83,\"xxx\",AV83),SUBSTITUTE(SUBSTITUTE(BD83,\"xx\",AV83),\"x\",\"\")),\"LLL\",\"580\"),BD83)","v":"RB92-0902-001075"},null,"RB92-0902-001075","9mm ACM Flat Spline - Double Sided Tape 1 Side",75,{"$f":"IF(ISBLANK(BL83),\"\",IF(OR(BL83=L_Units),\"Y\",\"N\"))","v":{"$error":"#N/A"}},"Mounting Rail",{"$f":"IFERROR(IF(BG83=\"Y\",((INDEX(T_Deduc[Deduction],MATCH(BH83,T_Deduc[Type],0),0))),\"\"),\"\")","v":""},"i_Width",{"$f":"IFERROR(IF(BG83=\"Y\",(INDIRECT(BJ83)-BI83)/IF(Z83=\"\",1,o_nScreens),\"\"),\"\")","v":""},{"$f":"INDEX(T_UnitSelection[Units],MATCH(i_Units,T_UnitSelection[UnitSelection],0))","v":{"$error":"#N/A"}},{"$f":"IFERROR(IF(ISBLANK(BB83),\"\",INDEX(T_NAV[Base Unit of Measure],MATCH(BB83,T_NAV[No.],0))),\"\")","v":"ROLL"},1,{"$f":"IF(ISBLANK(BN83),\"\",PRODUCT(AD83,BN83,ShadeQuantity))","v":1},{"$f":"IFERROR(INDEX(INDIRECT(\"T_NAV[\"&i_Location&\"]\"),MATCH(1,--(BB83=T_NAV[No.])*--((INDIRECT(\"T_NAV[\"&i_Location&\"]\"))<>\"\"),0))/IF(AND(BF83<>\"\",i_Units=\"Imperial\"),CONVERT(BF83,\"m\",\"in\"),IF(AND(i_Units=\"Imperial\",BM83=\"Metre\"),39.37,IF(BF83<>\"\",BF83,1))),\"\")","v":""},""]
[null,null,null,"P95",0,null,"","Flat Spline DBL Side Tape x2 Side",0,null,"",null,"",null,null,null,null,null,null,null,null,null,null,null,null,null,null,null,null,"",null,null,null,null,null,null,null,null,null,null,null,null,"AU","",0,null,"",{"$f":"IF(ISNUMBER(FIND(\"x\",BD84)),IFERROR(INDEX(INDIRECT(\"T_FinishColour[ColourCode-\"&IF(ISNUMBER(FIND(\"xxx\",BD84)),\"xxx\",IF(ISNUMBER(FIND(\"xx\",BD84)),\"xx\",\"error\"))&AQ84&\"]\"),MATCH(AU84,T_FinishColour[Finish / Colour],0)),\"\"),\"\")","v":""},null,"HIDE",null,null,null,{"$f":"_xlfn.IFNA(SUBSTITUTE(IF(AQ84=\"AU\",SUBSTITUTE(BD84,\"xxx\",AV84),SUBSTITUTE(SUBSTITUTE(BD84,\"xx\",AV84),\"x\",\"\")),\"LLL\",\"580\"),BD84)","v":"RB92-0903-001075"},null,"RB92-0903-001075","9mm ACM Flat Spline - Double Sided Tape Both Sides",75,{"$f":"IF(ISBLANK(BL84),\"\",IF(OR(BL84=L_Units),\"Y\",\"N\"))","v":{"$error":"#N/A"}},"Mounting Rail",{"$f":"IFERROR(IF(BG84=\"Y\",((INDEX(T_Deduc[Deduction],MATCH(BH84,T_Deduc[Type],0),0))),\"\"),\"\")","v":""},"i_Width","",{"$f":"INDEX(T_UnitSelection[Units],MATCH(i_Units,T_UnitSelection[UnitSelection],0))","v":{"$error":"#N/A"}},{"$f":"IFERROR(IF(ISBLANK(BB84),\"\",INDEX(T_NAV[Base Unit of Measure],MATCH(BB84,T_NAV[No.],0))),\"\")","v":"ROLL"},1,{"$f":"IF(ISBLANK(BN84),\"\",PRODUCT(AD84,BN84,ShadeQuantity))","v":1},{"$f":"IFERROR(INDEX(INDIRECT(\"T_NAV[\"&i_Location&\"]\"),MATCH(1,--(BB84=T_NAV[No.])*--((INDIRECT(\"T_NAV[\"&i_Location&\"]\"))<>\"\"),0))/IF(AND(BF84<>\"\",i_Units=\"Imperial\"),CONVERT(BF84,\"m\",\"in\"),IF(AND(i_Units=\"Imperial\",BM84=\"Metre\"),39.37,IF(BF84<>\"\",BF84,1))),\"\")","v":""},""]
[null,null,null,"P95",0,null,"",null,"","LX Limiter",0,null,"",null,null,null,null,null,null,null,null,null,null,null,null,null,null,null,null,"",null,null,null,null,null,null,null,null,null,null,null,null,"AU","",0,null,"",{"$f":"IF(ISNUMBER(FIND(\"x\",BD85)),IFERROR(INDEX(INDIRECT(\"T_FinishColour[ColourCode-\"&IF(ISNUMBER(FIND(\"xxx\",BD85)),\"xxx\",IF(ISNUMBER(FIND(\"xx\",BD85)),\"xx\",\"error\"))&AQ85&\"]\"),MATCH(AU85,T_FinishColour[Finish / Colour],0)),\"\"),\"\")","v":""},null,"HIDE",null,null,null,{"$f":"_xlfn.IFNA(SUBSTITUTE(IF(AQ85=\"AU\",SUBSTITUTE(BD85,\"xxx\",AV85),SUBSTITUTE(SUBSTITUTE(BD85,\"xx\",AV85),\"x\",\"\")),\"LLL\",\"580\"),BD85)","v":"RB12-2503-069140"},null,"RB12-2503-069140","Single Stop Limiter LX Bracket Set",null,{"$f":"IF(ISBLANK(BL85),\"\",IF(OR(BL85=L_Units),\"Y\",\"N\"))","v":"N"},null,{"$f":"IFERROR(IF(BG85=\"Y\",((INDEX(T_Deduc[Deduction],MATCH(BH85,T_Deduc[Type],0),0))),\"\"),\"\")","v":""},null,{"$f":"IFERROR(IF(BG85=\"Y\",(INDIRECT(BJ85)-BI85)/IF(Z85=\"\",1,o_nScreens),\"\"),\"\")","v":""},"Set",{"$f":"IFERROR(IF(ISBLANK(BB85),\"\",INDEX(T_NAV[Base Unit of Measure],MATCH(BB85,T_NAV[No.],0))),\"\")","v":"SET"},1,{"$f":"IF(ISBLANK(BN85),\"\",PRODUCT(AD85,BN85,ShadeQuantity))","v":1},{"$f":"IFERROR(INDEX(INDIRECT(\"T_NAV[\"&i_Location&\"]\"),MATCH(1,--(BB85=T_NAV[No.])*--((INDIRECT(\"T_NAV[\"&i_Location&\"]\"))<>\"\"),0))/IF(AND(BF85<>\"\",i_Units=\"Imperial\"),CONVERT(BF85,\"m\",\"in\"),IF(AND(i_Units=\"Imperial\",BM85=\"Metre\"),39.37,IF(BF85<>\"\",BF85,1))),\"\")","v":""},""]
[null,null,null,"P95",0,null,"",null,"","LX Skyline",{"$f":"IFERROR(IF(ISBLANK(J86),\"\",IF(FIND(J86,INDIRECT($J$75))>0,1,0)),0)","v":0},null,"",null,null,null,null,null,null,null,null,null,null,null,null,null,null,null,null,"",null,null,null,null,null,null,null,null,null,null,null,null,"AU","White",0,null,"White",{"$f":"IF(ISNUMBER(FIND(\"x\",BD86)),IFERROR(INDEX(INDIRECT(\"T_FinishColour[ColourCode-\"&IF(ISNUMBER(FIND(\"xxx\",BD86)),\"xxx\",IF(ISNUMBER(FIND(\"xx\",BD86)),\"xx\",\"error\"))&AQ86&\"]\"),MATCH(AU86,T_FinishColour[Finish / Colour],0)),\"\"),\"\")","v":"069"},null,"HIDE",null,null,null,{"$f":"_xlfn.IFNA(SUBSTITUTE(IF(AQ86=\"AU\",SUBSTITUTE(BD86,\"xxx\",AV86),SUBSTITUTE(SUBSTITUTE(BD86,\"xx\",AV86),\"x\",\"\")),\"LLL\",\"580\"),BD86)","v":"SL01-0306-069040"},null,"SL01-0306-xxx040","LX Skyline Bracket | 40mm Projection",null,{"$f":"IF(ISBLANK(BL86),\"\",IF(OR(BL86=L_Units),\"Y\",\"N\"))","v":"N"},null,{"$f":"IFERROR(IF(BG86=\"Y\",((INDEX(T_Deduc[Deduction],MATCH(BH86,T_Deduc[Type],0),0))),\"\"),\"\")","v":""},null,{"$f":"IFERROR(IF(BG86=\"Y\",(INDIRECT(BJ86)-BI86)/IF(Z86=\"\",1,o_nScreens),\"\"),\"\")","v":""},"Piece",{"$f":"IFERROR(IF(ISBLANK(BB86),\"\",INDEX(T_NAV[Base Unit of Measure],MATCH(BB86,T_NAV[No.],0))),\"\")","v":"PIECE"},2,{"$f":"IF(ISBLANK(BN86),\"\",PRODUCT(AD86,BN86,ShadeQuantity))","v":2},{"$f":"IFERROR(INDEX(INDIRECT(\"T_NAV[\"&i_Location&\"]\"),MATCH(1,--(BB86=T_NAV[No.])*--((INDIRECT(\"T_NAV[\"&i_Location&\"]\"))<>\"\"),0))/IF(AND(BF86<>\"\",i_Units=\"Imperial\"),CONVERT(BF86,\"m\",\"in\"),IF(AND(i_Units=\"Imperial\",BM86=\"Metre\"),39.37,IF(BF86<>\"\",BF86,1))),\"\")","v":""},""]
[null,null,null,"P95",{"$f":"IFERROR(IF(ISBLANK(D87),\"\",IF(FIND(D87,INDIRECT($D$75))>0,1,0)),0)","v":0},null,"",null,"",null,{"$f":"IFERROR(IF(ISBLANK(J87),\"\",IF(FIND(J87,INDIRECT($J$75))>0,1,0)),0)","v":""},null,"",null,null,null,null,null,null,null,null,null,null,null,null,null,null,null,null,"",null,null,null,null,null,null,null,null,null,null,null,null,"AU","",0,null,"",{"$f":"IF(ISNUMBER(FIND(\"x\",BD87)),IFERROR(INDEX(INDIRECT(\"T_FinishColour[ColourCode-\"&IF(ISNUMBER(FIND(\"xxx\",BD87)),\"xxx\",IF(ISNUMBER(FIND(\"xx\",BD87)),\"xx\",\"error\"))&AQ87&\"]\"),MATCH(AU87,T_FinishColour[Finish / Colour],0)),\"\"),\"\")","v":""},null,"HIDE",null,null,null,{"$f":"_xlfn.IFNA(SUBSTITUTE(IF(AQ87=\"AU\",SUBSTITUTE(BD87,\"xxx\",AV87),SUBSTITUTE(SUBSTITUTE(BD87,\"xx\",AV87),\"x\",\"\")),\"LLL\",\"580\"),BD87)","v":"SS31-5991-050944"},null,"SS31-5991-050944","M4 x 4mm Set Screw",null,{"$f":"IF(ISBLANK(BL87),\"\",IF(OR(BL87=L_Units),\"Y\",\"N\"))","v":"N"},null,{"$f":"IFERROR(IF(BG87=\"Y\",((INDEX(T_Deduc[Deduction],MATCH(BH87,T_Deduc[Type],0),0))),\"\"),\"\")","v":""},null,{"$f":"IFERROR(IF(BG87=\"Y\",(INDIRECT(BJ87)-BI87)/IF(Z87=\"\",1,o_nScreens),\"\"),\"\")","v":""},"Piece",{"$f":"IFERROR(IF(ISBLANK(BB87),\"\",INDEX(T_NAV[Base Unit of Measure],MATCH(BB87,T_NAV[No.],0))),\"\")","v":"PIECE"},2,{"$f":"IF(ISBLANK(BN87),\"\",PRODUCT(AD87,BN87,ShadeQuantity))","v":2},{"$f":"IFERROR(INDEX(INDIRECT(\"T_NAV[\"&i_Location&\"]\"),MATCH(1,--(BB87=T_NAV[No.])*--((INDIRECT(\"T_NAV[\"&i_Location&\"]\"))<>\"\"),0))/IF(AND(BF87<>\"\",i_Units=\"Imperial\"),CONVERT(BF87,\"m\",\"in\"),IF(AND(i_Units=\"Imperial\",BM87=\"Metre\"),39.37,IF(BF87<>\"\",BF87,1))),\"\")","v":""},""]
[null,null,null,"P95",{"$f":"IFERROR(IF(ISBLANK(D88),\"\",IF(FIND(D88,INDIRECT($D$75))>0,1,0)),0)","v":0},null,null,null,null,"LX",0,null,null,null,null,null,null,null,null,null,null,null,null,null,null,null,null,null,null,null,null,null,null,null,null,null,null,null,null,null,null,null,null,null,null,null,null,null,null,null,null,null,null,"SC6375H25",null,"SC6375H25","Flanged Hex Head Screw, #6, 3/8\"",null,{"$f":"IF(ISBLANK(BL88),\"\",IF(OR(BL88=L_Units),\"Y\",\"N\"))","v":"N"},null,{"$f":"IFERROR(IF(BG88=\"Y\",((INDEX(T_Deduc[Deduction],MATCH(BH88,T_Deduc[Type],0),0))),\"\"),\"\")","v":""},null,"","Piece",{"$f":"IFERROR(IF(ISBLANK(BB88),\"\",INDEX(T_NAV[Base Unit of Measure],MATCH(BB88,T_NAV[No.],0))),\"\")","v":""},2,2,{"$f":"IFERROR(INDEX(INDIRECT(\"T_NAV[\"&i_Location&\"]\"),MATCH(1,--(BB88=T_NAV[No.])*--((INDIRECT(\"T_NAV[\"&i_Location&\"]\"))<>\"\"),0))/IF(AND(BF88<>\"\",i_Units=\"Imperial\"),CONVERT(BF88,\"m\",\"in\"),IF(AND(i_Units=\"Imperial\",BM88=\"Metre\"),39.37,IF(BF88<>\"\",BF88,1))),\"\")","v":""},{"$f":"IF(AND(AX88=\"SHOW\",BP88<>\"\"),BP88*BO88*IF(AND(BK88<>\"\",OR(BM88=\"LENGTH\",BM88=\"METRE\",BM88=\"ROLL\")),IF(BK88=\"^\",INDIRECT(BJ88),(INDIRECT(BJ88)-BI88))/IF(i_Units=\"Metric\",1000,1),1),\"\")","v":""}]
[null,null,null,"P95",0,null,"",null,"",null,"",null,"",null,null,null,null,null,null,null,null,null,null,null,null,null,null,null,null,"",null,null,null,null,null,null,null,null,null,null,null,null,"AU","",0,null,"",{"$f":"IF(ISNUMBER(FIND(\"x\",BD89)),IFERROR(INDEX(INDIRECT(\"T_FinishColour[ColourCode-\"&IF(ISNUMBER(FIND(\"xxx\",BD89)),\"xxx\",IF(ISNUMBER(FIND(\"xx\",BD89)),\"xx\",\"error\"))&AQ89&\"]\"),MATCH(AU89,T_FinishColour[Finish / Colour],0)),\"\"),\"\")","v":""},null,{"$f":"IF(AND(ISBLANK(BD89),ISBLANK(C89)),\"HIDE\",IF(PRODUCT(C89:Y89)=1,\"SHOW\",\"HIDE\"))","v":"HIDE"},null,null,null,{"$f":"_xlfn.IFNA(SUBSTITUTE(IF(AQ89=\"AU\",SUBSTITUTE(BD89,\"xxx\",AV89),SUBSTITUTE(SUBSTITUTE(BD89,\"xx\",AV89),\"x\",\"\")),\"LLL\",\"580\"),BD89)","v":"NOT SUPPLIED"},null,"NOT SUPPLIED","Fabric Width for covering Extrusion",null,{"$f":"IF(ISBLANK(BL89),\"\",IF(OR(BL89=L_Units),\"Y\",\"N\"))","v":{"$error":"#N/A"}},"Mounting Rail",{"$f":"IFERROR(IF(BG89=\"Y\",((INDEX(T_Deduc[Deduction],MATCH(BH89,T_Deduc[Type],0),0))),\"\"),\"\")","v":""},"i_Width","",{"$f":"INDEX(T_UnitSelection[Units],MATCH(i_Units,T_UnitSelection[UnitSelection],0))","v":{"$error":"#N/A"}},"LENGTH",1,{"$f":"IF(ISBLANK(BN89),\"\",PRODUCT(AD89,BN89,ShadeQuantity))","v":1},{"$f":"IFERROR(INDEX(INDIRECT(\"T_NAV[\"&i_Location&\"]\"),MATCH(1,--(BB89=T_NAV[No.])*--((INDIRECT(\"T_NAV[\"&i_Location&\"]\"))<>\"\"),0))/IF(AND(BF89<>\"\",i_Units=\"Imperial\"),CONVERT(BF89,\"m\",\"in\"),IF(AND(i_Units=\"Imperial\",BM89=\"Metre\"),39.37,IF(BF89<>\"\",BF89,1))),\"\")","v":""},""]
[null,null,null,null,null,null,null,null,null,null,null,null,null,null,null,null,null,null,null,null,null,null,null,null,null,null,null,null,null,{"$f":"IFERROR(IF(AND(o_nScreens>1,Z90=\"Y\",PRODUCT(AA90:AC90)=0),o_nScreens,IF(PRODUCT(AA90:AC90)=0,\"\",PRODUCT(AA90:AC90))),\"\")","v":""},null,null,null,null,null,null,null,null,null,null,null,null,null,{"$f":"IF(ISNUMBER(FIND(\"x\",BD90)),IFERROR(INDEX(AH90:AP90,0,MATCH(AS90,AH90:AP90,0)),IF(AH90<>\"\",AH90,i_DefaultColour)),\"\")","v":""},null,null,{"$f":"IF(ISNUMBER(FIND(\"x\",BD90)),IFERROR(INDEX(AH90:AP90,0,MATCH(AS90,AH90:AP90,0)),AR90),\"\")","v":""},{"$f":"IF(ISNUMBER(FIND(\"x\",BD90)),IFERROR(INDEX(INDIRECT(\"T_FinishColour[ColourCode-\"&IF(ISNUMBER(FIND(\"xxx\",BD90)),\"xxx\",IF(ISNUMBER(FIND(\"xx\",BD90)),\"xx\",\"error\"))&AQ90&\"]\"),MATCH(AU90,T_FinishColour[Finish / Colour],0)),\"\"),\"\")","v":""},null,"HIDE",null,null,null,{"$f":"_xlfn.IFNA(SUBSTITUTE(IF(AQ90=\"AU\",SUBSTITUTE(BD90,\"xxx\",AV90),SUBSTITUTE(SUBSTITUTE(BD90,\"xx\",AV90),\"x\",\"\")),\"LLL\",\"580\"),BD90)","v":""},null,null,null,null,{"$f":"IF(ISBLANK(BL90),\"\",IF(OR(BL90=L_Units),\"Y\",\"N\"))","v":""},null,{"$f":"IFERROR(IF(BG90=\"Y\",((INDEX(T_Deduc[Deduction],MATCH(BH90,T_Deduc[Type],0),0))),\"\"),\"\")","v":""},null,{"$f":"IFERROR(IF(BG90=\"Y\",(INDIRECT(BJ90)-BI90)/IF(Z90=\"\",1,o_nScreens),\"\"),\"\")","v":""},null,{"$f":"IFERROR(IF(ISBLANK(BB90),\"\",INDEX(T_NAV[Base Unit of Measure],MATCH(BB90,T_NAV[No.],0))),\"\")","v":""},null,{"$f":"IF(ISBLANK(BN90),\"\",PRODUCT(AD90,BN90,ShadeQuantity))","v":""},{"$f":"IFERROR(INDEX(INDIRECT(\"T_NAV[\"&i_Location&\"]\"),MATCH(1,--(BB90=T_NAV[No.])*--((INDIRECT(\"T_NAV[\"&i_Location&\"]\"))<>\"\"),0))/IF(AND(BF90<>\"\",i_Units=\"Imperial\"),CONVERT(BF90,\"m\",\"in\"),IF(AND(i_Units=\"Imperial\",BM90=\"Metre\"),39.37,IF(BF90<>\"\",BF90,1))),\"\")","v":""},""]
[null,null,null,null,null,null,null,null,null,null,null,null,null,null,null,null,null,null,null,null,null,null,null,null,null,null,null,null,null,"",null,null,null,null,null,null,null,null,null,null,null,null,null,"",null,null,"",{"$f":"IF(ISNUMBER(FIND(\"x\",BD91)),IFERROR(INDEX(INDIRECT(\"T_FinishColour[ColourCode-\"&IF(ISNUMBER(FIND(\"xxx\",BD91)),\"xxx\",IF(ISNUMBER(FIND(\"xx\",BD91)),\"xx\",\"error\"))&AQ91&\"]\"),MATCH(AU91,T_FinishColour[Finish / Colour],0)),\"\"),\"\")","v":""},null,"HIDE",null,null,null,"",null,null,null,null,{"$f":"IF(ISBLANK(BL91),\"\",IF(OR(BL91=L_Units),\"Y\",\"N\"))","v":""},null,{"$f":"IFERROR(IF(BG91=\"Y\",((INDEX(T_Deduc[Deduction],MATCH(BH91,T_Deduc[Type],0),0))),\"\"),\"\")","v":""},null,"",null,{"$f":"IFERROR(IF(ISBLANK(BB91),\"\",INDEX(T_NAV[Base Unit of Measure],MATCH(BB91,T_NAV[No.],0))),\"\")","v":""},null,"",{"$f":"IFERROR(INDEX(INDIRECT(\"T_NAV[\"&i_Location&\"]\"),MATCH(1,--(BB91=T_NAV[No.])*--((INDIRECT(\"T_NAV[\"&i_Location&\"]\"))<>\"\"),0))/IF(AND(BF91<>\"\",i_Units=\"Imperial\"),CONVERT(BF91,\"m\",\"in\"),IF(AND(i_Units=\"Imperial\",BM91=\"Metre\"),39.37,IF(BF91<>\"\",BF91,1))),\"\")","v":""},""]
[null,null,{"$f":"C93","v":0},null,null,null,null,null,null,null,null,null,null,null,null,null,null,null,null,null,null,null,null,null,null,null,null,null,null,null,null,null,null,null,null,null,null,null,null,null,null,null,null,"",null,null,"",{"$f":"IF(ISNUMBER(FIND(\"x\",BD92)),IFERROR(INDEX(INDIRECT(\"T_FinishColour[ColourCode-\"&IF(ISNUMBER(FIND(\"xxx\",BD92)),\"xxx\",IF(ISNUMBER(FIND(\"xx\",BD92)),\"xx\",\"error\"))&AQ92&\"]\"),MATCH(AU92,T_FinishColour[Finish / Colour],0)),\"\"),\"\")","v":""},null,"HIDE",null,null,null,"",null,null,null,null,null,null,{"$f":"IFERROR(IF(BG92=\"Y\",((INDEX(T_Deduc[Deduction],MATCH(BH92,T_Deduc[Type],0),0))),\"\"),\"\")","v":""},null,"",null,{"$f":"IFERROR(IF(ISBLANK(BB92),\"\",INDEX(T_NAV[Base Unit of Measure],MATCH(BB92,T_NAV[No.],0))),\"\")","v":""},null,"",{"$f":"IFERROR(INDEX(INDIRECT(\"T_NAV[\"&i_Location&\"]\"),MATCH(1,--(BB92=T_NAV[No.])*--((INDIRECT(\"T_NAV[\"&i_Location&\"]\"))<>\"\"),0))/IF(AND(BF92<>\"\",i_Units=\"Imperial\"),CONVERT(BF92,\"m\",\"in\"),IF(AND(i_Units=\"Imperial\",BM92=\"Metre\"),39.37,IF(BF92<>\"\",BF92,1))),\"\")","v":""},""]
[null,null,{"$f":"IFERROR(IF(FIND(D98,INDIRECT($D$93))>0,1,0),0)","v":0},"i_InstallationType",null,"i_FixingOptions",null,"i_BoxShape",null,"i_BracketOptions",null,"i_CassetteBrush",null,null,null,null,null,null,null,null,null,null,null,null,null,null,null,null,null,"",null,null,null,null,null,null,null,null,null,null,null,null,null,"",null,null,"",{"$f":"IF(ISNUMBER(FIND(\"x\",BD93)),IFERROR(INDEX(INDIRECT(\"T_FinishColour[ColourCode-\"&IF(ISNUMBER(FIND(\"xxx\",BD93)),\"xxx\",IF(ISNUMBER(FIND(\"xx\",BD93)),\"xx\",\"error\"))&AQ93&\"]\"),MATCH(AU93,T_FinishColour[Finish / Colour],0)),\"\"),\"\")","v":""},null,"HIDE",null,null,null,"CF90",null,"CF90",null,null,null,null,{"$f":"IFERROR(IF(BG93=\"Y\",((INDEX(T_Deduc[Deduction],MATCH(BH93,T_Deduc[Type],0),0))),\"\"),\"\")","v":""},null,"",null,{"$f":"IFERROR(IF(ISBLANK(BB93),\"\",INDEX(T_NAV[Base Unit of Measure],MATCH(BB93,T_NAV[No.],0))),\"\")","v":""},null,"",{"$f":"IFERROR(INDEX(INDIRECT(\"T_NAV[\"&i_Location&\"]\"),MATCH(1,--(BB93=T_NAV[No.])*--((INDIRECT(\"T_NAV[\"&i_Location&\"]\"))<>\"\"),0))/IF(AND(BF93<>\"\",i_Units=\"Imperial\"),CONVERT(BF93,\"m\",\"in\"),IF(AND(i_Units=\"Imperial\",BM93=\"Metre\"),39.37,IF(BF93<>\"\",BF93,1))),\"\")","v":""},""]
[null,null,null,"CF90 Cassette",{"$f":"IFERROR(IF(ISBLANK(D94),\"\",IF(FIND(D94,INDIRECT($D$93))>0,1,0)),0)","v":0},null,{"$f":"IFERROR(IF(ISBLANK(F94),\"\",IF(FIND(F94,INDIRECT($F$93))>0,1,0)),0)","v":""},null,{"$f":"IFERROR(IF(ISBLANK(H94),\"\",IF(FIND(H94,INDIRECT($H$93))>0,1,0)),0)","v":""},null,{"$f":"IFERROR(IF(ISBLANK(J94),\"\",IF(FIND(J94,INDIRECT($J$93))>0,1,0)),0)","v":""},null,{"$f":"IFERROR(IF(ISBLANK(L94),\"\",IF(FIND(L94,INDIRECT($L$93))>0,1,0)),0)","v":""},null,null,null,null,null,null,null,null,null,null,null,null,null,null,null,null,"",null,null,null,"White","Black","Anodised",null,null,null,null,null,null,null,"",null,null,"",{"$f":"IF(ISNUMBER(FIND(\"x\",BD94)),IFERROR(INDEX(INDIRECT(\"T_FinishColour[ColourCode-\"&IF(ISNUMBER(FIND(\"xxx\",BD94)),\"xxx\",IF(ISNUMBER(FIND(\"xx\",BD94)),\"xx\",\"error\"))&AQ94&\"]\"),MATCH(AU94,T_FinishColour[Finish / Colour],0)),\"\"),\"\")","v":""},null,"HIDE",null,null,null,{"$f":"_xlfn.IFNA(SUBSTITUTE(IF(AQ94=\"AU\",SUBSTITUTE(BD94,\"xxx\",AV94),SUBSTITUTE(SUBSTITUTE(BD94,\"xx\",AV94),\"x\",\"\")),\"LLL\",BF94*100),BD94)","v":"RC01-0101-000490"},null,"RC01-0101-000LLL","Cassette 90 Back",{"$f":"IF(OR(i_Location=\"AU\",i_Location=\"EU\"),4.8,4.9)","v":4.9000000000000004},{"$f":"IF(ISBLANK(BL94),\"\",IF(OR(BL94=L_Units),\"Y\",\"N\"))","v":{"$error":"#N/A"}},"CF Cassette",{"$f":"IFERROR(IF(BG94=\"Y\",((INDEX(T_Deduc[Deduction],MATCH(BH94,T_Deduc[Type],0),0))),\"\"),\"\")","v":""},"i_Width","",{"$f":"INDEX(T_UnitSelection[Units],MATCH(i_Units,T_UnitSelection[UnitSelection],0))","v":{"$error":"#N/A"}},{"$f":"IFERROR(IF(ISBLANK(BB94),\"\",INDEX(T_NAV[Base Unit of Measure],MATCH(BB94,T_NAV[No.],0))),\"\")","v":""},1,1,{"$f":"IFERROR(INDEX(INDIRECT(\"T_NAV[\"&i_Location&\"]\"),MATCH(1,--(BB94=T_NAV[No.])*--((INDIRECT(\"T_NAV[\"&i_Location&\"]\"))<>\"\"),0))/IF(AND(BF94<>\"\",i_Units=\"Imperial\"),CONVERT(BF94,\"m\",\"in\"),IF(AND(i_Units=\"Imperial\",BM94=\"Metre\"),39.37,IF(BF94<>\"\",BF94,1))),\"\")","v":""},""]
[null,null,null,"CF90 Fascia",{"$f":"IFERROR(IF(ISBLANK(D95),\"\",IF(FIND(D95,INDIRECT($D$93))>0,1,0)),0)","v":0},null,{"$f":"IFERROR(IF(ISBLANK(F95),\"\",IF(FIND(F95,INDIRECT($F$93))>0,1,0)),0)","v":""},null,{"$f":"IFERROR(IF(ISBLANK(H95),\"\",IF(FIND(H95,INDIRECT($H$93))>0,1,0)),0)","v":""},null,{"$f":"IFERROR(IF(ISBLANK(J95),\"\",IF(FIND(J95,INDIRECT($J$93))>0,1,0)),0)","v":""},null,{"$f":"IFERROR(IF(ISBLANK(L95),\"\",IF(FIND(L95,INDIRECT($L$93))>0,1,0)),0)","v":""},null,null,null,null,null,null,null,null,null,null,null,null,null,{"$f":"ROUNDUP(metric_width/1200,0)+1","v":1},null,null,1,"1200 MAX",null,null,"White","Black",null,null,null,null,null,null,null,"AU",{"$f":"IF(ISNUMBER(FIND(\"x\",BD95)),IFERROR(INDEX(AH95:AP95,0,MATCH(AS95,AH95:AP95,0)),IF(AH95<>\"\",AH95,i_DefaultColour)),\"\")","v":""},{"$f":"i_Colour","v":0},null,{"$f":"IF(ISNUMBER(FIND(\"x\",BD95)),IFERROR(INDEX(AH95:AP95,0,MATCH(AS95,AH95:AP95,0)),AR95),\"\")","v":""},{"$f":"IF(ISNUMBER(FIND(\"x\",BD95)),IFERROR(INDEX(INDIRECT(\"T_FinishColour[ColourCode-\"&IF(ISNUMBER(FIND(\"xxx\",BD95)),\"xxx\",IF(ISNUMBER(FIND(\"xx\",BD95)),\"xx\",\"error\"))&AQ95&\"]\"),MATCH(AU95,T_FinishColour[Finish / Colour],0)),\"\"),\"\")","v":""},null,"HIDE",null,null,null,{"$f":"_xlfn.IFNA(SUBSTITUTE(IF(AQ95=\"AU\",SUBSTITUTE(BD95,\"xxx\",AV95),SUBSTITUTE(SUBSTITUTE(BD95,\"xx\",AV95),\"x\",\"\")),\"LLL\",\"580\"),BD95)","v":"RC03-0101-069040"},null,"RC03-0101-069040","Cassette 90 Fascia Bracket",null,{"$f":"IF(ISBLANK(BL95),\"\",IF(OR(BL95=L_Units),\"Y\",\"N\"))","v":"N"},null,{"$f":"IFERROR(IF(BG95=\"Y\",((INDEX(T_Deduc[Deduction],MATCH(BH95,T_Deduc[Type],0),0))),\"\"),\"\")","v":""},null,{"$f":"IFERROR(IF(BG95=\"Y\",(INDIRECT(BJ95)-BI95)/IF(Z95=\"\",1,o_nScreens),\"\"),\"\")","v":""},"Piece",{"$f":"IFERROR(IF(ISBLANK(BB95),\"\",INDEX(T_NAV[Base Unit of Measure],MATCH(BB95,T_NAV[No.],0))),\"\")","v":"PIECE"},1,{"$f":"IF(ISBLANK(BN95),\"\",PRODUCT(AD95,BN95,ShadeQuantity))","v":1},{"$f":"IFERROR(INDEX(INDIRECT(\"T_NAV[\"&i_Location&\"]\"),MATCH(1,--(BB95=T_NAV[No.])*--((INDIRECT(\"T_NAV[\"&i_Location&\"]\"))<>\"\"),0))/IF(AND(BF95<>\"\",i_Units=\"Imperial\"),CONVERT(BF95,\"m\",\"in\"),IF(AND(i_Units=\"Imperial\",BM95=\"Metre\"),39.37,IF(BF95<>\"\",BF95,1))),\"\")","v":""},{"$f":"IF(AND(AX95=\"SHOW\",BP95<>\"\"),BP95*BO95*IF(AND(BK95<>\"\",OR(BM95=\"LENGTH\",BM95=\"METRE\",BM95=\"ROLL\")),IF(BK95=\"^\",INDIRECT(BJ95),(INDIRECT(BJ95)-BI95))/IF(i_Units=\"Metric\",1000,1),1),\"\")","v":""}]
[null,null,null,"CF90",0,null,"",null,"",null,{"$f":"IFERROR(IF(ISBLANK(J96),\"\",IF(FIND(J96,INDIRECT($J$93))>0,1,0)),0)","v":""},null,{"$f":"IFERROR(IF(ISBLANK(L96),\"\",IF(FIND(L96,INDIRECT($L$93))>0,1,0)),0)","v":""},null,null,null,null,null,null,null,null,null,null,null,null,null,null,null,null,{"$f":"IFERROR(IF(AND(o_nScreens>1,Z96=\"Y\",PRODUCT(AA96:AC96)=0),o_nScreens,IF(PRODUCT(AA96:AC96)=0,\"\",PRODUCT(AA96:AC96))),\"\")","v":""},null,null,null,null,null,null,null,null,null,null,null,null,null,"",null,null,"",{"$f":"IF(ISNUMBER(FIND(\"x\",BD96)),IFERROR(INDEX(INDIRECT(\"T_FinishColour[ColourCode-\"&IF(ISNUMBER(FIND(\"xxx\",BD96)),\"xxx\",IF(ISNUMBER(FIND(\"xx\",BD96)),\"xx\",\"error\"))&AQ96&\"]\"),MATCH(AU96,T_FinishColour[Finish / Colour],0)),\"\"),\"\")","v":""},null,"HIDE",null,null,null,{"$f":"_xlfn.IFNA(SUBSTITUTE(IF(AQ96=\"AU\",SUBSTITUTE(BD96,\"xxx\",AV96),SUBSTITUTE(SUBSTITUTE(BD96,\"xx\",AV96),\"x\",\"\")),\"LLL\",\"580\"),BD96)","v":"RC02-0101-338090"},null,"RC02-0101-338090","Cassette 90 End Plate Set + Screws",null,{"$f":"IF(ISBLANK(BL96),\"\",IF(OR(BL96=L_Units),\"Y\",\"N\"))","v":"N"},null,{"$f":"IFERROR(IF(BG96=\"Y\",((INDEX(T_Deduc[Deduction],MATCH(BH96,T_Deduc[Type],0),0))),\"\"),\"\")","v":""},null,"","Set",{"$f":"IFERROR(IF(ISBLANK(BB96),\"\",INDEX(T_NAV[Base Unit of Measure],MATCH(BB96,T_NAV[No.],0))),\"\")","v":"SET"},1,1,{"$f":"IFERROR(INDEX(INDIRECT(\"T_NAV[\"&i_Location&\"]\"),MATCH(1,--(BB96=T_NAV[No.])*--((INDIRECT(\"T_NAV[\"&i_Location&\"]\"))<>\"\"),0))/IF(AND(BF96<>\"\",i_Units=\"Imperial\"),CONVERT(BF96,\"m\",\"in\"),IF(AND(i_Units=\"Imperial\",BM96=\"Metre\"),39.37,IF(BF96<>\"\",BF96,1))),\"\")","v":""},""]
[null,null,null,"CF90",0,null,"",null,"",null,{"$f":"IFERROR(IF(INDIRECT($J$93)=J97,1,IF(ISBLANK(J97),\"\",0)),\"\")","v":1},null,null,null,null,null,null,null,null,null,null,null,null,null,null,null,null,null,null,{"$f":"IFERROR(IF(AND(o_nScreens>1,Z97=\"Y\",PRODUCT(AA97:AC97)=0),o_nScreens,IF(PRODUCT(AA97:AC97)=0,\"\",PRODUCT(AA97:AC97))),\"\")","v":""},null,null,null,null,null,null,null,null,null,null,null,null,null,{"$f":"IF(ISNUMBER(FIND(\"x\",BD97)),IFERROR(INDEX(AH97:AP97,0,MATCH(AS97,AH97:AP97,0)),IF(AH97<>\"\",AH97,i_DefaultColour)),\"\")","v":""},null,null,{"$f":"IF(ISNUMBER(FIND(\"x\",BD97)),IFERROR(INDEX(AH97:AP97,0,MATCH(AS97,AH97:AP97,0)),AR97),\"\")","v":""},{"$f":"IF(ISNUMBER(FIND(\"x\",BD97)),IFERROR(INDEX(INDIRECT(\"T_FinishColour[ColourCode-\"&IF(ISNUMBER(FIND(\"xxx\",BD97)),\"xxx\",IF(ISNUMBER(FIND(\"xx\",BD97)),\"xx\",\"error\"))&AQ97&\"]\"),MATCH(AU97,T_FinishColour[Finish / Colour],0)),\"\"),\"\")","v":""},null,"HIDE",null,null,null,{"$f":"_xlfn.IFNA(SUBSTITUTE(IF(AQ97=\"AU\",SUBSTITUTE(BD97,\"xxx\",AV97),SUBSTITUTE(SUBSTITUTE(BD97,\"xx\",AV97),\"x\",\"\")),\"LLL\",\"580\"),BD97)","v":"RB12-2503-069140"},null,"RB12-2503-069140","Single Stop Limiter LX Bracket Set",null,{"$f":"IF(ISBLANK(BL97),\"\",IF(OR(BL97=L_Units),\"Y\",\"N\"))","v":"N"},null,{"$f":"IFERROR(IF(BG97=\"Y\",((INDEX(T_Deduc[Deduction],MATCH(BH97,T_Deduc[Type],0),0))),\"\"),\"\")","v":""},null,{"$f":"IFERROR(IF(BG97=\"Y\",(INDIRECT(BJ97)-BI97)/IF(Z97=\"\",1,o_nScreens),\"\"),\"\")","v":""},"Set",{"$f":"IFERROR(IF(ISBLANK(BB97),\"\",INDEX(T_NAV[Base Unit of Measure],MATCH(BB97,T_NAV[No.],0))),\"\")","v":"SET"},1,{"$f":"IF(ISBLANK(BN97),\"\",PRODUCT(AD97,BN97,ShadeQuantity))","v":1},{"$f":"IFERROR(INDEX(INDIRECT(\"T_NAV[\"&i_Location&\"]\"),MATCH(1,--(BB97=T_NAV[No.])*--((INDIRECT(\"T_NAV[\"&i_Location&\"]\"))<>\"\"),0))/IF(AND(BF97<>\"\",i_Units=\"Imperial\"),CONVERT(BF97,\"m\",\"in\"),IF(AND(i_Units=\"Imperial\",BM97=\"Metre\"),39.37,IF(BF97<>\"\",BF97,1))),\"\")","v":""},""]
[null,null,null,"CF90",0,null,"",null,"",null,{"$f":"IFERROR(IF(INDIRECT($J$93)=J98,1,IF(ISBLANK(J98),\"\",0)),\"\")","v":1},null,null,null,null,null,null,null,null,null,null,null,null,null,null,null,null,null,null,"",null,null,null,"White",null,null,null,null,null,null,null,null,"AU","White",null,null,"White",{"$f":"IF(ISNUMBER(FIND(\"x\",BD98)),IFERROR(INDEX(INDIRECT(\"T_FinishColour[ColourCode-\"&IF(ISNUMBER(FIND(\"xxx\",BD98)),\"xxx\",IF(ISNUMBER(FIND(\"xx\",BD98)),\"xx\",\"error\"))&AQ98&\"]\"),MATCH(AU98,T_FinishColour[Finish / Colour],0)),\"\"),\"\")","v":"069"},null,"HIDE",null,null,null,{"$f":"_xlfn.IFNA(SUBSTITUTE(IF(AQ98=\"AU\",SUBSTITUTE(BD98,\"xxx\",AV98),SUBSTITUTE(SUBSTITUTE(BD98,\"xx\",AV98),\"x\",\"\")),\"LLL\",\"580\"),BD98)","v":"SL01-0306-069040"},null,"SL01-0306-xxx040","LX Skyline Bracket | 40mm Projection",null,{"$f":"IF(ISBLANK(BL98),\"\",IF(OR(BL98=L_Units),\"Y\",\"N\"))","v":"N"},null,{"$f":"IFERROR(IF(BG98=\"Y\",((INDEX(T_Deduc[Deduction],MATCH(BH98,T_Deduc[Type],0),0))),\"\"),\"\")","v":""},null,"","Piece",{"$f":"IFERROR(IF(ISBLANK(BB98),\"\",INDEX(T_NAV[Base Unit of Measure],MATCH(BB98,T_NAV[No.],0))),\"\")","v":"PIECE"},2,2,{"$f":"IFERROR(INDEX(INDIRECT(\"T_NAV[\"&i_Location&\"]\"),MATCH(1,--(BB98=T_NAV[No.])*--((INDIRECT(\"T_NAV[\"&i_Location&\"]\"))<>\"\"),0))/IF(AND(BF98<>\"\",i_Units=\"Imperial\"),CONVERT(BF98,\"m\",\"in\"),IF(AND(i_Units=\"Imperial\",BM98=\"Metre\"),39.37,IF(BF98<>\"\",BF98,1))),\"\")","v":""},""]
[null,null,null,"CF90",0,null,"","Round",0,null,{"$f":"IFERROR(IF(ISBLANK(J99),\"\",IF(FIND(J99,INDIRECT($J$93))>0,1,0)),0)","v":""},null,{"$f":"IFERROR(IF(ISBLANK(L99),\"\",IF(FIND(L99,INDIRECT($L$93))>0,1,0)),0)","v":""},null,null,null,null,null,null,null,null,null,null,null,null,null,null,null,null,"",null,null,null,"White","Black","Anodised",null,null,null,null,null,null,"AU","",{"$f":"i_Colour","v":0},null,"",{"$f":"IF(ISNUMBER(FIND(\"x\",BD99)),IFERROR(INDEX(INDIRECT(\"T_FinishColour[ColourCode-\"&IF(ISNUMBER(FIND(\"xxx\",BD99)),\"xxx\",IF(ISNUMBER(FIND(\"xx\",BD99)),\"xx\",\"error\"))&AQ99&\"]\"),MATCH(AU99,T_FinishColour[Finish / Colour],0)),\"\"),\"\")","v":""},null,"HIDE",null,null,null,{"$f":"_xlfn.IFNA(SUBSTITUTE(IF(AQ99=\"AU\",SUBSTITUTE(BD99,\"xxx\",AV99),SUBSTITUTE(SUBSTITUTE(BD99,\"xx\",AV99),\"x\",\"\")),\"LLL\",BF99*100),BD99)","v":"RC01-0102-069490"},null,"RC01-0102-069LLL","Cassette 90 Round Cover",{"$f":"IF(OR(i_Location=\"AU\",i_Location=\"EU\"),4.8,4.9)","v":4.9000000000000004},{"$f":"IF(ISBLANK(BL99),\"\",IF(OR(BL99=L_Units),\"Y\",\"N\"))","v":{"$error":"#N/A"}},"CF Cassette",{"$f":"IFERROR(IF(BG99=\"Y\",((INDEX(T_Deduc[Deduction],MATCH(BH99,T_Deduc[Type],0),0))),\"\"),\"\")","v":""},"i_Width","",{"$f":"INDEX(T_UnitSelection[Units],MATCH(i_Units,T_UnitSelection[UnitSelection],0))","v":{"$error":"#N/A"}},{"$f":"IFERROR(IF(ISBLANK(BB99),\"\",INDEX(T_NAV[Base Unit of Measure],MATCH(BB99,T_NAV[No.],0))),\"\")","v":""},1,1,{"$f":"IFERROR(INDEX(INDIRECT(\"T_NAV[\"&i_Location&\"]\"),MATCH(1,--(BB99=T_NAV[No.])*--((INDIRECT(\"T_NAV[\"&i_Location&\"]\"))<>\"\"),0))/IF(AND(BF99<>\"\",i_Units=\"Imperial\"),CONVERT(BF99,\"m\",\"in\"),IF(AND(i_Units=\"Imperial\",BM99=\"Metre\"),39.37,IF(BF99<>\"\",BF99,1))),\"\")","v":""},""]
[null,null,null,"CF90",0,null,"","Round",0,null,{"$f":"IFERROR(IF(ISBLANK(J100),\"\",IF(FIND(J100,INDIRECT($J$93))>0,1,0)),0)","v":""},null,"",null,null,null,null,null,null,null,null,null,null,null,null,null,null,null,null,"",null,null,null,"White","Black","Silver Grey",null,null,null,null,null,null,"AU","",{"$f":"i_Colour","v":0},null,"",{"$f":"IF(ISNUMBER(FIND(\"x\",BD100)),IFERROR(INDEX(INDIRECT(\"T_FinishColour[ColourCode-\"&IF(ISNUMBER(FIND(\"xxx\",BD100)),\"xxx\",IF(ISNUMBER(FIND(\"xx\",BD100)),\"xx\",\"error\"))&AQ100&\"]\"),MATCH(AU100,T_FinishColour[Finish / Colour],0)),\"\"),\"\")","v":""},null,"HIDE",null,null,null,{"$f":"_xlfn.IFNA(SUBSTITUTE(IF(AQ100=\"AU\",SUBSTITUTE(BD100,\"xxx\",AV100),SUBSTITUTE(SUBSTITUTE(BD100,\"xx\",AV100),\"x\",\"\")),\"LLL\",\"580\"),BD100)","v":"RC02-0102-069090"},null,"RC02-0102-069090","Cassette 90 Round Bracket Cover Set",null,{"$f":"IF(ISBLANK(BL100),\"\",IF(OR(BL100=L_Units),\"Y\",\"N\"))","v":"N"},null,{"$f":"IFERROR(IF(BG100=\"Y\",((INDEX(T_Deduc[Deduction],MATCH(BH100,T_Deduc[Type],0),0))),\"\"),\"\")","v":""},null,"","Set",{"$f":"IFERROR(IF(ISBLANK(BB100),\"\",INDEX(T_NAV[Base Unit of Measure],MATCH(BB100,T_NAV[No.],0))),\"\")","v":"SET"},1,1,{"$f":"IFERROR(INDEX(INDIRECT(\"T_NAV[\"&i_Location&\"]\"),MATCH(1,--(BB100=T_NAV[No.])*--((INDIRECT(\"T_NAV[\"&i_Location&\"]\"))<>\"\"),0))/IF(AND(BF100<>\"\",i_Units=\"Imperial\"),CONVERT(BF100,\"m\",\"in\"),IF(AND(i_Units=\"Imperial\",BM100=\"Metre\"),39.37,IF(BF100<>\"\",BF100,1))),\"\")","v":""},""]
[null,null,null,"CF90",0,null,"","Square",0,null,{"$f":"IFERROR(IF(ISBLANK(J101),\"\",IF(FIND(J101,INDIRECT($J$93))>0,1,0)),0)","v":""},null,"",null,null,null,null,null,null,null,null,null,null,null,null,null,null,null,null,"",null,null,null,"White","Black","Anodised",null,null,null,null,null,null,"AU","",{"$f":"i_Colour","v":0},null,"",{"$f":"IF(ISNUMBER(FIND(\"x\",BD101)),IFERROR(INDEX(INDIRECT(\"T_FinishColour[ColourCode-\"&IF(ISNUMBER(FIND(\"xxx\",BD101)),\"xxx\",IF(ISNUMBER(FIND(\"xx\",BD101)),\"xx\",\"error\"))&AQ101&\"]\"),MATCH(AU101,T_FinishColour[Finish / Colour],0)),\"\"),\"\")","v":""},null,"HIDE",null,null,null,{"$f":"_xlfn.IFNA(SUBSTITUTE(IF(AQ101=\"AU\",SUBSTITUTE(BD101,\"xxx\",AV101),SUBSTITUTE(SUBSTITUTE(BD101,\"xx\",AV101),\"x\",\"\")),\"LLL\",BF101*100),BD101)","v":"RC01-0103-069490"},null,"RC01-0103-069LLL","Cassette 90 Square Cover",{"$f":"IF(OR(i_Location=\"AU\",i_Location=\"EU\"),4.8,4.9)","v":4.9000000000000004},{"$f":"IF(ISBLANK(BL101),\"\",IF(OR(BL101=L_Units),\"Y\",\"N\"))","v":{"$error":"#N/A"}},"CF Cassette",{"$f":"IFERROR(IF(BG101=\"Y\",((INDEX(T_Deduc[Deduction],MATCH(BH101,T_Deduc[Type],0),0))),\"\"),\"\")","v":""},"i_Width","",{"$f":"INDEX(T_UnitSelection[Units],MATCH(i_Units,T_UnitSelection[UnitSelection],0))","v":{"$error":"#N/A"}},{"$f":"IFERROR(IF(ISBLANK(BB101),\"\",INDEX(T_NAV[Base Unit of Measure],MATCH(BB101,T_NAV[No.],0))),\"\")","v":""},1,1,{"$f":"IFERROR(INDEX(INDIRECT(\"T_NAV[\"&i_Location&\"]\"),MATCH(1,--(BB101=T_NAV[No.])*--((INDIRECT(\"T_NAV[\"&i_Location&\"]\"))<>\"\"),0))/IF(AND(BF101<>\"\",i_Units=\"Imperial\"),CONVERT(BF101,\"m\",\"in\"),IF(AND(i_Units=\"Imperial\",BM101=\"Metre\"),39.37,IF(BF101<>\"\",BF101,1))),\"\")","v":""},""]
[null,null,null,"CF90",0,null,"","Square",0,null,{"$f":"IFERROR(IF(ISBLANK(J102),\"\",IF(FIND(J102,INDIRECT($J$93))>0,1,0)),0)","v":""},null,"",null,null,null,null,null,null,null,null,null,null,null,null,null,null,null,null,"",null,null,null,"White","Black","Silver Grey",null,null,null,null,null,null,"AU","",{"$f":"i_Colour","v":0},null,"",{"$f":"IF(ISNUMBER(FIND(\"x\",BD102)),IFERROR(INDEX(INDIRECT(\"T_FinishColour[ColourCode-\"&IF(ISNUMBER(FIND(\"xxx\",BD102)),\"xxx\",IF(ISNUMBER(FIND(\"xx\",BD102)),\"xx\",\"error\"))&AQ102&\"]\"),MATCH(AU102,T_FinishColour[Finish / Colour],0)),\"\"),\"\")","v":""},null,"HIDE",null,null,null,{"$f":"_xlfn.IFNA(SUBSTITUTE(IF(AQ102=\"AU\",SUBSTITUTE(BD102,\"xxx\",AV102),SUBSTITUTE(SUBSTITUTE(BD102,\"xx\",AV102),\"x\",\"\")),\"LLL\",\"580\"),BD102)","v":"RC02-0103-069090"},null,"RC02-0103-069090","Cassette 90 Square Bracket Cover Set",null,{"$f":"IF(ISBLANK(BL102),\"\",IF(OR(BL102=L_Units),\"Y\",\"N\"))","v":"N"},null,{"$f":"IFERROR(IF(BG102=\"Y\",((INDEX(T_Deduc[Deduction],MATCH(BH102,T_Deduc[Type],0),0))),\"\"),\"\")","v":""},null,"","Set",{"$f":"IFERROR(IF(ISBLANK(BB102),\"\",INDEX(T_NAV[Base Unit of Measure],MATCH(BB102,T_NAV[No.],0))),\"\")","v":"SET"},1,1,{"$f":"IFERROR(INDEX(INDIRECT(\"T_NAV[\"&i_Location&\"]\"),MATCH(1,--(BB102=T_NAV[No.])*--((INDIRECT(\"T_NAV[\"&i_Location&\"]\"))<>\"\"),0))/IF(AND(BF102<>\"\",i_Units=\"Imperial\"),CONVERT(BF102,\"m\",\"in\"),IF(AND(i_Units=\"Imperial\",BM102=\"Metre\"),39.37,IF(BF102<>\"\",BF102,1))),\"\")","v":""},""]
[null,null,null,"CF90",0,"Top Fix w/ Mounting Bracket",{"$f":"IFERROR(IF(ISBLANK(F103),\"\",IF(FIND(F103,INDIRECT($F$93))>0,1,0)),0)","v":0},null,"",null,{"$f":"IFERROR(IF(ISBLANK(J103),\"\",IF(FIND(J103,INDIRECT($J$93))>0,1,0)),0)","v":""},null,"",null,null,null,null,null,null,null,null,null,null,null,null,null,{"$f":"ROUNDUP(metric_width/1200,0)+1","v":1},null,null,1,"1200 MAX",null,null,null,null,null,null,null,null,null,null,null,null,"",null,null,"",{"$f":"IF(ISNUMBER(FIND(\"x\",BD103)),IFERROR(INDEX(INDIRECT(\"T_FinishColour[ColourCode-\"&IF(ISNUMBER(FIND(\"xxx\",BD103)),\"xxx\",IF(ISNUMBER(FIND(\"xx\",BD103)),\"xx\",\"error\"))&AQ103&\"]\"),MATCH(AU103,T_FinishColour[Finish / Colour],0)),\"\"),\"\")","v":""},null,"HIDE",null,null,null,"RC03-1001-025090",null,"RC03-1001-025090","Mounting Bracket | Ceiling Mount | Top Fix",null,{"$f":"IF(ISBLANK(BL103),\"\",IF(OR(BL103=L_Units),\"Y\",\"N\"))","v":"N"},null,{"$f":"IFERROR(IF(BG103=\"Y\",((INDEX(T_Deduc[Deduction],MATCH(BH103,T_Deduc[Type],0),0))),\"\"),\"\")","v":""},null,"","Piece",{"$f":"IFERROR(IF(ISBLANK(BB103),\"\",INDEX(T_NAV[Base Unit of Measure],MATCH(BB103,T_NAV[No.],0))),\"\")","v":"PIECE"},1,1,{"$f":"IFERROR(INDEX(INDIRECT(\"T_NAV[\"&i_Location&\"]\"),MATCH(1,--(BB103=T_NAV[No.])*--((INDIRECT(\"T_NAV[\"&i_Location&\"]\"))<>\"\"),0))/IF(AND(BF103<>\"\",i_Units=\"Imperial\"),CONVERT(BF103,\"m\",\"in\"),IF(AND(i_Units=\"Imperial\",BM103=\"Metre\"),39.37,IF(BF103<>\"\",BF103,1))),\"\")","v":""},""]
[null,null,null,"CF90",0,"Face Fix w/ Mounting Bracket",0,null,"",null,null,null,"",null,null,null,null,null,null,null,null,null,null,null,null,null,{"$f":"ROUNDUP(metric_width/1200,0)+1","v":1},null,null,1,"1200 MAX",null,null,null,null,null,null,null,null,null,null,null,null,"",null,null,"",{"$f":"IF(ISNUMBER(FIND(\"x\",BD104)),IFERROR(INDEX(INDIRECT(\"T_FinishColour[ColourCode-\"&IF(ISNUMBER(FIND(\"xxx\",BD104)),\"xxx\",IF(ISNUMBER(FIND(\"xx\",BD104)),\"xx\",\"error\"))&AQ104&\"]\"),MATCH(AU104,T_FinishColour[Finish / Colour],0)),\"\"),\"\")","v":""},null,"HIDE",null,null,null,"RC03-1002-025090",null,"RC03-1002-025090","Mounting Bracket | Wall Mount | Face Fix",null,{"$f":"IF(ISBLANK(BL104),\"\",IF(OR(BL104=L_Units),\"Y\",\"N\"))","v":"N"},null,{"$f":"IFERROR(IF(BG104=\"Y\",((INDEX(T_Deduc[Deduction],MATCH(BH104,T_Deduc[Type],0),0))),\"\"),\"\")","v":""},null,"","Piece",{"$f":"IFERROR(IF(ISBLANK(BB104),\"\",INDEX(T_NAV[Base Unit of Measure],MATCH(BB104,T_NAV[No.],0))),\"\")","v":"PIECE"},1,1,{"$f":"IFERROR(INDEX(INDIRECT(\"T_NAV[\"&i_Location&\"]\"),MATCH(1,--(BB104=T_NAV[No.])*--((INDIRECT(\"T_NAV[\"&i_Location&\"]\"))<>\"\"),0))/IF(AND(BF104<>\"\",i_Units=\"Imperial\"),CONVERT(BF104,\"m\",\"in\"),IF(AND(i_Units=\"Imperial\",BM104=\"Metre\"),39.37,IF(BF104<>\"\",BF104,1))),\"\")","v":""},""]
[null,null,null,"CF90",0,null,"",null,"",null,null,"Yes",0,null,null,null,null,null,null,null,null,null,null,null,null,null,null,null,null,"",null,null,null,null,null,null,null,null,null,null,null,null,null,"",null,null,"",{"$f":"IF(ISNUMBER(FIND(\"x\",BD105)),IFERROR(INDEX(INDIRECT(\"T_FinishColour[ColourCode-\"&IF(ISNUMBER(FIND(\"xxx\",BD105)),\"xxx\",IF(ISNUMBER(FIND(\"xx\",BD105)),\"xx\",\"error\"))&AQ105&\"]\"),MATCH(AU105,T_FinishColour[Finish / Colour],0)),\"\"),\"\")","v":""},null,"HIDE",null,null,null,"SB91-0011-050500",null,"SB91-0011-050500","Fabric Brush ",null,{"$f":"IF(ISBLANK(BL105),\"\",IF(OR(BL105=L_Units),\"Y\",\"N\"))","v":{"$error":"#N/A"}},"CF Cassette",{"$f":"IFERROR(IF(BG105=\"Y\",((INDEX(T_Deduc[Deduction],MATCH(BH105,T_Deduc[Type],0),0))),\"\"),\"\")","v":""},"i_Width","",{"$f":"INDEX(T_UnitSelection[Units],MATCH(i_Units,T_UnitSelection[UnitSelection],0))","v":{"$error":"#N/A"}},{"$f":"IFERROR(IF(ISBLANK(BB105),\"\",INDEX(T_NAV[Base Unit of Measure],MATCH(BB105,T_NAV[No.],0))),\"\")","v":"METRE"},1,1,{"$f":"IFERROR(INDEX(INDIRECT(\"T_NAV[\"&i_Location&\"]\"),MATCH(1,--(BB105=T_NAV[No.])*--((INDIRECT(\"T_NAV[\"&i_Location&\"]\"))<>\"\"),0))/IF(AND(BF105<>\"\",i_Units=\"Imperial\"),CONVERT(BF105,\"m\",\"in\"),IF(AND(i_Units=\"Imperial\",BM105=\"Metre\"),39.37,IF(BF105<>\"\",BF105,1))),\"\")","v":""},""]
[null,null,null,null,null,null,null,null,null,null,null,null,null,null,null,null,null,null,null,null,null,null,null,null,null,null,null,null,null,"",null,null,null,null,null,null,null,null,null,null,null,null,null,"",null,null,"",{"$f":"IF(ISNUMBER(FIND(\"x\",BD106)),IFERROR(INDEX(INDIRECT(\"T_FinishColour[ColourCode-\"&IF(ISNUMBER(FIND(\"xxx\",BD106)),\"xxx\",IF(ISNUMBER(FIND(\"xx\",BD106)),\"xx\",\"error\"))&AQ106&\"]\"),MATCH(AU106,T_FinishColour[Finish / Colour],0)),\"\"),\"\")","v":""},null,"HIDE",null,null,null,"",null,null,null,null,{"$f":"IF(ISBLANK(BL106),\"\",IF(OR(BL106=L_Units),\"Y\",\"N\"))","v":""},null,{"$f":"IFERROR(IF(BG106=\"Y\",((INDEX(T_Deduc[Deduction],MATCH(BH106,T_Deduc[Type],0),0))),\"\"),\"\")","v":""},null,"",null,{"$f":"IFERROR(IF(ISBLANK(BB106),\"\",INDEX(T_NAV[Base Unit of Measure],MATCH(BB106,T_NAV[No.],0))),\"\")","v":""},null,"",{"$f":"IFERROR(INDEX(INDIRECT(\"T_NAV[\"&i_Location&\"]\"),MATCH(1,--(BB106=T_NAV[No.])*--((INDIRECT(\"T_NAV[\"&i_Location&\"]\"))<>\"\"),0))/IF(AND(BF106<>\"\",i_Units=\"Imperial\"),CONVERT(BF106,\"m\",\"in\"),IF(AND(i_Units=\"Imperial\",BM106=\"Metre\"),39.37,IF(BF106<>\"\",BF106,1))),\"\")","v":""},""]
[null,null,null,null,null,null,null,null,null,null,null,null,null,null,null,null,null,null,null,null,null,null,null,null,null,null,null,null,null,"",null,null,null,null,null,null,null,null,null,null,null,null,null,"",null,null,"",{"$f":"IF(ISNUMBER(FIND(\"x\",BD107)),IFERROR(INDEX(INDIRECT(\"T_FinishColour[ColourCode-\"&IF(ISNUMBER(FIND(\"xxx\",BD107)),\"xxx\",IF(ISNUMBER(FIND(\"xx\",BD107)),\"xx\",\"error\"))&AQ107&\"]\"),MATCH(AU107,T_FinishColour[Finish / Colour],0)),\"\"),\"\")","v":""},null,"HIDE",null,null,null,"",null,null,null,null,{"$f":"IF(ISBLANK(BL107),\"\",IF(OR(BL107=L_Units),\"Y\",\"N\"))","v":""},null,{"$f":"IFERROR(IF(BG107=\"Y\",((INDEX(T_Deduc[Deduction],MATCH(BH107,T_Deduc[Type],0),0))),\"\"),\"\")","v":""},null,"",null,{"$f":"IFERROR(IF(ISBLANK(BB107),\"\",INDEX(T_NAV[Base Unit of Measure],MATCH(BB107,T_NAV[No.],0))),\"\")","v":""},null,"",{"$f":"IFERROR(INDEX(INDIRECT(\"T_NAV[\"&i_Location&\"]\"),MATCH(1,--(BB107=T_NAV[No.])*--((INDIRECT(\"T_NAV[\"&i_Location&\"]\"))<>\"\"),0))/IF(AND(BF107<>\"\",i_Units=\"Imperial\"),CONVERT(BF107,\"m\",\"in\"),IF(AND(i_Units=\"Imperial\",BM107=\"Metre\"),39.37,IF(BF107<>\"\",BF107,1))),\"\")","v":""},""]
[null,null,{"$f":"C109","v":"0"},null,null,null,null,null,null,null,null,null,null,null,null,null,null,null,null,null,null,null,null,null,null,null,null,null,null,"",null,null,null,null,null,null,null,null,null,null,null,null,null,"",null,null,"",{"$f":"IF(ISNUMBER(FIND(\"x\",BD108)),IFERROR(INDEX(INDIRECT(\"T_FinishColour[ColourCode-\"&IF(ISNUMBER(FIND(\"xxx\",BD108)),\"xxx\",IF(ISNUMBER(FIND(\"xx\",BD108)),\"xx\",\"error\"))&AQ108&\"]\"),MATCH(AU108,T_FinishColour[Finish / Colour],0)),\"\"),\"\")","v":""},null,"HIDE",null,null,null,"",null,null,null,null,{"$f":"IF(ISBLANK(BL108),\"\",IF(OR(BL108=L_Units),\"Y\",\"N\"))","v":""},null,{"$f":"IFERROR(IF(BG108=\"Y\",((INDEX(T_Deduc[Deduction],MATCH(BH108,T_Deduc[Type],0),0))),\"\"),\"\")","v":""},null,"",null,{"$f":"IFERROR(IF(ISBLANK(BB108),\"\",INDEX(T_NAV[Base Unit of Measure],MATCH(BB108,T_NAV[No.],0))),\"\")","v":""},null,"",{"$f":"IFERROR(INDEX(INDIRECT(\"T_NAV[\"&i_Location&\"]\"),MATCH(1,--(BB108=T_NAV[No.])*--((INDIRECT(\"T_NAV[\"&i_Location&\"]\"))<>\"\"),0))/IF(AND(BF108<>\"\",i_Units=\"Imperial\"),CONVERT(BF108,\"m\",\"in\"),IF(AND(i_Units=\"Imperial\",BM108=\"Metre\"),39.37,IF(BF108<>\"\",BF108,1))),\"\")","v":""},""]
[null,null,{"$f":"IF(INDIRECT($D$109)=D110,1,\"0\")","v":"0"},"i_DimOut",null,null,null,null,null,null,null,null,null,null,null,null,null,null,null,null,null,null,null,null,null,null,null,null,null,"",null,null,null,null,null,null,null,null,null,null,null,null,null,"",null,null,"",{"$f":"IF(ISNUMBER(FIND(\"x\",BD109)),IFERROR(INDEX(INDIRECT(\"T_FinishColour[ColourCode-\"&IF(ISNUMBER(FIND(\"xxx\",BD109)),\"xxx\",IF(ISNUMBER(FIND(\"xx\",BD109)),\"xx\",\"error\"))&AQ109&\"]\"),MATCH(AU109,T_FinishColour[Finish / Colour],0)),\"\"),\"\")","v":""},null,"HIDE",null,null,null,"dim-OUT",null,{"$f":"IF(i_Location=\"US\",\"EDGE LIGHT BLOCK\",\"dim-OUT\")","v":"dim-OUT"},null,null,null,null,{"$f":"IFERROR(IF(BG109=\"Y\",((INDEX(T_Deduc[Deduction],MATCH(BH109,T_Deduc[Type],0),0))),\"\"),\"\")","v":""},null,"",null,{"$f":"IFERROR(IF(ISBLANK(BB109),\"\",INDEX(T_NAV[Base Unit of Measure],MATCH(BB109,T_NAV[No.],0))),\"\")","v":""},null,"",{"$f":"IFERROR(INDEX(INDIRECT(\"T_NAV[\"&i_Location&\"]\"),MATCH(1,--(BB109=T_NAV[No.])*--((INDIRECT(\"T_NAV[\"&i_Location&\"]\"))<>\"\"),0))/IF(AND(BF109<>\"\",i_Units=\"Imperial\"),CONVERT(BF109,\"m\",\"in\"),IF(AND(i_Units=\"Imperial\",BM109=\"Metre\"),39.37,IF(BF109<>\"\",BF109,1))),\"\")","v":""},""]
[null,null,null,"Yes",{"$f":"IFERROR(IF(ISBLANK(D110),\"\",IF(FIND(D110,INDIRECT($D$109))>0,1,0)),0)","v":0},null,null,null,null,null,null,null,null,null,null,null,null,null,null,null,null,null,null,null,null,"Y",null,null,null,"",null,null,null,"White","Mill","Black","Anodised",null,null,null,null,null,"AU","",{"$f":"i_Colour","v":0},null,"",{"$f":"IF(ISNUMBER(FIND(\"x\",BD110)),IFERROR(INDEX(INDIRECT(\"T_FinishColour[ColourCode-\"&IF(ISNUMBER(FIND(\"xxx\",BD110)),\"xxx\",IF(ISNUMBER(FIND(\"xx\",BD110)),\"xx\",\"error\"))&AQ110&\"]\"),MATCH(AU110,T_FinishColour[Finish / Colour],0)),\"\"),\"\")","v":""},null,"HIDE",null,null,null,{"$f":"_xlfn.IFNA(SUBSTITUTE(IF(AQ110=\"AU\",SUBSTITUTE(BD110,\"xxx\",AV110),SUBSTITUTE(SUBSTITUTE(BD110,\"xx\",AV110),\"x\",\"\")),\"LLL\",BF110*100),BD110)","v":"RC91-0101-069490"},null,"RC91-0101-069LLL",{"$f":"IF(i_Location=\"US\",\"Edge Light Block |\",\"dim-OUT |\") &\" Side Guide – 2 Piece Set\"","v":"dim-OUT | Side Guide – 2 Piece Set"},{"$f":"IF(OR(i_Location=\"AU\",i_Location=\"EU\"),5.8,4.9)","v":4.9000000000000004},{"$f":"IF(ISBLANK(BL110),\"\",IF(OR(BL110=L_Units),\"Y\",\"N\"))","v":{"$error":"#N/A"}},{"$f":"\"DimOut Height (\"& INDEX(T_FixingOptions[Outcome],MATCH(i_FixingOptions,T_FixingOptions[Fixing Options],0))&\")\"","v":{"$error":"#N/A"}},{"$f":"IFERROR(IF(BG110=\"Y\",((INDEX(T_Deduc[Deduction],MATCH(BH110,T_Deduc[Type],0),0))),\"\"),\"\")","v":""},"i_Drop",{"$f":"IFERROR(IF(BG110=\"Y\",(INDIRECT(BJ110)-BI110),\"\"),\"\")","v":""},{"$f":"INDEX(T_UnitSelection[Units],MATCH(i_Units,T_UnitSelection[UnitSelection],0))","v":{"$error":"#N/A"}},{"$f":"IFERROR(IF(ISBLANK(BB110),\"\",INDEX(T_NAV[Base Unit of Measure],MATCH(BB110,T_NAV[No.],0))),\"\")","v":""},2,2,{"$f":"IFERROR(INDEX(INDIRECT(\"T_NAV[\"&i_Location&\"]\"),MATCH(1,--(BB110=T_NAV[No.])*--((INDIRECT(\"T_NAV[\"&i_Location&\"]\"))<>\"\"),0))/IF(AND(BF110<>\"\",i_Units=\"Imperial\"),CONVERT(BF110,\"m\",\"in\"),IF(AND(i_Units=\"Imperial\",BM110=\"Metre\"),39.37,IF(BF110<>\"\",BF110,1))),\"\")","v":""},""]
[null,null,null,"Yes",0,null,null,null,null,null,null,null,null,null,null,null,null,null,null,null,null,null,null,null,null,"Y",null,null,null,"",null,null,null,"White","Black","Sanstone","Silver Grey",null,null,null,null,null,"AU","",{"$f":"i_Colour","v":0},null,"",{"$f":"IF(ISNUMBER(FIND(\"x\",BD111)),IFERROR(INDEX(INDIRECT(\"T_FinishColour[ColourCode-\"&IF(ISNUMBER(FIND(\"xxx\",BD111)),\"xxx\",IF(ISNUMBER(FIND(\"xx\",BD111)),\"xx\",\"error\"))&AQ111&\"]\"),MATCH(AU111,T_FinishColour[Finish / Colour],0)),\"\"),\"\")","v":""},null,"HIDE",null,null,null,"RC91-1001-069000",null,"RC91-1001-069000",{"$f":"IF(i_Location=\"US\",\"Edge Light Block |\",\"dim-OUT |\") &\" Side Guide Bottom Cap + Screws\"","v":"dim-OUT | Side Guide Bottom Cap + Screws"},null,{"$f":"IF(ISBLANK(BL111),\"\",IF(OR(BL111=L_Units),\"Y\",\"N\"))","v":"N"},null,{"$f":"IFERROR(IF(BG111=\"Y\",((INDEX(T_Deduc[Deduction],MATCH(BH111,T_Deduc[Type],0),0))),\"\"),\"\")","v":""},null,{"$f":"IFERROR(IF(BG111=\"Y\",(INDIRECT(BJ111)-BI111),\"\"),\"\")","v":""},"Set",{"$f":"IFERROR(IF(ISBLANK(BB111),\"\",INDEX(T_NAV[Base Unit of Measure],MATCH(BB111,T_NAV[No.],0))),\"\")","v":"SET"},1,1,{"$f":"IFERROR(INDEX(INDIRECT(\"T_NAV[\"&i_Location&\"]\"),MATCH(1,--(BB111=T_NAV[No.])*--((INDIRECT(\"T_NAV[\"&i_Location&\"]\"))<>\"\"),0))/IF(AND(BF111<>\"\",i_Units=\"Imperial\"),CONVERT(BF111,\"m\",\"in\"),IF(AND(i_Units=\"Imperial\",BM111=\"Metre\"),39.37,IF(BF111<>\"\",BF111,1))),\"\")","v":""},""]
[null,null,null,"Yes",0,null,null,null,null,null,null,null,null,null,null,null,null,null,null,null,null,null,null,null,null,"Y",null,null,null,"",null,null,null,"White","Black","Sanstone","Silver Grey",null,null,null,null,null,"AU","",{"$f":"i_Colour","v":0},null,"",{"$f":"IF(ISNUMBER(FIND(\"x\",BD112)),IFERROR(INDEX(INDIRECT(\"T_FinishColour[ColourCode-\"&IF(ISNUMBER(FIND(\"xxx\",BD112)),\"xxx\",IF(ISNUMBER(FIND(\"xx\",BD112)),\"xx\",\"error\"))&AQ112&\"]\"),MATCH(AU112,T_FinishColour[Finish / Colour],0)),\"\"),\"\")","v":""},null,"HIDE",null,null,null,"RC91-1002-069000",null,"RC91-1002-069000",{"$f":"IF(i_Location=\"US\",\"Edge Light Block |\",\"dim-OUT |\") &\" Side Guide Funnel & Screw Set\"","v":"dim-OUT | Side Guide Funnel & Screw Set"},null,{"$f":"IF(ISBLANK(BL112),\"\",IF(OR(BL112=L_Units),\"Y\",\"N\"))","v":"N"},null,{"$f":"IFERROR(IF(BG112=\"Y\",((INDEX(T_Deduc[Deduction],MATCH(BH112,T_Deduc[Type],0),0))),\"\"),\"\")","v":""},null,"","Set",{"$f":"IFERROR(IF(ISBLANK(BB112),\"\",INDEX(T_NAV[Base Unit of Measure],MATCH(BB112,T_NAV[No.],0))),\"\")","v":"SET"},1,1,{"$f":"IFERROR(INDEX(INDIRECT(\"T_NAV[\"&i_Location&\"]\"),MATCH(1,--(BB112=T_NAV[No.])*--((INDIRECT(\"T_NAV[\"&i_Location&\"]\"))<>\"\"),0))/IF(AND(BF112<>\"\",i_Units=\"Imperial\"),CONVERT(BF112,\"m\",\"in\"),IF(AND(i_Units=\"Imperial\",BM112=\"Metre\"),39.37,IF(BF112<>\"\",BF112,1))),\"\")","v":""},""]
[null,null,null,"Yes",0,null,null,null,null,null,null,null,null,null,null,null,null,null,null,null,null,null,null,null,null,null,null,null,null,"",null,null,null,null,null,null,null,null,null,null,null,null,null,"",null,null,"",{"$f":"IF(ISNUMBER(FIND(\"x\",BD113)),IFERROR(INDEX(INDIRECT(\"T_FinishColour[ColourCode-\"&IF(ISNUMBER(FIND(\"xxx\",BD113)),\"xxx\",IF(ISNUMBER(FIND(\"xx\",BD113)),\"xx\",\"error\"))&AQ113&\"]\"),MATCH(AU113,T_FinishColour[Finish / Colour],0)),\"\"),\"\")","v":""},null,"HIDE",null,null,null,"RC91-0302-338000",null,"RC91-0302-338000",{"$f":"IF(i_Location=\"US\",\"Edge Light Block |\",\"dim-OUT |\") &\" Side Guide Ear\"","v":"dim-OUT | Side Guide Ear"},null,{"$f":"IF(ISBLANK(BL113),\"\",IF(OR(BL113=L_Units),\"Y\",\"N\"))","v":"N"},null,{"$f":"IFERROR(IF(BG113=\"Y\",((INDEX(T_Deduc[Deduction],MATCH(BH113,T_Deduc[Type],0),0))),\"\"),\"\")","v":""},null,"","Piece",{"$f":"IFERROR(IF(ISBLANK(BB113),\"\",INDEX(T_NAV[Base Unit of Measure],MATCH(BB113,T_NAV[No.],0))),\"\")","v":"PIECE"},2,2,{"$f":"IFERROR(INDEX(INDIRECT(\"T_NAV[\"&i_Location&\"]\"),MATCH(1,--(BB113=T_NAV[No.])*--((INDIRECT(\"T_NAV[\"&i_Location&\"]\"))<>\"\"),0))/IF(AND(BF113<>\"\",i_Units=\"Imperial\"),CONVERT(BF113,\"m\",\"in\"),IF(AND(i_Units=\"Imperial\",BM113=\"Metre\"),39.37,IF(BF113<>\"\",BF113,1))),\"\")","v":""},""]
[null,null,null,"Yes",0,null,null,null,null,null,null,null,null,null,null,null,null,null,null,null,null,null,null,null,null,null,{"$f":"(ROUNDUP(metric_Drop/600,0)+1)*(o_nScreens)","v":1},null,null,1,"600 MAX",null,null,null,null,null,null,null,null,null,null,null,null,"",null,null,"",{"$f":"IF(ISNUMBER(FIND(\"x\",BD114)),IFERROR(INDEX(INDIRECT(\"T_FinishColour[ColourCode-\"&IF(ISNUMBER(FIND(\"xxx\",BD114)),\"xxx\",IF(ISNUMBER(FIND(\"xx\",BD114)),\"xx\",\"error\"))&AQ114&\"]\"),MATCH(AU114,T_FinishColour[Finish / Colour],0)),\"\"),\"\")","v":""},null,"HIDE",null,null,null,"RC91-0201-050000",null,"RC91-0201-050000",{"$f":"IF(i_Location=\"US\",\"Edge Light Block |\",\"dim-OUT |\") &\" Side Guide Lock\"","v":"dim-OUT | Side Guide Lock"},null,{"$f":"IF(ISBLANK(BL114),\"\",IF(OR(BL114=L_Units),\"Y\",\"N\"))","v":"N"},null,{"$f":"IFERROR(IF(BG114=\"Y\",((INDEX(T_Deduc[Deduction],MATCH(BH114,T_Deduc[Type],0),0))),\"\"),\"\")","v":""},null,"","Piece",{"$f":"IFERROR(IF(ISBLANK(BB114),\"\",INDEX(T_NAV[Base Unit of Measure],MATCH(BB114,T_NAV[No.],0))),\"\")","v":"PIECE"},2,2,{"$f":"IFERROR(INDEX(INDIRECT(\"T_NAV[\"&i_Location&\"]\"),MATCH(1,--(BB114=T_NAV[No.])*--((INDIRECT(\"T_NAV[\"&i_Location&\"]\"))<>\"\"),0))/IF(AND(BF114<>\"\",i_Units=\"Imperial\"),CONVERT(BF114,\"m\",\"in\"),IF(AND(i_Units=\"Imperial\",BM114=\"Metre\"),39.37,IF(BF114<>\"\",BF114,1))),\"\")","v":""},""]
[null,null,null,"Yes",0,null,null,null,null,null,null,null,null,null,null,null,null,null,null,null,null,null,null,null,null,"Y",null,null,null,"",null,null,null,"Black",null,null,null,null,null,null,null,null,"AU","",null,null,"",{"$f":"IF(ISNUMBER(FIND(\"x\",BD115)),IFERROR(INDEX(INDIRECT(\"T_FinishColour[ColourCode-\"&IF(ISNUMBER(FIND(\"xxx\",BD115)),\"xxx\",IF(ISNUMBER(FIND(\"xx\",BD115)),\"xx\",\"error\"))&AQ115&\"]\"),MATCH(AU115,T_FinishColour[Finish / Colour],0)),\"\"),\"\")","v":""},null,"HIDE",null,null,null,"AW91-1501-050000",null,"AW91-1501-050000","Fabric Brush T Slot",1,{"$f":"IF(ISBLANK(BL115),\"\",IF(OR(BL115=L_Units),\"Y\",\"N\"))","v":{"$error":"#N/A"}},{"$f":"\"DimOut Height (\"& INDEX(T_FixingOptions[Outcome],MATCH(i_FixingOptions,T_FixingOptions[Fixing Options],0))&\")\"","v":{"$error":"#N/A"}},{"$f":"IFERROR(IF(BG115=\"Y\",((INDEX(T_Deduc[Deduction],MATCH(BH115,T_Deduc[Type],0),0))),\"\"),\"\")","v":""},"i_Drop","",{"$f":"INDEX(T_UnitSelection[Units],MATCH(i_Units,T_UnitSelection[UnitSelection],0))","v":{"$error":"#N/A"}},{"$f":"IFERROR(IF(ISBLANK(BB115),\"\",INDEX(T_NAV[Base Unit of Measure],MATCH(BB115,T_NAV[No.],0))),\"\")","v":"METRE"},4,4,{"$f":"IFERROR(INDEX(INDIRECT(\"T_NAV[\"&i_Location&\"]\"),MATCH(1,--(BB115=T_NAV[No.])*--((INDIRECT(\"T_NAV[\"&i_Location&\"]\"))<>\"\"),0))/IF(AND(BF115<>\"\",i_Units=\"Imperial\"),CONVERT(BF115,\"m\",\"in\"),IF(AND(i_Units=\"Imperial\",BM115=\"Metre\"),39.37,IF(BF115<>\"\",BF115,1))),\"\")","v":""},""]
[null,null,null,null,null,null,null,null,null,null,null,null,null,null,null,null,null,null,null,null,null,null,null,null,null,null,null,null,null,"",null,null,null,null,null,null,null,null,null,null,null,null,null,"",null,null,"",{"$f":"IF(ISNUMBER(FIND(\"x\",BD116)),IFERROR(INDEX(INDIRECT(\"T_FinishColour[ColourCode-\"&IF(ISNUMBER(FIND(\"xxx\",BD116)),\"xxx\",IF(ISNUMBER(FIND(\"xx\",BD116)),\"xx\",\"error\"))&AQ116&\"]\"),MATCH(AU116,T_FinishColour[Finish / Colour],0)),\"\"),\"\")","v":""},null,"HIDE",null,null,null,"",null,null,null,null,{"$f":"IF(ISBLANK(BL116),\"\",IF(OR(BL116=L_Units),\"Y\",\"N\"))","v":""},null,{"$f":"IFERROR(IF(BG116=\"Y\",((INDEX(T_Deduc[Deduction],MATCH(BH116,T_Deduc[Type],0),0))),\"\"),\"\")","v":""},null,"",null,{"$f":"IFERROR(IF(ISBLANK(BB116),\"\",INDEX(T_NAV[Base Unit of Measure],MATCH(BB116,T_NAV[No.],0))),\"\")","v":""},null,"",{"$f":"IFERROR(INDEX(INDIRECT(\"T_NAV[\"&i_Location&\"]\"),MATCH(1,--(BB116=T_NAV[No.])*--((INDIRECT(\"T_NAV[\"&i_Location&\"]\"))<>\"\"),0))/IF(AND(BF116<>\"\",i_Units=\"Imperial\"),CONVERT(BF116,\"m\",\"in\"),IF(AND(i_Units=\"Imperial\",BM116=\"Metre\"),39.37,IF(BF116<>\"\",BF116,1))),\"\")","v":""},""]
[null,null,null,null,null,null,null,null,null,null,null,null,null,null,null,null,null,null,null,null,null,null,null,null,null,null,null,null,null,"",null,null,null,null,null,null,null,null,null,null,null,null,null,"",null,null,"",{"$f":"IF(ISNUMBER(FIND(\"x\",BD117)),IFERROR(INDEX(INDIRECT(\"T_FinishColour[ColourCode-\"&IF(ISNUMBER(FIND(\"xxx\",BD117)),\"xxx\",IF(ISNUMBER(FIND(\"xx\",BD117)),\"xx\",\"error\"))&AQ117&\"]\"),MATCH(AU117,T_FinishColour[Finish / Colour],0)),\"\"),\"\")","v":""},null,"HIDE",null,null,null,"",null,null,null,null,{"$f":"IF(ISBLANK(BL117),\"\",IF(OR(BL117=L_Units),\"Y\",\"N\"))","v":""},null,{"$f":"IFERROR(IF(BG117=\"Y\",((INDEX(T_Deduc[Deduction],MATCH(BH117,T_Deduc[Type],0),0))),\"\"),\"\")","v":""},null,"",null,{"$f":"IFERROR(IF(ISBLANK(BB117),\"\",INDEX(T_NAV[Base Unit of Measure],MATCH(BB117,T_NAV[No.],0))),\"\")","v":""},null,"",{"$f":"IFERROR(INDEX(INDIRECT(\"T_NAV[\"&i_Location&\"]\"),MATCH(1,--(BB117=T_NAV[No.])*--((INDIRECT(\"T_NAV[\"&i_Location&\"]\"))<>\"\"),0))/IF(AND(BF117<>\"\",i_Units=\"Imperial\"),CONVERT(BF117,\"m\",\"in\"),IF(AND(i_Units=\"Imperial\",BM117=\"Metre\"),39.37,IF(BF117<>\"\",BF117,1))),\"\")","v":""},""]
[null,null,{"$f":"C119","v":0},null,null,null,null,null,null,null,null,null,null,null,null,null,null,null,null,null,null,null,null,null,null,null,null,null,null,"",null,null,null,null,null,null,null,null,null,null,null,null,null,"",null,null,"",{"$f":"IF(ISNUMBER(FIND(\"x\",BD118)),IFERROR(INDEX(INDIRECT(\"T_FinishColour[ColourCode-\"&IF(ISNUMBER(FIND(\"xxx\",BD118)),\"xxx\",IF(ISNUMBER(FIND(\"xx\",BD118)),\"xx\",\"error\"))&AQ118&\"]\"),MATCH(AU118,T_FinishColour[Finish / Colour],0)),\"\"),\"\")","v":""},null,"HIDE",null,null,null,"",null,null,null,null,{"$f":"IF(ISBLANK(BL118),\"\",IF(OR(BL118=L_Units),\"Y\",\"N\"))","v":""},null,{"$f":"IFERROR(IF(BG118=\"Y\",((INDEX(T_Deduc[Deduction],MATCH(BH118,T_Deduc[Type],0),0))),\"\"),\"\")","v":""},null,"",null,{"$f":"IFERROR(IF(ISBLANK(BB118),\"\",INDEX(T_NAV[Base Unit of Measure],MATCH(BB118,T_NAV[No.],0))),\"\")","v":""},null,"",{"$f":"IFERROR(INDEX(INDIRECT(\"T_NAV[\"&i_Location&\"]\"),MATCH(1,--(BB118=T_NAV[No.])*--((INDIRECT(\"T_NAV[\"&i_Location&\"]\"))<>\"\"),0))/IF(AND(BF118<>\"\",i_Units=\"Imperial\"),CONVERT(BF118,\"m\",\"in\"),IF(AND(i_Units=\"Imperial\",BM118=\"Metre\"),39.37,IF(BF118<>\"\",BF118,1))),\"\")","v":""},""]
[null,null,{"$f":"IFERROR(IF(FIND(\"Link\",INDIRECT(D119))>0,1,0),0)","v":0},"i_LinkedScreens",null,"i_BracketOptions",null,"i_Tube",null,"i_InstallationType",null,"i_Location",null,null,null,null,null,null,null,null,null,null,null,null,null,null,null,null,null,"",null,null,null,null,null,null,null,null,null,null,null,null,null,"",null,null,"",{"$f":"IF(ISNUMBER(FIND(\"x\",BD119)),IFERROR(INDEX(INDIRECT(\"T_FinishColour[ColourCode-\"&IF(ISNUMBER(FIND(\"xxx\",BD119)),\"xxx\",IF(ISNUMBER(FIND(\"xx\",BD119)),\"xx\",\"error\"))&AQ119&\"]\"),MATCH(AU119,T_FinishColour[Finish / Colour],0)),\"\"),\"\")","v":""},null,"HIDE",null,null,null,"LINK SYSTEM",null,"LINK SYSTEM",null,null,null,null,{"$f":"IFERROR(IF(BG119=\"Y\",((INDEX(T_Deduc[Deduction],MATCH(BH119,T_Deduc[Type],0),0))),\"\"),\"\")","v":""},null,"",null,{"$f":"IFERROR(IF(ISBLANK(BB119),\"\",INDEX(T_NAV[Base Unit of Measure],MATCH(BB119,T_NAV[No.],0))),\"\")","v":""},null,"",{"$f":"IFERROR(INDEX(INDIRECT(\"T_NAV[\"&i_Location&\"]\"),MATCH(1,--(BB119=T_NAV[No.])*--((INDIRECT(\"T_NAV[\"&i_Location&\"]\"))<>\"\"),0))/IF(AND(BF119<>\"\",i_Units=\"Imperial\"),CONVERT(BF119,\"m\",\"in\"),IF(AND(i_Units=\"Imperial\",BM119=\"Metre\"),39.37,IF(BF119<>\"\",BF119,1))),\"\")","v":""},""]
[null,null,null,"Easy Link",{"$f":"IFERROR(IF(ISBLANK(D120),\"\",IF(FIND(D120,INDIRECT($D$119))>0,1,0)),0)","v":0},null,{"$f":"IFERROR(IF(ISBLANK(F120),\"\",IF(FIND(F120,INDIRECT($F$119))>0,1,0)),0)","v":""},"S45",{"$f":"IFERROR(IF(ISBLANK(H120),\"\",IF(FIND(H120,INDIRECT($H$119))>0,1,0)),0)","v":0},null,{"$f":"IFERROR(IF(ISBLANK(J120),\"\",IF(FIND(J120,INDIRECT($J$119))>0,1,0)),0)","v":""},null,{"$f":"IFERROR(IF(ISBLANK(L120),\"\",IF(FIND(L120,INDIRECT($L$119))>0,1,0)),0)","v":""},null,{"$f":"IFERROR(IF(ISBLANK(N120),\"\",IF(FIND(N120,INDIRECT($N$119))>0,1,0)),0)","v":""},null,null,null,null,null,null,null,null,null,null,"Y",null,{"$f":"o_nScreens-1","v":0},null,"",null,null,null,"White","Black","Silver Grey","Sandstone","Barley",null,null,null,null,"AU","",{"$f":"i_Colour","v":0},null,"",{"$f":"IF(ISNUMBER(FIND(\"x\",BD120)),IFERROR(INDEX(INDIRECT(\"T_FinishColour[ColourCode-\"&IF(ISNUMBER(FIND(\"xxx\",BD120)),\"xxx\",IF(ISNUMBER(FIND(\"xx\",BD120)),\"xx\",\"error\"))&AQ120&\"]\"),MATCH(AU120,T_FinishColour[Finish / Colour],0)),\"\"),\"\")","v":""},null,"HIDE",null,null,null,"RB41-1002-069045",null,"RB41-1002-069045","Easy-Link Intermediate Male Drive | S45",null,{"$f":"IF(ISBLANK(BL120),\"\",IF(OR(BL120=L_Units),\"Y\",\"N\"))","v":"N"},null,{"$f":"IFERROR(IF(BG120=\"Y\",((INDEX(T_Deduc[Deduction],MATCH(BH120,T_Deduc[Type],0),0))),\"\"),\"\")","v":""},null,"","Piece",{"$f":"IFERROR(IF(ISBLANK(BB120),\"\",INDEX(T_NAV[Base Unit of Measure],MATCH(BB120,T_NAV[No.],0))),\"\")","v":"PIECE"},1,1,{"$f":"IFERROR(INDEX(INDIRECT(\"T_NAV[\"&i_Location&\"]\"),MATCH(1,--(BB120=T_NAV[No.])*--((INDIRECT(\"T_NAV[\"&i_Location&\"]\"))<>\"\"),0))/IF(AND(BF120<>\"\",i_Units=\"Imperial\"),CONVERT(BF120,\"m\",\"in\"),IF(AND(i_Units=\"Imperial\",BM120=\"Metre\"),39.37,IF(BF120<>\"\",BF120,1))),\"\")","v":""},""]
[null,null,null,"Easy Link",{"$f":"IFERROR(IF(ISBLANK(D121),\"\",IF(FIND(D121,INDIRECT($D$119))>0,1,0)),0)","v":0},null,"","S45",0,null,"",null,"",null,"",null,null,null,null,null,null,null,null,null,null,"Y",null,{"$f":"o_nScreens-1","v":0},null,"",null,null,null,"White","Black","Silver Grey","Sandstone","Barley",null,null,null,null,"AU","",0,null,"",{"$f":"IF(ISNUMBER(FIND(\"x\",BD121)),IFERROR(INDEX(INDIRECT(\"T_FinishColour[ColourCode-\"&IF(ISNUMBER(FIND(\"xxx\",BD121)),\"xxx\",IF(ISNUMBER(FIND(\"xx\",BD121)),\"xx\",\"error\"))&AQ121&\"]\"),MATCH(AU121,T_FinishColour[Finish / Colour],0)),\"\"),\"\")","v":""},null,{"$f":"IF(AND(ISBLANK(BD121),ISBLANK(C121)),\"HIDE\",IF(PRODUCT(C121:Y121)=1,\"SHOW\",\"HIDE\"))","v":"HIDE"},null,null,null,"RB41-1001-069045",null,"RB41-1001-069045","Easy-Link Intermediate Female Drive | S45",null,{"$f":"IF(ISBLANK(BL121),\"\",IF(OR(BL121=L_Units),\"Y\",\"N\"))","v":"N"},null,{"$f":"IFERROR(IF(BG121=\"Y\",((INDEX(T_Deduc[Deduction],MATCH(BH121,T_Deduc[Type],0),0))),\"\"),\"\")","v":""},null,"","Set",{"$f":"IFERROR(IF(ISBLANK(BB121),\"\",INDEX(T_NAV[Base Unit of Measure],MATCH(BB121,T_NAV[No.],0))),\"\")","v":"SET"},1,1,{"$f":"IFERROR(INDEX(INDIRECT(\"T_NAV[\"&i_Location&\"]\"),MATCH(1,--(BB121=T_NAV[No.])*--((INDIRECT(\"T_NAV[\"&i_Location&\"]\"))<>\"\"),0))/IF(AND(BF121<>\"\",i_Units=\"Imperial\"),CONVERT(BF121,\"m\",\"in\"),IF(AND(i_Units=\"Imperial\",BM121=\"Metre\"),39.37,IF(BF121<>\"\",BF121,1))),\"\")","v":""},""]
[null,null,null,"Easy Link",{"$f":"IFERROR(IF(ISBLANK(D122),\"\",IF(FIND(D122,INDIRECT($D$119))>0,1,0)),0)","v":0},"LX",{"$f":"IFERROR(IF(ISBLANK(F122),\"\",IF(FIND(F122,INDIRECT($F$119))>0,1,0)),0)","v":0},null,"",null,{"$f":"IF(K124=1,0,E122)","v":0},null,"",null,"",null,null,null,null,null,null,null,null,null,null,"Y",null,{"$f":"o_nScreens-1","v":0},null,"",null,null,null,"White","Black","Silver Grey","Sandstone","Barley",null,null,null,null,"AU","",0,null,"",{"$f":"IF(ISNUMBER(FIND(\"x\",BD122)),IFERROR(INDEX(INDIRECT(\"T_FinishColour[ColourCode-\"&IF(ISNUMBER(FIND(\"xxx\",BD122)),\"xxx\",IF(ISNUMBER(FIND(\"xx\",BD122)),\"xx\",\"error\"))&AQ122&\"]\"),MATCH(AU122,T_FinishColour[Finish / Colour],0)),\"\"),\"\")","v":""},null,"HIDE",null,null,null,"RB41-0353-069040",null,"RB41-0353-069040","Easy-Link LX Inter. Bearing Bracket - 40mm Proj. · SYS40/45",null,{"$f":"IF(ISBLANK(BL122),\"\",IF(OR(BL122=L_Units),\"Y\",\"N\"))","v":"N"},null,{"$f":"IFERROR(IF(BG122=\"Y\",((INDEX(T_Deduc[Deduction],MATCH(BH122,T_Deduc[Type],0),0))),\"\"),\"\")","v":""},null,"","Piece",{"$f":"IFERROR(IF(ISBLANK(BB122),\"\",INDEX(T_NAV[Base Unit of Measure],MATCH(BB122,T_NAV[No.],0))),\"\")","v":"PIECE"},1,1,{"$f":"IFERROR(INDEX(INDIRECT(\"T_NAV[\"&i_Location&\"]\"),MATCH(1,--(BB122=T_NAV[No.])*--((INDIRECT(\"T_NAV[\"&i_Location&\"]\"))<>\"\"),0))/IF(AND(BF122<>\"\",i_Units=\"Imperial\"),CONVERT(BF122,\"m\",\"in\"),IF(AND(i_Units=\"Imperial\",BM122=\"Metre\"),39.37,IF(BF122<>\"\",BF122,1))),\"\")","v":""},""]
[null,null,null,null,null,null,"",null,"",null,"",null,"",null,"",null,null,null,null,null,null,null,null,null,null,null,null,null,null,"",null,null,null,"White","Black","Silver Grey","Sandstone","Barley",null,null,null,null,"AU","",0,null,"",{"$f":"IF(ISNUMBER(FIND(\"x\",BD123)),IFERROR(INDEX(INDIRECT(\"T_FinishColour[ColourCode-\"&IF(ISNUMBER(FIND(\"xxx\",BD123)),\"xxx\",IF(ISNUMBER(FIND(\"xx\",BD123)),\"xx\",\"error\"))&AQ123&\"]\"),MATCH(AU123,T_FinishColour[Finish / Colour],0)),\"\"),\"\")","v":""},null,"HIDE",null,null,null,"RB41-0353-069055",null,"RB41-0353-069055","Easy-Link LX Inter. Bearing Bracket - 55mm Proj. · SYS40/45",null,{"$f":"IF(ISBLANK(BL123),\"\",IF(OR(BL123=L_Units),\"Y\",\"N\"))","v":"N"},null,{"$f":"IFERROR(IF(BG123=\"Y\",((INDEX(T_Deduc[Deduction],MATCH(BH123,T_Deduc[Type],0),0))),\"\"),\"\")","v":""},null,"","Piece",{"$f":"IFERROR(IF(ISBLANK(BB123),\"\",INDEX(T_NAV[Base Unit of Measure],MATCH(BB123,T_NAV[No.],0))),\"\")","v":"PIECE"},1,1,{"$f":"IFERROR(INDEX(INDIRECT(\"T_NAV[\"&i_Location&\"]\"),MATCH(1,--(BB123=T_NAV[No.])*--((INDIRECT(\"T_NAV[\"&i_Location&\"]\"))<>\"\"),0))/IF(AND(BF123<>\"\",i_Units=\"Imperial\"),CONVERT(BF123,\"m\",\"in\"),IF(AND(i_Units=\"Imperial\",BM123=\"Metre\"),39.37,IF(BF123<>\"\",BF123,1))),\"\")","v":""},""]
[null,null,null,"Easy Link",{"$f":"IFERROR(IF(ISBLANK(D124),\"\",IF(FIND(D124,INDIRECT($D$119))>0,1,0)),0)","v":0},null,"",null,"","CF90",0,null,"",null,"",null,null,null,null,null,null,null,null,null,null,"Y",null,{"$f":"o_nScreens-1","v":0},null,"",null,null,null,"White","Black","Silver Grey",null,null,null,null,null,null,"AU","",0,null,"",{"$f":"IF(ISNUMBER(FIND(\"x\",BD124)),IFERROR(INDEX(INDIRECT(\"T_FinishColour[ColourCode-\"&IF(ISNUMBER(FIND(\"xxx\",BD124)),\"xxx\",IF(ISNUMBER(FIND(\"xx\",BD124)),\"xx\",\"error\"))&AQ124&\"]\"),MATCH(AU124,T_FinishColour[Finish / Colour],0)),\"\"),\"\")","v":""},null,"HIDE",null,null,null,"RB41-0453-069040",null,"RB41-0453-069040","Easy-Link LX Inter. Brkt - 40p + Grub Screw | S40/45",null,{"$f":"IF(ISBLANK(BL124),\"\",IF(OR(BL124=L_Units),\"Y\",\"N\"))","v":"N"},null,{"$f":"IFERROR(IF(BG124=\"Y\",((INDEX(T_Deduc[Deduction],MATCH(BH124,T_Deduc[Type],0),0))),\"\"),\"\")","v":""},null,"","Set",{"$f":"IFERROR(IF(ISBLANK(BB124),\"\",INDEX(T_NAV[Base Unit of Measure],MATCH(BB124,T_NAV[No.],0))),\"\")","v":"SET"},1,1,{"$f":"IFERROR(INDEX(INDIRECT(\"T_NAV[\"&i_Location&\"]\"),MATCH(1,--(BB124=T_NAV[No.])*--((INDIRECT(\"T_NAV[\"&i_Location&\"]\"))<>\"\"),0))/IF(AND(BF124<>\"\",i_Units=\"Imperial\"),CONVERT(BF124,\"m\",\"in\"),IF(AND(i_Units=\"Imperial\",BM124=\"Metre\"),39.37,IF(BF124<>\"\",BF124,1))),\"\")","v":""},""]
[null,null,null,"Easy Link",{"$f":"IFERROR(IF(ISBLANK(D125),\"\",IF(FIND(D125,INDIRECT($D$119))>0,1,0)),0)","v":0},null,"","1.5\"",{"$f":"IFERROR(IF(ISBLANK(H125),\"\",IF(FIND(H125,INDIRECT($H$119))>0,1,0)),0)","v":0},null,"",null,"",null,"",null,null,null,null,null,null,null,null,null,null,"Y",null,{"$f":"o_nScreens-1","v":0},null,"",null,null,null,null,null,null,null,null,null,null,null,null,"US",{"$f":"IF(ISNUMBER(FIND(\"x\",BD125)),IFERROR(INDEX(AH125:AP125,0,MATCH(AS125,AH125:AP125,0)),IF(AH125<>\"\",AH125,i_DefaultColour)),\"\")","v":""},0,null,{"$f":"IF(ISNUMBER(FIND(\"x\",BD125)),IFERROR(INDEX(AH125:AP125,0,MATCH(AS125,AH125:AP125,0)),AR125),\"\")","v":""},{"$f":"IF(ISNUMBER(FIND(\"x\",BD125)),IFERROR(INDEX(INDIRECT(\"T_FinishColour[ColourCode-\"&IF(ISNUMBER(FIND(\"xxx\",BD125)),\"xxx\",IF(ISNUMBER(FIND(\"xx\",BD125)),\"xx\",\"error\"))&AQ125&\"]\"),MATCH(AU125,T_FinishColour[Finish / Colour],0)),\"\"),\"\")","v":""},null,"HIDE",null,null,null,"RB41-1001-075038",null,"RB41-1001-075038","Medium Easy-Link Intermediate FEMALE Drive | 38mm (1.5”)",null,{"$f":"IF(ISBLANK(BL125),\"\",IF(OR(BL125=L_Units),\"Y\",\"N\"))","v":"N"},null,{"$f":"IFERROR(IF(BG125=\"Y\",((INDEX(T_Deduc[Deduction],MATCH(BH125,T_Deduc[Type],0),0))),\"\"),\"\")","v":""},null,{"$f":"IFERROR(IF(BG125=\"Y\",(INDIRECT(BJ125)-BI125)/IF(Z125=\"\",1,o_nScreens),\"\"),\"\")","v":""},"Piece",{"$f":"IFERROR(IF(ISBLANK(BB125),\"\",INDEX(T_NAV[Base Unit of Measure],MATCH(BB125,T_NAV[No.],0))),\"\")","v":"PIECE"},1,{"$f":"IF(ISBLANK(BN125),\"\",PRODUCT(AD125,BN125,ShadeQuantity))","v":1},{"$f":"IFERROR(INDEX(INDIRECT(\"T_NAV[\"&i_Location&\"]\"),MATCH(1,--(BB125=T_NAV[No.])*--((INDIRECT(\"T_NAV[\"&i_Location&\"]\"))<>\"\"),0))/IF(AND(BF125<>\"\",i_Units=\"Imperial\"),CONVERT(BF125,\"m\",\"in\"),IF(AND(i_Units=\"Imperial\",BM125=\"Metre\"),39.37,IF(BF125<>\"\",BF125,1))),\"\")","v":""},""]
[null,null,null,"Easy Link",0,null,"","1.5\"",0,null,"",null,"",null,"",null,null,null,null,null,null,null,null,null,null,"Y",null,{"$f":"o_nScreens-1","v":0},null,{"$f":"IFERROR(IF(AND(o_nScreens>1,Z126=\"Y\",PRODUCT(AA126:AC126)=0),o_nScreens,IF(PRODUCT(AA126:AC126)=0,\"\",PRODUCT(AA126:AC126))),\"\")","v":""},null,null,null,null,null,null,null,null,null,null,null,null,"US","",0,null,"",{"$f":"IF(ISNUMBER(FIND(\"x\",BD126)),IFERROR(INDEX(INDIRECT(\"T_FinishColour[ColourCode-\"&IF(ISNUMBER(FIND(\"xxx\",BD126)),\"xxx\",IF(ISNUMBER(FIND(\"xx\",BD126)),\"xx\",\"error\"))&AQ126&\"]\"),MATCH(AU126,T_FinishColour[Finish / Colour],0)),\"\"),\"\")","v":""},null,"HIDE",null,null,null,"RB41-1002-075038",null,"RB41-1002-075038","Medium Easy-Link Intermediate MALE Drive | 38mm (1.5”)",null,{"$f":"IF(ISBLANK(BL126),\"\",IF(OR(BL126=L_Units),\"Y\",\"N\"))","v":"N"},null,{"$f":"IFERROR(IF(BG126=\"Y\",((INDEX(T_Deduc[Deduction],MATCH(BH126,T_Deduc[Type],0),0))),\"\"),\"\")","v":""},null,"","Piece",{"$f":"IFERROR(IF(ISBLANK(BB126),\"\",INDEX(T_NAV[Base Unit of Measure],MATCH(BB126,T_NAV[No.],0))),\"\")","v":"PIECE"},1,1,{"$f":"IFERROR(INDEX(INDIRECT(\"T_NAV[\"&i_Location&\"]\"),MATCH(1,--(BB126=T_NAV[No.])*--((INDIRECT(\"T_NAV[\"&i_Location&\"]\"))<>\"\"),0))/IF(AND(BF126<>\"\",i_Units=\"Imperial\"),CONVERT(BF126,\"m\",\"in\"),IF(AND(i_Units=\"Imperial\",BM126=\"Metre\"),39.37,IF(BF126<>\"\",BF126,1))),\"\")","v":""},""]
[null,null,null,"Infinite Adjuster",{"$f":"IFERROR(IF(ISBLANK(D127),\"\",IF(FIND(D127,INDIRECT($D$119))>0,1,0)),0)","v":0},null,"","1.5\"",0,null,"","US",0,null,"",null,null,null,null,null,null,null,null,null,null,"Y",null,{"$f":"o_nScreens-1","v":0},null,"",null,null,null,"White","Black",null,null,null,null,null,null,null,"AU","",{"$f":"i_Colour","v":0},null,"",{"$f":"IF(ISNUMBER(FIND(\"x\",BD127)),IFERROR(INDEX(INDIRECT(\"T_FinishColour[ColourCode-\"&IF(ISNUMBER(FIND(\"xxx\",BD127)),\"xxx\",IF(ISNUMBER(FIND(\"xx\",BD127)),\"xx\",\"error\"))&AQ127&\"]\"),MATCH(AU127,T_FinishColour[Finish / Colour],0)),\"\"),\"\")","v":""},null,"HIDE",null,null,null,"RB41-0501-069000",null,"RB41-0501-069000","Medium Multi-Link Bracket Disc + Bearing",null,{"$f":"IF(ISBLANK(BL127),\"\",IF(OR(BL127=L_Units),\"Y\",\"N\"))","v":"N"},null,{"$f":"IFERROR(IF(BG127=\"Y\",((INDEX(T_Deduc[Deduction],MATCH(BH127,T_Deduc[Type],0),0))),\"\"),\"\")","v":""},null,"","Piece",{"$f":"IFERROR(IF(ISBLANK(BB127),\"\",INDEX(T_NAV[Base Unit of Measure],MATCH(BB127,T_NAV[No.],0))),\"\")","v":"PIECE"},1,1,{"$f":"IFERROR(INDEX(INDIRECT(\"T_NAV[\"&i_Location&\"]\"),MATCH(1,--(BB127=T_NAV[No.])*--((INDIRECT(\"T_NAV[\"&i_Location&\"]\"))<>\"\"),0))/IF(AND(BF127<>\"\",i_Units=\"Imperial\"),CONVERT(BF127,\"m\",\"in\"),IF(AND(i_Units=\"Imperial\",BM127=\"Metre\"),39.37,IF(BF127<>\"\",BF127,1))),\"\")","v":""},""]
[null,null,null,"Easy Link",{"$f":"IFERROR(IF(ISBLANK(D128),\"\",IF(FIND(D128,INDIRECT($D$119))>0,1,0)),0)","v":0},"Skyline",0,null,"",null,"",null,"",null,"",null,null,null,null,null,null,null,null,null,null,null,null,null,null,"",null,null,null,"White","Black",null,null,null,null,null,null,null,"AU","",null,null,"",{"$f":"IF(ISNUMBER(FIND(\"x\",BD128)),IFERROR(INDEX(INDIRECT(\"T_FinishColour[ColourCode-\"&IF(ISNUMBER(FIND(\"xxx\",BD128)),\"xxx\",IF(ISNUMBER(FIND(\"xx\",BD128)),\"xx\",\"error\"))&AQ128&\"]\"),MATCH(AU128,T_FinishColour[Finish / Colour],0)),\"\"),\"\")","v":""},null,"HIDE",null,null,null,"RB41-0502-069000",null,"RB41-0502-069000","Medium Easy-Link Bracket Disk + Bearing",null,{"$f":"IF(ISBLANK(BL128),\"\",IF(OR(BL128=L_Units),\"Y\",\"N\"))","v":"N"},null,{"$f":"IFERROR(IF(BG128=\"Y\",((INDEX(T_Deduc[Deduction],MATCH(BH128,T_Deduc[Type],0),0))),\"\"),\"\")","v":""},null,"","Piece",{"$f":"IFERROR(IF(ISBLANK(BB128),\"\",INDEX(T_NAV[Base Unit of Measure],MATCH(BB128,T_NAV[No.],0))),\"\")","v":"PIECE"},1,1,{"$f":"IFERROR(INDEX(INDIRECT(\"T_NAV[\"&i_Location&\"]\"),MATCH(1,--(BB128=T_NAV[No.])*--((INDIRECT(\"T_NAV[\"&i_Location&\"]\"))<>\"\"),0))/IF(AND(BF128<>\"\",i_Units=\"Imperial\"),CONVERT(BF128,\"m\",\"in\"),IF(AND(i_Units=\"Imperial\",BM128=\"Metre\"),39.37,IF(BF128<>\"\",BF128,1))),\"\")","v":""},""]
[null,null,null,"Easy Link",{"$f":"IFERROR(IF(ISBLANK(D129),\"\",IF(FIND(D129,INDIRECT($D$119))>0,1,0)),0)","v":0},"Skyline",0,null,"",null,null,null,null,null,"",null,null,null,null,null,null,null,null,null,null,"Y",null,{"$f":"o_nScreens-1","v":0},null,"",null,null,null,"White","Black",null,null,null,null,null,null,null,"US","",{"$f":"i_Colour","v":0},null,"",{"$f":"IF(ISNUMBER(FIND(\"x\",BD129)),IFERROR(INDEX(INDIRECT(\"T_FinishColour[ColourCode-\"&IF(ISNUMBER(FIND(\"xxx\",BD129)),\"xxx\",IF(ISNUMBER(FIND(\"xx\",BD129)),\"xx\",\"error\"))&AQ129&\"]\"),MATCH(AU129,T_FinishColour[Finish / Colour],0)),\"\"),\"\")","v":""},null,"HIDE",null,null,null,{"$f":"_xlfn.IFNA(SUBSTITUTE(IF(AQ129=\"AU\",SUBSTITUTE(BD129,\"xxx\",AV129),SUBSTITUTE(SUBSTITUTE(BD129,\"xx\",AV129),\"x\",\"\")),\"LLL\",\"580\"),BD129)","v":"RB41-0321-075138"},null,"RB41-0321-075138","Medium Link Skyline Bracket | 38mm Proj.",null,{"$f":"IF(ISBLANK(BL129),\"\",IF(OR(BL129=L_Units),\"Y\",\"N\"))","v":"N"},null,{"$f":"IFERROR(IF(BG129=\"Y\",((INDEX(T_Deduc[Deduction],MATCH(BH129,T_Deduc[Type],0),0))),\"\"),\"\")","v":""},null,"","Piece",{"$f":"IFERROR(IF(ISBLANK(BB129),\"\",INDEX(T_NAV[Base Unit of Measure],MATCH(BB129,T_NAV[No.],0))),\"\")","v":"PIECE"},1,1,{"$f":"IFERROR(INDEX(INDIRECT(\"T_NAV[\"&i_Location&\"]\"),MATCH(1,--(BB129=T_NAV[No.])*--((INDIRECT(\"T_NAV[\"&i_Location&\"]\"))<>\"\"),0))/IF(AND(BF129<>\"\",i_Units=\"Imperial\"),CONVERT(BF129,\"m\",\"in\"),IF(AND(i_Units=\"Imperial\",BM129=\"Metre\"),39.37,IF(BF129<>\"\",BF129,1))),\"\")","v":""},""]
[null,null,null,null,"",null,"",null,"",null,"",null,{"$f":"IFERROR(IF(ISBLANK(L130),\"\",IF(FIND(L130,INDIRECT($L$119))>0,1,0)),0)","v":""},null,"",null,null,null,null,null,null,null,null,null,null,null,null,null,null,"",null,null,null,"White","Black",null,null,null,null,null,null,null,"US","",null,null,"",{"$f":"IF(ISNUMBER(FIND(\"x\",BD130)),IFERROR(INDEX(INDIRECT(\"T_FinishColour[ColourCode-\"&IF(ISNUMBER(FIND(\"xxx\",BD130)),\"xxx\",IF(ISNUMBER(FIND(\"xx\",BD130)),\"xx\",\"error\"))&AQ130&\"]\"),MATCH(AU130,T_FinishColour[Finish / Colour],0)),\"\"),\"\")","v":""},null,"HIDE",null,null,null,"RB41-0321-069050",null,"RB41-0321-069050","Medium Link Skyline Bracket | 50mm Proj.",null,{"$f":"IF(ISBLANK(BL130),\"\",IF(OR(BL130=L_Units),\"Y\",\"N\"))","v":"N"},null,{"$f":"IFERROR(IF(BG130=\"Y\",((INDEX(T_Deduc[Deduction],MATCH(BH130,T_Deduc[Type],0),0))),\"\"),\"\")","v":""},null,"","Piece",{"$f":"IFERROR(IF(ISBLANK(BB130),\"\",INDEX(T_NAV[Base Unit of Measure],MATCH(BB130,T_NAV[No.],0))),\"\")","v":""},1,1,{"$f":"IFERROR(INDEX(INDIRECT(\"T_NAV[\"&i_Location&\"]\"),MATCH(1,--(BB130=T_NAV[No.])*--((INDIRECT(\"T_NAV[\"&i_Location&\"]\"))<>\"\"),0))/IF(AND(BF130<>\"\",i_Units=\"Imperial\"),CONVERT(BF130,\"m\",\"in\"),IF(AND(i_Units=\"Imperial\",BM130=\"Metre\"),39.37,IF(BF130<>\"\",BF130,1))),\"\")","v":""},""]
[null,null,null,{"$f":"IF(E133=1,D133,\"Skyline\")","v":"Skyline"},0,"Skyline 3\"",{"$f":"IFERROR(IF(ISBLANK(F131),\"\",IF(FIND(F131,INDIRECT($F$119))>0,1,0)),0)","v":0},"1.5\"",0,null,"","US",{"$f":"IFERROR(IF(ISBLANK(L131),\"\",IF(FIND(L131,INDIRECT($L$119))>0,1,0)),0)","v":0},null,{"$f":"IFERROR(IF(ISBLANK(N131),\"\",IF(FIND(N131,INDIRECT($N$119))>0,1,0)),0)","v":""},null,null,null,null,null,null,null,null,null,null,"Y",null,{"$f":"o_nScreens-1","v":0},null,"",null,null,null,"White","Black","Vanilla",null,null,null,null,null,null,"US","",{"$f":"i_Colour","v":0},null,"",{"$f":"IF(ISNUMBER(FIND(\"x\",BD131)),IFERROR(INDEX(INDIRECT(\"T_FinishColour[ColourCode-\"&IF(ISNUMBER(FIND(\"xxx\",BD131)),\"xxx\",IF(ISNUMBER(FIND(\"xx\",BD131)),\"xx\",\"error\"))&AQ131&\"]\"),MATCH(AU131,T_FinishColour[Finish / Colour],0)),\"\"),\"\")","v":""},null,"HIDE",null,null,null,"RB41-0331-075075",null,"RB41-0331-075075","3\" Skyline Fascia Link Bracket",null,{"$f":"IF(ISBLANK(BL131),\"\",IF(OR(BL131=L_Units),\"Y\",\"N\"))","v":"N"},null,{"$f":"IFERROR(IF(BG131=\"Y\",((INDEX(T_Deduc[Deduction],MATCH(BH131,T_Deduc[Type],0),0))),\"\"),\"\")","v":""},null,"","Set",{"$f":"IFERROR(IF(ISBLANK(BB131),\"\",INDEX(T_NAV[Base Unit of Measure],MATCH(BB131,T_NAV[No.],0))),\"\")","v":"PIECE"},1,1,{"$f":"IFERROR(INDEX(INDIRECT(\"T_NAV[\"&i_Location&\"]\"),MATCH(1,--(BB131=T_NAV[No.])*--((INDIRECT(\"T_NAV[\"&i_Location&\"]\"))<>\"\"),0))/IF(AND(BF131<>\"\",i_Units=\"Imperial\"),CONVERT(BF131,\"m\",\"in\"),IF(AND(i_Units=\"Imperial\",BM131=\"Metre\"),39.37,IF(BF131<>\"\",BF131,1))),\"\")","v":""},""]
[null,null,null,{"$f":"IF(E133=1,D133,\"Skyline\")","v":"Skyline"},{"$f":"IFERROR(IF(ISBLANK(D132),\"\",IF(FIND(D132,INDIRECT($D$119))>0,1,0)),0)","v":0},"Skyline 4\"",{"$f":"IFERROR(IF(ISBLANK(F132),\"\",IF(FIND(F132,INDIRECT($F$119))>0,1,0)),0)","v":0},"1.5\"",{"$f":"IFERROR(IF(ISBLANK(H132),\"\",IF(FIND(H132,INDIRECT($H$119))>0,1,0)),0)","v":0},null,{"$f":"IFERROR(IF(ISBLANK(J132),\"\",IF(FIND(J132,INDIRECT($J$119))>0,1,0)),0)","v":""},"US",{"$f":"IFERROR(IF(ISBLANK(L132),\"\",IF(FIND(L132,INDIRECT($L$119))>0,1,0)),0)","v":0},null,"",null,null,null,null,null,null,null,null,null,null,"Y",null,{"$f":"o_nScreens-1","v":0},null,{"$f":"IFERROR(IF(AND(o_nScreens>1,Z132=\"Y\",PRODUCT(AA132:AC132)=0),o_nScreens,IF(PRODUCT(AA132:AC132)=0,\"\",PRODUCT(AA132:AC132))),\"\")","v":""},null,null,null,"White","Black","Vanilla",null,null,null,null,null,null,"US",{"$f":"IF(ISNUMBER(FIND(\"x\",BD132)),IFERROR(INDEX(AH132:AP132,0,MATCH(AS132,AH132:AP132,0)),IF(AH132<>\"\",AH132,i_DefaultColour)),\"\")","v":""},{"$f":"i_Colour","v":0},null,{"$f":"IF(ISNUMBER(FIND(\"x\",BD132)),IFERROR(INDEX(AH132:AP132,0,MATCH(AS132,AH132:AP132,0)),AR132),\"\")","v":""},{"$f":"IF(ISNUMBER(FIND(\"x\",BD132)),IFERROR(INDEX(INDIRECT(\"T_FinishColour[ColourCode-\"&IF(ISNUMBER(FIND(\"xxx\",BD132)),\"xxx\",IF(ISNUMBER(FIND(\"xx\",BD132)),\"xx\",\"error\"))&AQ132&\"]\"),MATCH(AU132,T_FinishColour[Finish / Colour],0)),\"\"),\"\")","v":""},null,"HIDE",null,null,null,{"$f":"_xlfn.IFNA(SUBSTITUTE(IF(AQ132=\"AU\",SUBSTITUTE(BD132,\"xxx\",AV132),SUBSTITUTE(SUBSTITUTE(BD132,\"xx\",AV132),\"x\",\"\")),\"LLL\",\"580\"),BD132)","v":"RB88-2106-025002"},null,"RB88-2106-025002","4\" Skyline Split Fascia Link Brakcet",null,{"$f":"IF(ISBLANK(BL132),\"\",IF(OR(BL132=L_Units),\"Y\",\"N\"))","v":"N"},null,{"$f":"IFERROR(IF(BG132=\"Y\",((INDEX(T_Deduc[Deduction],MATCH(BH132,T_Deduc[Type],0),0))),\"\"),\"\")","v":""},null,{"$f":"IFERROR(IF(BG132=\"Y\",(INDIRECT(BJ132)-BI132)/IF(Z132=\"\",1,o_nScreens),\"\"),\"\")","v":""},"Set",{"$f":"IFERROR(IF(ISBLANK(BB132),\"\",INDEX(T_NAV[Base Unit of Measure],MATCH(BB132,T_NAV[No.],0))),\"\")","v":""},1,{"$f":"IF(ISBLANK(BN132),\"\",PRODUCT(AD132,BN132,ShadeQuantity))","v":1},{"$f":"IFERROR(INDEX(INDIRECT(\"T_NAV[\"&i_Location&\"]\"),MATCH(1,--(BB132=T_NAV[No.])*--((INDIRECT(\"T_NAV[\"&i_Location&\"]\"))<>\"\"),0))/IF(AND(BF132<>\"\",i_Units=\"Imperial\"),CONVERT(BF132,\"m\",\"in\"),IF(AND(i_Units=\"Imperial\",BM132=\"Metre\"),39.37,IF(BF132<>\"\",BF132,1))),\"\")","v":""},""]
[null,null,null,"Infinite Adjuster",0,null,"","1.5\"",0,null,"","US",{"$f":"IFERROR(IF(ISBLANK(L133),\"\",IF(FIND(L133,INDIRECT($L$119))>0,1,0)),0)","v":0},null,"",null,null,null,null,null,null,null,null,null,null,"Y",null,{"$f":"o_nScreens-1","v":0},null,"",null,null,null,"White","Black","Vanilla",null,null,null,null,null,null,"US","White",{"$f":"i_Colour","v":0},null,"White",{"$f":"IF(ISNUMBER(FIND(\"x\",BD133)),IFERROR(INDEX(INDIRECT(\"T_FinishColour[ColourCode-\"&IF(ISNUMBER(FIND(\"xxx\",BD133)),\"xxx\",IF(ISNUMBER(FIND(\"xx\",BD133)),\"xx\",\"error\"))&AQ133&\"]\"),MATCH(AU133,T_FinishColour[Finish / Colour],0)),\"\"),\"\")","v":"W"},null,"HIDE",null,null,null,"LSADJKITW",null,"LSADJKITxx","Medium Multi-Link Infinite Adjuster Kit",null,{"$f":"IF(ISBLANK(BL133),\"\",IF(OR(BL133=L_Units),\"Y\",\"N\"))","v":"N"},null,{"$f":"IFERROR(IF(BG133=\"Y\",((INDEX(T_Deduc[Deduction],MATCH(BH133,T_Deduc[Type],0),0))),\"\"),\"\")","v":""},null,"","Set",{"$f":"IFERROR(IF(ISBLANK(BB133),\"\",INDEX(T_NAV[Base Unit of Measure],MATCH(BB133,T_NAV[No.],0))),\"\")","v":"KIT"},1,1,{"$f":"IFERROR(INDEX(INDIRECT(\"T_NAV[\"&i_Location&\"]\"),MATCH(1,--(BB133=T_NAV[No.])*--((INDIRECT(\"T_NAV[\"&i_Location&\"]\"))<>\"\"),0))/IF(AND(BF133<>\"\",i_Units=\"Imperial\"),CONVERT(BF133,\"m\",\"in\"),IF(AND(i_Units=\"Imperial\",BM133=\"Metre\"),39.37,IF(BF133<>\"\",BF133,1))),\"\")","v":""},""]
[null,null,null,null,null,null,null,null,null,null,null,null,null,null,null,null,null,null,null,null,null,null,null,null,null,null,null,null,null,{"$f":"IFERROR(IF(AND(o_nScreens>1,Z134=\"Y\",PRODUCT(AA134:AC134)=0),o_nScreens,IF(PRODUCT(AA134:AC134)=0,\"\",PRODUCT(AA134:AC134))),\"\")","v":""},null,null,null,null,null,null,null,null,null,null,null,null,null,{"$f":"IF(ISNUMBER(FIND(\"x\",BD134)),IFERROR(INDEX(AH134:AP134,0,MATCH(AS134,AH134:AP134,0)),IF(AH134<>\"\",AH134,i_DefaultColour)),\"\")","v":""},null,null,{"$f":"IF(ISNUMBER(FIND(\"x\",BD134)),IFERROR(INDEX(AH134:AP134,0,MATCH(AS134,AH134:AP134,0)),AR134),\"\")","v":""},{"$f":"IF(ISNUMBER(FIND(\"x\",BD134)),IFERROR(INDEX(INDIRECT(\"T_FinishColour[ColourCode-\"&IF(ISNUMBER(FIND(\"xxx\",BD134)),\"xxx\",IF(ISNUMBER(FIND(\"xx\",BD134)),\"xx\",\"error\"))&AQ134&\"]\"),MATCH(AU134,T_FinishColour[Finish / Colour],0)),\"\"),\"\")","v":""},null,"HIDE",null,null,null,null,null,null,null,null,null,null,null,null,null,null,null,null,null,null,""]
[null,null,null,null,null,null,null,null,null,null,null,null,null,null,null,null,null,null,null,null,null,null,null,null,null,null,null,null,null,"",null,null,null,null,null,null,null,null,null,null,null,null,null,"",null,null,"",{"$f":"IF(ISNUMBER(FIND(\"x\",BD135)),IFERROR(INDEX(INDIRECT(\"T_FinishColour[ColourCode-\"&IF(ISNUMBER(FIND(\"xxx\",BD135)),\"xxx\",IF(ISNUMBER(FIND(\"xx\",BD135)),\"xx\",\"error\"))&AQ135&\"]\"),MATCH(AU135,T_FinishColour[Finish / Colour],0)),\"\"),\"\")","v":""},null,"HIDE",null,null,null,null,null,null,null,null,null,null,null,null,null,null,null,null,null,null,""]
[null,null,{"$f":"C137","v":0},null,null,null,null,null,null,null,null,null,null,null,null,null,null,null,null,null,null,null,null,null,null,null,null,null,null,"",null,null,null,null,null,null,null,null,null,null,null,null,null,"",null,null,"",{"$f":"IF(ISNUMBER(FIND(\"x\",BD136)),IFERROR(INDEX(INDIRECT(\"T_FinishColour[ColourCode-\"&IF(ISNUMBER(FIND(\"xxx\",BD136)),\"xxx\",IF(ISNUMBER(FIND(\"xx\",BD136)),\"xx\",\"error\"))&AQ136&\"]\"),MATCH(AU136,T_FinishColour[Finish / Colour],0)),\"\"),\"\")","v":""},null,"HIDE",null,null,null,"",null,null,null,null,{"$f":"IF(ISBLANK(BL136),\"\",IF(OR(BL136=L_Units),\"Y\",\"N\"))","v":""},null,{"$f":"IFERROR(IF(BG136=\"Y\",((INDEX(T_Deduc[Deduction],MATCH(BH136,T_Deduc[Type],0),0))),\"\"),\"\")","v":""},null,"",null,{"$f":"IFERROR(IF(ISBLANK(BB136),\"\",INDEX(T_NAV[Base Unit of Measure],MATCH(BB136,T_NAV[No.],0))),\"\")","v":""},null,"",{"$f":"IFERROR(INDEX(INDIRECT(\"T_NAV[\"&i_Location&\"]\"),MATCH(1,--(BB136=T_NAV[No.])*--((INDIRECT(\"T_NAV[\"&i_Location&\"]\"))<>\"\"),0))/IF(AND(BF136<>\"\",i_Units=\"Imperial\"),CONVERT(BF136,\"m\",\"in\"),IF(AND(i_Units=\"Imperial\",BM136=\"Metre\"),39.37,IF(BF136<>\"\",BF136,1))),\"\")","v":""},""]
[null,null,{"$f":"IFERROR(IF(FIND(\"Wand\",i_ControlType)>0,1,0),0)","v":0},"i_ControlSide",null,"i_Tube",null,"i_ControlType",null,"i_installationType",null,null,null,null,null,null,null,null,null,null,null,null,null,null,null,null,null,null,null,"",null,null,null,null,null,null,null,null,null,null,null,null,null,"",null,null,"",{"$f":"IF(ISNUMBER(FIND(\"x\",BD137)),IFERROR(INDEX(INDIRECT(\"T_FinishColour[ColourCode-\"&IF(ISNUMBER(FIND(\"xxx\",BD137)),\"xxx\",IF(ISNUMBER(FIND(\"xx\",BD137)),\"xx\",\"error\"))&AQ137&\"]\"),MATCH(AU137,T_FinishColour[Finish / Colour],0)),\"\"),\"\")","v":""},null,"HIDE",null,null,null,"EASY SPRING WAND",null,"EASY SPRING WAND",null,null,null,null,{"$f":"IFERROR(IF(BG137=\"Y\",((INDEX(T_Deduc[Deduction],MATCH(BH137,T_Deduc[Type],0),0))),\"\"),\"\")","v":""},null,"",null,{"$f":"IFERROR(IF(ISBLANK(BB137),\"\",INDEX(T_NAV[Base Unit of Measure],MATCH(BB137,T_NAV[No.],0))),\"\")","v":""},null,"",{"$f":"IFERROR(INDEX(INDIRECT(\"T_NAV[\"&i_Location&\"]\"),MATCH(1,--(BB137=T_NAV[No.])*--((INDIRECT(\"T_NAV[\"&i_Location&\"]\"))<>\"\"),0))/IF(AND(BF137<>\"\",i_Units=\"Imperial\"),CONVERT(BF137,\"m\",\"in\"),IF(AND(i_Units=\"Imperial\",BM137=\"Metre\"),39.37,IF(BF137<>\"\",BF137,1))),\"\")","v":""},""]
[null,null,null,"Left Hand",{"$f":"IFERROR(IF(ISBLANK(D138),\"\",IF(FIND(D138,INDIRECT($D$137))>0,1,0)),0)","v":0},null,{"$f":"IFERROR(IF(ISBLANK(F138),\"\",IF(FIND(F138,INDIRECT($F$137))>0,1,0)),0)","v":""},"Wand",{"$f":"IFERROR(IF(ISBLANK(H138),\"\",IF(FIND(H138,INDIRECT($H$137))>0,1,0)),0)","v":0},null,{"$f":"IFERROR(IF(ISBLANK(J138),\"\",IF(FIND(J138,INDIRECT($J$137))>0,1,0)),0)","v":""},null,null,null,null,null,null,null,null,null,null,null,null,null,null,null,null,null,null,"",null,null,null,null,null,null,null,null,null,null,null,null,"AU","White",null,null,"White",{"$f":"IF(ISNUMBER(FIND(\"x\",BD138)),IFERROR(INDEX(INDIRECT(\"T_FinishColour[ColourCode-\"&IF(ISNUMBER(FIND(\"xxx\",BD138)),\"xxx\",IF(ISNUMBER(FIND(\"xx\",BD138)),\"xx\",\"error\"))&AQ138&\"]\"),MATCH(AU138,T_FinishColour[Finish / Colour],0)),\"\"),\"\")","v":"069"},null,"HIDE",null,null,null,"RB12-3511-069090",null,"RB12-3511-xxx090","Easy Spring Wand Control + Wand| LH (Blue)",null,{"$f":"IF(ISBLANK(BL138),\"\",IF(OR(BL138=L_Units),\"Y\",\"N\"))","v":"N"},null,{"$f":"IFERROR(IF(BG138=\"Y\",((INDEX(T_Deduc[Deduction],MATCH(BH138,T_Deduc[Type],0),0))),\"\"),\"\")","v":""},null,"","Piece",{"$f":"IFERROR(IF(ISBLANK(BB138),\"\",INDEX(T_NAV[Base Unit of Measure],MATCH(BB138,T_NAV[No.],0))),\"\")","v":""},1,1,{"$f":"IFERROR(INDEX(INDIRECT(\"T_NAV[\"&i_Location&\"]\"),MATCH(1,--(BB138=T_NAV[No.])*--((INDIRECT(\"T_NAV[\"&i_Location&\"]\"))<>\"\"),0))/IF(AND(BF138<>\"\",i_Units=\"Imperial\"),CONVERT(BF138,\"m\",\"in\"),IF(AND(i_Units=\"Imperial\",BM138=\"Metre\"),39.37,IF(BF138<>\"\",BF138,1))),\"\")","v":""},""]
[null,null,null,"Right Hand",{"$f":"IFERROR(IF(ISBLANK(D139),\"\",IF(FIND(D139,INDIRECT($D$137))>0,1,0)),0)","v":0},null,{"$f":"IFERROR(IF(ISBLANK(F139),\"\",IF(FIND(F139,INDIRECT($F$137))>0,1,0)),0)","v":""},"Wand",0,null,"",null,null,null,null,null,null,null,null,null,null,null,null,null,null,null,null,null,null,"",null,null,null,null,null,null,null,null,null,null,null,null,"AU","White",null,null,"White",{"$f":"IF(ISNUMBER(FIND(\"x\",BD139)),IFERROR(INDEX(INDIRECT(\"T_FinishColour[ColourCode-\"&IF(ISNUMBER(FIND(\"xxx\",BD139)),\"xxx\",IF(ISNUMBER(FIND(\"xx\",BD139)),\"xx\",\"error\"))&AQ139&\"]\"),MATCH(AU139,T_FinishColour[Finish / Colour],0)),\"\"),\"\")","v":"069"},null,"HIDE",null,null,null,"RB12-3521-069090",null,"RB12-3521-xxx090","Easy Spring Wand Control + Wand | RH (Red)",null,{"$f":"IF(ISBLANK(BL139),\"\",IF(OR(BL139=L_Units),\"Y\",\"N\"))","v":"N"},null,{"$f":"IFERROR(IF(BG139=\"Y\",((INDEX(T_Deduc[Deduction],MATCH(BH139,T_Deduc[Type],0),0))),\"\"),\"\")","v":""},null,"","Piece",{"$f":"IFERROR(IF(ISBLANK(BB139),\"\",INDEX(T_NAV[Base Unit of Measure],MATCH(BB139,T_NAV[No.],0))),\"\")","v":""},1,1,{"$f":"IFERROR(INDEX(INDIRECT(\"T_NAV[\"&i_Location&\"]\"),MATCH(1,--(BB139=T_NAV[No.])*--((INDIRECT(\"T_NAV[\"&i_Location&\"]\"))<>\"\"),0))/IF(AND(BF139<>\"\",i_Units=\"Imperial\"),CONVERT(BF139,\"m\",\"in\"),IF(AND(i_Units=\"Imperial\",BM139=\"Metre\"),39.37,IF(BF139<>\"\",BF139,1))),\"\")","v":""},""]
[null,null,null,null,{"$f":"IFERROR(IF(ISBLANK(D140),\"\",IF(FIND(D140,INDIRECT($D$137))>0,1,0)),0)","v":""},"1.5\"",{"$f":"IFERROR(IF(ISBLANK(F140),\"\",IF(FIND(F140,INDIRECT($F$137))>0,1,0)),0)","v":0},"Wand",0,null,"",null,null,null,null,null,null,null,null,null,null,null,null,null,null,null,null,null,null,"",null,null,null,"White","Silver Grey",null,null,null,null,null,null,null,"AU","White",{"$f":"i_Colour","v":0},null,"White",{"$f":"IF(ISNUMBER(FIND(\"x\",BD140)),IFERROR(INDEX(INDIRECT(\"T_FinishColour[ColourCode-\"&IF(ISNUMBER(FIND(\"xxx\",BD140)),\"xxx\",IF(ISNUMBER(FIND(\"xx\",BD140)),\"xx\",\"error\"))&AQ140&\"]\"),MATCH(AU140,T_FinishColour[Finish / Colour],0)),\"\"),\"\")","v":"069"},null,"HIDE",null,null,null,"RB12-3810-069038",null,"RB12-3810-xxx038","Booster Connector | 1.5” (38mm)",null,{"$f":"IF(ISBLANK(BL140),\"\",IF(OR(BL140=L_Units),\"Y\",\"N\"))","v":"N"},null,{"$f":"IFERROR(IF(BG140=\"Y\",((INDEX(T_Deduc[Deduction],MATCH(BH140,T_Deduc[Type],0),0))),\"\"),\"\")","v":""},null,"","Piece",{"$f":"IFERROR(IF(ISBLANK(BB140),\"\",INDEX(T_NAV[Base Unit of Measure],MATCH(BB140,T_NAV[No.],0))),\"\")","v":"PIECE"},1,1,{"$f":"IFERROR(INDEX(INDIRECT(\"T_NAV[\"&i_Location&\"]\"),MATCH(1,--(BB140=T_NAV[No.])*--((INDIRECT(\"T_NAV[\"&i_Location&\"]\"))<>\"\"),0))/IF(AND(BF140<>\"\",i_Units=\"Imperial\"),CONVERT(BF140,\"m\",\"in\"),IF(AND(i_Units=\"Imperial\",BM140=\"Metre\"),39.37,IF(BF140<>\"\",BF140,1))),\"\")","v":""},""]
[null,null,null,null,{"$f":"IFERROR(IF(ISBLANK(D141),\"\",IF(FIND(D141,INDIRECT($D$137))>0,1,0)),0)","v":""},"S45",{"$f":"IFERROR(IF(ISBLANK(F141),\"\",IF(FIND(F141,INDIRECT($F$137))>0,1,0)),0)","v":0},"Wand",0,null,"",null,null,null,null,null,null,null,null,null,null,null,null,null,null,null,null,null,null,"",null,null,null,"White","Silver Grey",null,null,null,null,null,null,null,"AU","White",{"$f":"i_Colour","v":0},null,"White",{"$f":"IF(ISNUMBER(FIND(\"x\",BD141)),IFERROR(INDEX(INDIRECT(\"T_FinishColour[ColourCode-\"&IF(ISNUMBER(FIND(\"xxx\",BD141)),\"xxx\",IF(ISNUMBER(FIND(\"xx\",BD141)),\"xx\",\"error\"))&AQ141&\"]\"),MATCH(AU141,T_FinishColour[Finish / Colour],0)),\"\"),\"\")","v":"069"},null,"HIDE",null,null,null,"RB12-4510-069045",null,"RB12-4510-xxx045","Booster Connector | S45",null,{"$f":"IF(ISBLANK(BL141),\"\",IF(OR(BL141=L_Units),\"Y\",\"N\"))","v":"N"},null,{"$f":"IFERROR(IF(BG141=\"Y\",((INDEX(T_Deduc[Deduction],MATCH(BH141,T_Deduc[Type],0),0))),\"\"),\"\")","v":""},null,"","Piece",{"$f":"IFERROR(IF(ISBLANK(BB141),\"\",INDEX(T_NAV[Base Unit of Measure],MATCH(BB141,T_NAV[No.],0))),\"\")","v":"PIECE"},1,1,{"$f":"IFERROR(INDEX(INDIRECT(\"T_NAV[\"&i_Location&\"]\"),MATCH(1,--(BB141=T_NAV[No.])*--((INDIRECT(\"T_NAV[\"&i_Location&\"]\"))<>\"\"),0))/IF(AND(BF141<>\"\",i_Units=\"Imperial\"),CONVERT(BF141,\"m\",\"in\"),IF(AND(i_Units=\"Imperial\",BM141=\"Metre\"),39.37,IF(BF141<>\"\",BF141,1))),\"\")","v":""},""]
[null,null,null,null,{"$f":"IFERROR(IF(ISBLANK(D142),\"\",IF(FIND(D142,INDIRECT($D$137))>0,1,0)),0)","v":""},null,{"$f":"IFERROR(IF(ISBLANK(F142),\"\",IF(FIND(F142,INDIRECT($F$137))>0,1,0)),0)","v":""},"Wand",0,null,"",null,null,null,null,null,null,null,null,null,null,null,null,null,null,null,null,null,null,"",null,null,null,null,null,null,null,null,null,null,null,null,null,"",null,null,"",{"$f":"IF(ISNUMBER(FIND(\"x\",BD142)),IFERROR(INDEX(INDIRECT(\"T_FinishColour[ColourCode-\"&IF(ISNUMBER(FIND(\"xxx\",BD142)),\"xxx\",IF(ISNUMBER(FIND(\"xx\",BD142)),\"xx\",\"error\"))&AQ142&\"]\"),MATCH(AU142,T_FinishColour[Finish / Colour],0)),\"\"),\"\")","v":""},null,"HIDe",null,null,null,"RB12-9001-069090",null,"RB12-9001-069090","Easy Spring Wand P/Coat",null,{"$f":"IF(ISBLANK(BL142),\"\",IF(OR(BL142=L_Units),\"Y\",\"N\"))","v":"N"},null,{"$f":"IFERROR(IF(BG142=\"Y\",((INDEX(T_Deduc[Deduction],MATCH(BH142,T_Deduc[Type],0),0))),\"\"),\"\")","v":""},null,"","Piece",{"$f":"IFERROR(IF(ISBLANK(BB142),\"\",INDEX(T_NAV[Base Unit of Measure],MATCH(BB142,T_NAV[No.],0))),\"\")","v":"PIECE"},1,1,{"$f":"IFERROR(INDEX(INDIRECT(\"T_NAV[\"&i_Location&\"]\"),MATCH(1,--(BB142=T_NAV[No.])*--((INDIRECT(\"T_NAV[\"&i_Location&\"]\"))<>\"\"),0))/IF(AND(BF142<>\"\",i_Units=\"Imperial\"),CONVERT(BF142,\"m\",\"in\"),IF(AND(i_Units=\"Imperial\",BM142=\"Metre\"),39.37,IF(BF142<>\"\",BF142,1))),\"\")","v":""},""]
[null,null,null,null,null,null,null,"Wand",0,"CF90",0,null,null,null,null,null,null,null,null,null,null,null,null,null,null,null,null,null,null,"",null,null,null,null,null,null,null,null,null,null,null,null,null,"",null,null,"",{"$f":"IF(ISNUMBER(FIND(\"x\",BD143)),IFERROR(INDEX(INDIRECT(\"T_FinishColour[ColourCode-\"&IF(ISNUMBER(FIND(\"xxx\",BD143)),\"xxx\",IF(ISNUMBER(FIND(\"xx\",BD143)),\"xx\",\"error\"))&AQ143&\"]\"),MATCH(AU143,T_FinishColour[Finish / Colour],0)),\"\"),\"\")","v":""},null,"HIDE",null,null,null,"RC02-0203-001090",null,"RC02-0203-001090","Easy Spring Wand Guide CF90 | RH & LH",null,{"$f":"IF(ISBLANK(BL143),\"\",IF(OR(BL143=L_Units),\"Y\",\"N\"))","v":"N"},null,{"$f":"IFERROR(IF(BG143=\"Y\",((INDEX(T_Deduc[Deduction],MATCH(BH143,T_Deduc[Type],0),0))),\"\"),\"\")","v":""},null,"","Set",{"$f":"IFERROR(IF(ISBLANK(BB143),\"\",INDEX(T_NAV[Base Unit of Measure],MATCH(BB143,T_NAV[No.],0))),\"\")","v":"PIECE"},1,1,{"$f":"IFERROR(INDEX(INDIRECT(\"T_NAV[\"&i_Location&\"]\"),MATCH(1,--(BB143=T_NAV[No.])*--((INDIRECT(\"T_NAV[\"&i_Location&\"]\"))<>\"\"),0))/IF(AND(BF143<>\"\",i_Units=\"Imperial\"),CONVERT(BF143,\"m\",\"in\"),IF(AND(i_Units=\"Imperial\",BM143=\"Metre\"),39.37,IF(BF143<>\"\",BF143,1))),\"\")","v":""},""]
[null,null,null,null,null,null,null,null,"",null,null,null,null,null,null,null,null,null,null,null,null,null,null,null,null,null,null,null,null,"",null,null,null,null,null,null,null,null,null,null,null,null,null,"",null,null,"",{"$f":"IF(ISNUMBER(FIND(\"x\",BD144)),IFERROR(INDEX(INDIRECT(\"T_FinishColour[ColourCode-\"&IF(ISNUMBER(FIND(\"xxx\",BD144)),\"xxx\",IF(ISNUMBER(FIND(\"xx\",BD144)),\"xx\",\"error\"))&AQ144&\"]\"),MATCH(AU144,T_FinishColour[Finish / Colour],0)),\"\"),\"\")","v":""},null,"HIDE",null,null,null,"",null,null,null,null,{"$f":"IF(ISBLANK(BL144),\"\",IF(OR(BL144=L_Units),\"Y\",\"N\"))","v":""},null,{"$f":"IFERROR(IF(BG144=\"Y\",((INDEX(T_Deduc[Deduction],MATCH(BH144,T_Deduc[Type],0),0))),\"\"),\"\")","v":""},null,"",null,{"$f":"IFERROR(IF(ISBLANK(BB144),\"\",INDEX(T_NAV[Base Unit of Measure],MATCH(BB144,T_NAV[No.],0))),\"\")","v":""},null,"",{"$f":"IFERROR(INDEX(INDIRECT(\"T_NAV[\"&i_Location&\"]\"),MATCH(1,--(BB144=T_NAV[No.])*--((INDIRECT(\"T_NAV[\"&i_Location&\"]\"))<>\"\"),0))/IF(AND(BF144<>\"\",i_Units=\"Imperial\"),CONVERT(BF144,\"m\",\"in\"),IF(AND(i_Units=\"Imperial\",BM144=\"Metre\"),39.37,IF(BF144<>\"\",BF144,1))),\"\")","v":""},""]
[null,null,null,null,null,null,null,null,"",null,null,null,null,null,null,null,null,null,null,null,null,null,null,null,null,null,null,null,null,"",null,null,null,null,null,null,null,null,null,null,null,null,null,"",null,null,"",{"$f":"IF(ISNUMBER(FIND(\"x\",BD145)),IFERROR(INDEX(INDIRECT(\"T_FinishColour[ColourCode-\"&IF(ISNUMBER(FIND(\"xxx\",BD145)),\"xxx\",IF(ISNUMBER(FIND(\"xx\",BD145)),\"xx\",\"error\"))&AQ145&\"]\"),MATCH(AU145,T_FinishColour[Finish / Colour],0)),\"\"),\"\")","v":""},null,"HIDE",null,null,null,"",null,null,null,null,{"$f":"IF(ISBLANK(BL145),\"\",IF(OR(BL145=L_Units),\"Y\",\"N\"))","v":""},null,{"$f":"IFERROR(IF(BG145=\"Y\",((INDEX(T_Deduc[Deduction],MATCH(BH145,T_Deduc[Type],0),0))),\"\"),\"\")","v":""},null,"",null,{"$f":"IFERROR(IF(ISBLANK(BB145),\"\",INDEX(T_NAV[Base Unit of Measure],MATCH(BB145,T_NAV[No.],0))),\"\")","v":""},null,"",{"$f":"IFERROR(INDEX(INDIRECT(\"T_NAV[\"&i_Location&\"]\"),MATCH(1,--(BB145=T_NAV[No.])*--((INDIRECT(\"T_NAV[\"&i_Location&\"]\"))<>\"\"),0))/IF(AND(BF145<>\"\",i_Units=\"Imperial\"),CONVERT(BF145,\"m\",\"in\"),IF(AND(i_Units=\"Imperial\",BM145=\"Metre\"),39.37,IF(BF145<>\"\",BF145,1))),\"\")","v":""},""]
[null,null,{"$f":"C147","v":0},null,null,null,null,null,null,null,null,null,null,null,null,null,null,null,null,null,null,null,null,null,null,null,null,null,null,"",null,null,null,null,null,null,null,null,null,null,null,null,null,"",null,null,"",{"$f":"IF(ISNUMBER(FIND(\"x\",BD146)),IFERROR(INDEX(INDIRECT(\"T_FinishColour[ColourCode-\"&IF(ISNUMBER(FIND(\"xxx\",BD146)),\"xxx\",IF(ISNUMBER(FIND(\"xx\",BD146)),\"xx\",\"error\"))&AQ146&\"]\"),MATCH(AU146,T_FinishColour[Finish / Colour],0)),\"\"),\"\")","v":""},null,"HIDE",null,null,null,"",null,null,null,null,{"$f":"IF(ISBLANK(BL146),\"\",IF(OR(BL146=L_Units),\"Y\",\"N\"))","v":""},null,{"$f":"IFERROR(IF(BG146=\"Y\",((INDEX(T_Deduc[Deduction],MATCH(BH146,T_Deduc[Type],0),0))),\"\"),\"\")","v":""},null,"",null,{"$f":"IFERROR(IF(ISBLANK(BB146),\"\",INDEX(T_NAV[Base Unit of Measure],MATCH(BB146,T_NAV[No.],0))),\"\")","v":""},null,"",{"$f":"IFERROR(INDEX(INDIRECT(\"T_NAV[\"&i_Location&\"]\"),MATCH(1,--(BB146=T_NAV[No.])*--((INDIRECT(\"T_NAV[\"&i_Location&\"]\"))<>\"\"),0))/IF(AND(BF146<>\"\",i_Units=\"Imperial\"),CONVERT(BF146,\"m\",\"in\"),IF(AND(i_Units=\"Imperial\",BM146=\"Metre\"),39.37,IF(BF146<>\"\",BF146,1))),\"\")","v":""},""]
[null,null,{"$f":"IFERROR(IF(FIND(D150,INDIRECT($D$147))>0,1,0),0)","v":0},"i_Tube",null,"i_IdlerOptions",null,"i_ControlType",null,"i_Booster",null,"i_ControlSide",null,null,null,"i_PretensionClip",null,"i_Location",null,"i_springcontrol",null,"i_FabricOrientation",null,null,null,null,null,null,null,"",null,null,null,null,null,null,null,null,null,null,null,null,null,"",null,null,"",{"$f":"IF(ISNUMBER(FIND(\"x\",BD147)),IFERROR(INDEX(INDIRECT(\"T_FinishColour[ColourCode-\"&IF(ISNUMBER(FIND(\"xxx\",BD147)),\"xxx\",IF(ISNUMBER(FIND(\"xx\",BD147)),\"xx\",\"error\"))&AQ147&\"]\"),MATCH(AU147,T_FinishColour[Finish / Colour],0)),\"\"),\"\")","v":""},null,"HIDE",null,null,null,"1.5\"",null,"1.5\"",null,null,null,null,{"$f":"IFERROR(IF(BG147=\"Y\",((INDEX(T_Deduc[Deduction],MATCH(BH147,T_Deduc[Type],0),0))),\"\"),\"\")","v":""},null,"",null,{"$f":"IFERROR(IF(ISBLANK(BB147),\"\",INDEX(T_NAV[Base Unit of Measure],MATCH(BB147,T_NAV[No.],0))),\"\")","v":""},null,"",{"$f":"IFERROR(INDEX(INDIRECT(\"T_NAV[\"&i_Location&\"]\"),MATCH(1,--(BB147=T_NAV[No.])*--((INDIRECT(\"T_NAV[\"&i_Location&\"]\"))<>\"\"),0))/IF(AND(BF147<>\"\",i_Units=\"Imperial\"),CONVERT(BF147,\"m\",\"in\"),IF(AND(i_Units=\"Imperial\",BM147=\"Metre\"),39.37,IF(BF147<>\"\",BF147,1))),\"\")","v":""},""]
[null,null,null,null,{"$f":"IFERROR(IF(ISBLANK(D148),\"\",IF(FIND(D148,INDIRECT($D$147))>0,1,0)),0)","v":""},null,{"$f":"IFERROR(IF(ISBLANK(F148),\"\",IF(FIND(F148,INDIRECT($F$147))>0,1,0)),0)","v":""},null,{"$f":"IFERROR(IF(ISBLANK(H148),\"\",IF(FIND(H148,INDIRECT($H$147))>0,1,0)),0)","v":""},null,{"$f":"IFERROR(IF(ISBLANK(J148),\"\",IF(FIND(J148,INDIRECT($J$147))>0,1,0)),0)","v":""},null,{"$f":"IFERROR(IF(ISBLANK(L148),\"\",IF(FIND(L148,INDIRECT($L$147))>0,1,0)),0)","v":""},null,null,null,null,null,{"$f":"IFERROR(IF(ISBLANK(R148),\"\",IF(FIND(R148,INDIRECT(R$147))>0,1,0)),0)","v":""},null,{"$f":"IFERROR(IF(ISBLANK(T148),\"\",IF(FIND(T148,INDIRECT(T$147))>0,1,0)),0)","v":""},null,null,null,null,null,null,null,null,"",null,null,null,"White","Vanilla","Black","Gray",null,null,null,null,null,"US","White",{"$f":"i_Colour","v":0},null,"White",{"$f":"IF(ISNUMBER(FIND(\"x\",BD148)),IFERROR(INDEX(INDIRECT(\"T_FinishColour[ColourCode-\"&IF(ISNUMBER(FIND(\"xxx\",BD148)),\"xxx\",IF(ISNUMBER(FIND(\"xx\",BD148)),\"xx\",\"error\"))&AQ148&\"]\"),MATCH(AU148,T_FinishColour[Finish / Colour],0)),\"\"),\"\")","v":"W"},null,"HIDE",null,null,null,"SLPEV653W",null,"SLPEV653xx","Skyline Pin End | 1.5\"",null,{"$f":"IF(ISBLANK(BL148),\"\",IF(OR(BL148=L_Units),\"Y\",\"N\"))","v":"N"},null,{"$f":"IFERROR(IF(BG148=\"Y\",((INDEX(T_Deduc[Deduction],MATCH(BH148,T_Deduc[Type],0),0))),\"\"),\"\")","v":""},null,"","Piece",{"$f":"IFERROR(IF(ISBLANK(BB148),\"\",INDEX(T_NAV[Base Unit of Measure],MATCH(BB148,T_NAV[No.],0))),\"\")","v":"PIECE"},1,1,{"$f":"IFERROR(INDEX(INDIRECT(\"T_NAV[\"&i_Location&\"]\"),MATCH(1,--(BB148=T_NAV[No.])*--((INDIRECT(\"T_NAV[\"&i_Location&\"]\"))<>\"\"),0))/IF(AND(BF148<>\"\",i_Units=\"Imperial\"),CONVERT(BF148,\"m\",\"in\"),IF(AND(i_Units=\"Imperial\",BM148=\"Metre\"),39.37,IF(BF148<>\"\",BF148,1))),\"\")","v":""},""]
[null,null,null,null,"",null,"",null,"",null,"",null,"",null,null,null,null,null,{"$f":"IFERROR(IF(ISBLANK(R149),\"\",IF(FIND(R149,INDIRECT(R$147))>0,1,0)),0)","v":""},null,"",null,null,null,null,null,null,null,null,"",null,null,null,"White","Vanilla","Black","Brown","Gray",null,null,null,null,"US","White",0,null,"White",{"$f":"IF(ISNUMBER(FIND(\"x\",BD149)),IFERROR(INDEX(INDIRECT(\"T_FinishColour[ColourCode-\"&IF(ISNUMBER(FIND(\"xxx\",BD149)),\"xxx\",IF(ISNUMBER(FIND(\"xx\",BD149)),\"xx\",\"error\"))&AQ149&\"]\"),MATCH(AU149,T_FinishColour[Finish / Colour],0)),\"\"),\"\")","v":"W"},null,"HIDE",null,null,null,"SLPEHD53W",null,"SLPEHD53xx","Skyline Pin End | Heavy Duty| 1.5\"",null,{"$f":"IF(ISBLANK(BL149),\"\",IF(OR(BL149=L_Units),\"Y\",\"N\"))","v":"N"},null,{"$f":"IFERROR(IF(BG149=\"Y\",((INDEX(T_Deduc[Deduction],MATCH(BH149,T_Deduc[Type],0),0))),\"\"),\"\")","v":""},null,"","Piece",{"$f":"IFERROR(IF(ISBLANK(BB149),\"\",INDEX(T_NAV[Base Unit of Measure],MATCH(BB149,T_NAV[No.],0))),\"\")","v":"PIECE"},1,1,{"$f":"IFERROR(INDEX(INDIRECT(\"T_NAV[\"&i_Location&\"]\"),MATCH(1,--(BB149=T_NAV[No.])*--((INDIRECT(\"T_NAV[\"&i_Location&\"]\"))<>\"\"),0))/IF(AND(BF149<>\"\",i_Units=\"Imperial\"),CONVERT(BF149,\"m\",\"in\"),IF(AND(i_Units=\"Imperial\",BM149=\"Metre\"),39.37,IF(BF149<>\"\",BF149,1))),\"\")","v":""},""]
[null,null,null,"1.5\"",0,null,"","Ultra - Skyline",0,null,"",null,"",null,null,null,null,null,"",null,"",null,null,null,null,null,null,null,null,"",null,null,null,null,null,null,null,null,null,null,null,null,"AU","",0,null,"",{"$f":"IF(ISNUMBER(FIND(\"x\",BD150)),IFERROR(INDEX(INDIRECT(\"T_FinishColour[ColourCode-\"&IF(ISNUMBER(FIND(\"xxx\",BD150)),\"xxx\",IF(ISNUMBER(FIND(\"xx\",BD150)),\"xx\",\"error\"))&AQ150&\"]\"),MATCH(AU150,T_FinishColour[Finish / Colour],0)),\"\"),\"\")","v":""},null,"hide",null,null,null,"RB12-3200-069038",null,"RB12-3200-069038","Single Chainfree  Control | 1.5\"",null,{"$f":"IF(ISBLANK(BL150),\"\",IF(OR(BL150=L_Units),\"Y\",\"N\"))","v":"N"},null,{"$f":"IFERROR(IF(BG150=\"Y\",((INDEX(T_Deduc[Deduction],MATCH(BH150,T_Deduc[Type],0),0))),\"\"),\"\")","v":""},null,"","Piece",{"$f":"IFERROR(IF(ISBLANK(BB150),\"\",INDEX(T_NAV[Base Unit of Measure],MATCH(BB150,T_NAV[No.],0))),\"\")","v":"PIECE"},1,1,{"$f":"IFERROR(INDEX(INDIRECT(\"T_NAV[\"&i_Location&\"]\"),MATCH(1,--(BB150=T_NAV[No.])*--((INDIRECT(\"T_NAV[\"&i_Location&\"]\"))<>\"\"),0))/IF(AND(BF150<>\"\",i_Units=\"Imperial\"),CONVERT(BF150,\"m\",\"in\"),IF(AND(i_Units=\"Imperial\",BM150=\"Metre\"),39.37,IF(BF150<>\"\",BF150,1))),\"\")","v":""},""]
[null,null,null,"1.5\"",0,null,{"$f":"IFERROR(IF(ISBLANK(F151),\"\",IF(FIND(F151,INDIRECT($F$147))>0,1,0)),0)","v":""},"Ultra - Skyline",0,null,0,null,{"$f":"IFERROR(IF(ISBLANK(L151),\"\",IF(FIND(L151,INDIRECT($L$147))>0,1,0)),0)","v":""},null,null,null,null,null,"",null,"",null,null,null,null,null,null,null,null,{"$f":"IFERROR(IF(AND(o_nScreens>1,Z151=\"Y\",PRODUCT(AA151:AC151)=0),o_nScreens,IF(PRODUCT(AA151:AC151)=0,\"\",PRODUCT(AA151:AC151))),\"\")","v":""},null,null,null,null,null,null,null,null,null,null,null,null,"AU",{"$f":"IF(ISNUMBER(FIND(\"x\",BD151)),IFERROR(INDEX(AH151:AP151,0,MATCH(AS151,AH151:AP151,0)),IF(AH151<>\"\",AH151,i_DefaultColour)),\"\")","v":""},0,null,{"$f":"IF(ISNUMBER(FIND(\"x\",BD151)),IFERROR(INDEX(AH151:AP151,0,MATCH(AS151,AH151:AP151,0)),AR151),\"\")","v":""},{"$f":"IF(ISNUMBER(FIND(\"x\",BD151)),IFERROR(INDEX(INDIRECT(\"T_FinishColour[ColourCode-\"&IF(ISNUMBER(FIND(\"xxx\",BD151)),\"xxx\",IF(ISNUMBER(FIND(\"xx\",BD151)),\"xx\",\"error\"))&AQ151&\"]\"),MATCH(AU151,T_FinishColour[Finish / Colour],0)),\"\"),\"\")","v":""},null,"HIDE",null,null,null,{"$f":"_xlfn.IFNA(SUBSTITUTE(IF(AQ151=\"AU\",SUBSTITUTE(BD151,\"xxx\",AV151),SUBSTITUTE(SUBSTITUTE(BD151,\"xx\",AV151),\"x\",\"\")),\"LLL\",\"580\"),BD151)","v":"RB12-3240-069038"},null,"RB12-3240-069038","ESU Chain Free Control with Skyline Adaptor | 1.5\"",null,{"$f":"IF(ISBLANK(BL151),\"\",IF(OR(BL151=L_Units),\"Y\",\"N\"))","v":"N"},null,{"$f":"IFERROR(IF(BG151=\"Y\",((INDEX(T_Deduc[Deduction],MATCH(BH151,T_Deduc[Type],0),0))),\"\"),\"\")","v":""},null,{"$f":"IFERROR(IF(BG151=\"Y\",(INDIRECT(BJ151)-BI151)/IF(Z151=\"\",1,o_nScreens),\"\"),\"\")","v":""},"Piece",{"$f":"IFERROR(IF(ISBLANK(BB151),\"\",INDEX(T_NAV[Base Unit of Measure],MATCH(BB151,T_NAV[No.],0))),\"\")","v":""},1,{"$f":"IF(ISBLANK(BN151),\"\",PRODUCT(AD151,BN151,ShadeQuantity))","v":1},{"$f":"IFERROR(INDEX(INDIRECT(\"T_NAV[\"&i_Location&\"]\"),MATCH(1,--(BB151=T_NAV[No.])*--((INDIRECT(\"T_NAV[\"&i_Location&\"]\"))<>\"\"),0))/IF(AND(BF151<>\"\",i_Units=\"Imperial\"),CONVERT(BF151,\"m\",\"in\"),IF(AND(i_Units=\"Imperial\",BM151=\"Metre\"),39.37,IF(BF151<>\"\",BF151,1))),\"\")","v":""},""]
[null,null,null,"1.5\"",{"$f":"IFERROR(IF(ISBLANK(D152),\"\",IF(FIND(D152,INDIRECT($D$147))>0,1,0)),0)","v":0},null,{"$f":"IFERROR(IF(ISBLANK(F152),\"\",IF(FIND(F152,INDIRECT($F$147))>0,1,0)),0)","v":""},"Ultra - Skyline",{"$f":"IFERROR(IF(ISBLANK(H152),\"\",IF(FIND(H152,INDIRECT($H$147))>0,1,0)),0)","v":0},null,{"$f":"IF(K160=1,0,I152)","v":0},null,{"$f":"IFERROR(IF(ISBLANK(L152),\"\",IF(FIND(L152,INDIRECT($L$147))>0,1,0)),0)","v":""},null,null,null,null,null,"","Standard",0,null,null,null,null,null,null,null,null,{"$f":"IFERROR(IF(AND(o_nScreens>1,Z152=\"Y\",PRODUCT(AA152:AC152)=0),o_nScreens,IF(PRODUCT(AA152:AC152)=0,\"\",PRODUCT(AA152:AC152))),\"\")","v":""},null,null,null,null,null,null,null,null,null,null,null,null,"AU",{"$f":"IF(ISNUMBER(FIND(\"x\",BD152)),IFERROR(INDEX(AH152:AP152,0,MATCH(AS152,AH152:AP152,0)),IF(AH152<>\"\",AH152,i_DefaultColour)),\"\")","v":"White"},0,null,{"$f":"IF(ISNUMBER(FIND(\"x\",BD152)),IFERROR(INDEX(AH152:AP152,0,MATCH(AS152,AH152:AP152,0)),AR152),\"\")","v":"White"},{"$f":"IF(ISNUMBER(FIND(\"x\",BD152)),IFERROR(INDEX(INDIRECT(\"T_FinishColour[ColourCode-\"&IF(ISNUMBER(FIND(\"xxx\",BD152)),\"xxx\",IF(ISNUMBER(FIND(\"xx\",BD152)),\"xx\",\"error\"))&AQ152&\"]\"),MATCH(AU152,T_FinishColour[Finish / Colour],0)),\"\"),\"\")","v":"069"},null,"HIDE",null,null,null,{"$f":"_xlfn.IFNA(SUBSTITUTE(IF(AQ152=\"AU\",SUBSTITUTE(BD152,\"xxx\",AV152),SUBSTITUTE(SUBSTITUTE(BD152,\"xx\",AV152),\"x\",\"\")),\"LLL\",\"580\"),BD152)","v":"RB12-3241-069038"},null,"RB12-3241-xxx038","Spring Control | 1.5\"",null,{"$f":"IF(ISBLANK(BL152),\"\",IF(OR(BL152=L_Units),\"Y\",\"N\"))","v":"N"},null,{"$f":"IFERROR(IF(BG152=\"Y\",((INDEX(T_Deduc[Deduction],MATCH(BH152,T_Deduc[Type],0),0))),\"\"),\"\")","v":""},null,{"$f":"IFERROR(IF(BG152=\"Y\",(INDIRECT(BJ152)-BI152)/IF(Z152=\"\",1,o_nScreens),\"\"),\"\")","v":""},"Piece",{"$f":"IFERROR(IF(ISBLANK(BB152),\"\",INDEX(T_NAV[Base Unit of Measure],MATCH(BB152,T_NAV[No.],0))),\"\")","v":"PIECE"},1,1,{"$f":"IFERROR(INDEX(INDIRECT(\"T_NAV[\"&i_Location&\"]\"),MATCH(1,--(BB152=T_NAV[No.])*--((INDIRECT(\"T_NAV[\"&i_Location&\"]\"))<>\"\"),0))/IF(AND(BF152<>\"\",i_Units=\"Imperial\"),CONVERT(BF152,\"m\",\"in\"),IF(AND(i_Units=\"Imperial\",BM152=\"Metre\"),39.37,IF(BF152<>\"\",BF152,1))),\"\")","v":""},""]
[null,null,null,"1.5\"",{"$f":"IFERROR(IF(ISBLANK(D153),\"\",IF(FIND(D153,INDIRECT($D$147))>0,1,0)),0)","v":0},null,{"$f":"IFERROR(IF(ISBLANK(F153),\"\",IF(FIND(F153,INDIRECT($F$147))>0,1,0)),0)","v":""},"Ultra - Skyline",{"$f":"IFERROR(IF(ISBLANK(H153),\"\",IF(FIND(H153,INDIRECT($H$147))>0,1,0)),0)","v":0},null,{"$f":"IFERROR(IF(ISBLANK(J153),\"\",IF(FIND(J153,INDIRECT($J$147))>0,1,0)),0)","v":""},null,{"$f":"IFERROR(IF(ISBLANK(L153),\"\",IF(FIND(L153,INDIRECT($L$147))>0,1,0)),0)","v":""},null,null,null,null,null,"","Tension Adjust",{"$f":"IFERROR(IF(ISBLANK(T153),\"\",IF(FIND(T153,INDIRECT(T$147))>0,1,0)),0)","v":0},null,null,null,null,null,null,null,null,null,null,null,null,null,null,null,null,null,null,null,null,null,"AU","White",0,null,"White",{"$f":"IF(ISNUMBER(FIND(\"x\",BD153)),IFERROR(INDEX(INDIRECT(\"T_FinishColour[ColourCode-\"&IF(ISNUMBER(FIND(\"xxx\",BD153)),\"xxx\",IF(ISNUMBER(FIND(\"xx\",BD153)),\"xx\",\"error\"))&AQ153&\"]\"),MATCH(AU153,T_FinishColour[Finish / Colour],0)),\"\"),\"\")","v":"069"},null,{"$f":"IF(AND(ISBLANK(BD153),ISBLANK(C153)),\"HIDE\",IF(PRODUCT(C153:Y153)=1,\"SHOW\",\"HIDE\"))","v":"HIDE"},null,null,null,{"$f":"_xlfn.IFNA(SUBSTITUTE(IF(AQ153=\"AU\",SUBSTITUTE(BD153,\"xxx\",AV153),SUBSTITUTE(SUBSTITUTE(BD153,\"xx\",AV153),\"x\",\"\")),\"LLL\",\"580\"),BD153)","v":"RB12-3870-069038"},null,"RB12-3870-xxx038","Skyline Spring Control with Tension Adjust 38mm",null,{"$f":"IF(ISBLANK(BL153),\"\",IF(OR(BL153=L_Units),\"Y\",\"N\"))","v":"N"},null,{"$f":"IFERROR(IF(BG153=\"Y\",((INDEX(T_Deduc[Deduction],MATCH(BH153,T_Deduc[Type],0),0))),\"\"),\"\")","v":""},null,{"$f":"IFERROR(IF(BG153=\"Y\",(INDIRECT(BJ153)-BI153)/IF(Z153=\"\",1,o_nScreens),\"\"),\"\")","v":""},"Piece",{"$f":"IFERROR(IF(ISBLANK(BB153),\"\",INDEX(T_NAV[Base Unit of Measure],MATCH(BB153,T_NAV[No.],0))),\"\")","v":"PIECE"},1,1,{"$f":"IFERROR(INDEX(INDIRECT(\"T_NAV[\"&i_Location&\"]\"),MATCH(1,--(BB153=T_NAV[No.])*--((INDIRECT(\"T_NAV[\"&i_Location&\"]\"))<>\"\"),0))/IF(AND(BF153<>\"\",i_Units=\"Imperial\"),CONVERT(BF153,\"m\",\"in\"),IF(AND(i_Units=\"Imperial\",BM153=\"Metre\"),39.37,IF(BF153<>\"\",BF153,1))),\"\")","v":""},""]
[null,null,null,"1.5\"",0,null,"",null,"",null,{"$f":"IF(K160=1,0,E154)","v":0},null,"",null,null,null,null,null,"",null,"",null,null,null,null,null,null,null,null,"",null,null,null,null,null,null,null,null,null,null,null,null,"AU","White",0,null,"White",{"$f":"IF(ISNUMBER(FIND(\"x\",BD154)),IFERROR(INDEX(INDIRECT(\"T_FinishColour[ColourCode-\"&IF(ISNUMBER(FIND(\"xxx\",BD154)),\"xxx\",IF(ISNUMBER(FIND(\"xx\",BD154)),\"xx\",\"error\"))&AQ154&\"]\"),MATCH(AU154,T_FinishColour[Finish / Colour],0)),\"\"),\"\")","v":"069"},null,"HIDE",null,null,null,"RB12-6101-069038",null,"RB12-6101-xxx038","Limiter - Single Stop | Universal 1.5\" (38mm) V2",null,{"$f":"IF(ISBLANK(BL154),\"\",IF(OR(BL154=L_Units),\"Y\",\"N\"))","v":"N"},null,{"$f":"IFERROR(IF(BG154=\"Y\",((INDEX(T_Deduc[Deduction],MATCH(BH154,T_Deduc[Type],0),0))),\"\"),\"\")","v":""},null,"","Piece",{"$f":"IFERROR(IF(ISBLANK(BB154),\"\",INDEX(T_NAV[Base Unit of Measure],MATCH(BB154,T_NAV[No.],0))),\"\")","v":"PIECE"},1,1,{"$f":"IFERROR(INDEX(INDIRECT(\"T_NAV[\"&i_Location&\"]\"),MATCH(1,--(BB154=T_NAV[No.])*--((INDIRECT(\"T_NAV[\"&i_Location&\"]\"))<>\"\"),0))/IF(AND(BF154<>\"\",i_Units=\"Imperial\"),CONVERT(BF154,\"m\",\"in\"),IF(AND(i_Units=\"Imperial\",BM154=\"Metre\"),39.37,IF(BF154<>\"\",BF154,1))),\"\")","v":""},""]
[null,null,null,"1.5\"",0,null,"",null,"",null,"","Right Hand",0,"NOT NARROW",{"$f":"IF($K$159=1,0,1)","v":1},null,null,null,"",null,"","Standard / Back / Under Roll",{"$f":"IFERROR(IF(ISBLANK(V155),\"\",IF(FIND(V155,INDIRECT($V$147))>0,1,0)),0)","v":0},null,null,null,null,null,null,"",null,null,null,null,null,null,null,null,null,null,null,null,null,"",null,null,"",{"$f":"IF(ISNUMBER(FIND(\"x\",BD155)),IFERROR(INDEX(INDIRECT(\"T_FinishColour[ColourCode-\"&IF(ISNUMBER(FIND(\"xxx\",BD155)),\"xxx\",IF(ISNUMBER(FIND(\"xx\",BD155)),\"xx\",\"error\"))&AQ155&\"]\"),MATCH(AU155,T_FinishColour[Finish / Colour],0)),\"\"),\"\")","v":""},null,"HIDE",null,null,null,"RB12-7112-190038",null,{"$f":"IF(i_Location=\"AU\",\"RB12-7102-190238\",\"RB12-7112-190038\")","v":"RB12-7112-190038"},{"$f":"IF(i_Location=\"AU\",\"Booster Decelerator | 1.5'' RH - Red Tail\",\"Decelerator | Universal S38/1.5'' RH - Red Tail\")","v":"Decelerator | Universal S38/1.5'' RH - Red Tail"},null,{"$f":"IF(ISBLANK(BL155),\"\",IF(OR(BL155=L_Units),\"Y\",\"N\"))","v":"N"},null,{"$f":"IFERROR(IF(BG155=\"Y\",((INDEX(T_Deduc[Deduction],MATCH(BH155,T_Deduc[Type],0),0))),\"\"),\"\")","v":""},null,"","Piece",{"$f":"IFERROR(IF(ISBLANK(BB155),\"\",INDEX(T_NAV[Base Unit of Measure],MATCH(BB155,T_NAV[No.],0))),\"\")","v":"PIECE"},1,1,{"$f":"IFERROR(INDEX(INDIRECT(\"T_NAV[\"&i_Location&\"]\"),MATCH(1,--(BB155=T_NAV[No.])*--((INDIRECT(\"T_NAV[\"&i_Location&\"]\"))<>\"\"),0))/IF(AND(BF155<>\"\",i_Units=\"Imperial\"),CONVERT(BF155,\"m\",\"in\"),IF(AND(i_Units=\"Imperial\",BM155=\"Metre\"),39.37,IF(BF155<>\"\",BF155,1))),\"\")","v":""},""]
[null,null,null,"1.5\"",{"$f":"IFERROR(IF(ISBLANK(D156),\"\",IF(FIND(D156,INDIRECT($D$147))>0,1,0)),0)","v":0},null,{"$f":"IFERROR(IF(ISBLANK(F156),\"\",IF(FIND(F156,INDIRECT($F$147))>0,1,0)),0)","v":""},"Ultra - Skyline",{"$f":"IFERROR(IF(ISBLANK(H156),\"\",IF(FIND(H156,INDIRECT($H$147))>0,1,0)),0)","v":0},null,{"$f":"IFERROR(IF(ISBLANK(J156),\"\",IF(FIND(J156,INDIRECT($J$147))>0,1,0)),0)","v":""},"Left Hand",{"$f":"IFERROR(IF(ISBLANK(L156),\"\",IF(FIND(L156,INDIRECT($L$147))>0,1,0)),0)","v":0},"NOT NARROW",{"$f":"IF($K$159=1,0,1)","v":1},null,null,null,"",null,"","Reverse / Front / Over Roll",{"$f":"IFERROR(IF(ISBLANK(V156),\"\",IF(FIND(V156,INDIRECT($V$147))>0,1,0)),0)","v":0},null,null,null,null,null,null,{"$f":"IFERROR(IF(AND(o_nScreens>1,Z156=\"Y\",PRODUCT(AA156:AC156)=0),o_nScreens,IF(PRODUCT(AA156:AC156)=0,\"\",PRODUCT(AA156:AC156))),\"\")","v":""},null,null,null,null,null,null,null,null,null,null,null,null,null,{"$f":"IF(ISNUMBER(FIND(\"x\",BD156)),IFERROR(INDEX(AH156:AP156,0,MATCH(AS156,AH156:AP156,0)),IF(AH156<>\"\",AH156,i_DefaultColour)),\"\")","v":""},null,null,{"$f":"IF(ISNUMBER(FIND(\"x\",BD156)),IFERROR(INDEX(AH156:AP156,0,MATCH(AS156,AH156:AP156,0)),AR156),\"\")","v":""},{"$f":"IF(ISNUMBER(FIND(\"x\",BD156)),IFERROR(INDEX(INDIRECT(\"T_FinishColour[ColourCode-\"&IF(ISNUMBER(FIND(\"xxx\",BD156)),\"xxx\",IF(ISNUMBER(FIND(\"xx\",BD156)),\"xx\",\"error\"))&AQ156&\"]\"),MATCH(AU156,T_FinishColour[Finish / Colour],0)),\"\"),\"\")","v":""},null,"HIDE",null,null,null,{"$f":"_xlfn.IFNA(SUBSTITUTE(IF(AQ156=\"AU\",SUBSTITUTE(BD156,\"xxx\",AV156),SUBSTITUTE(SUBSTITUTE(BD156,\"xx\",AV156),\"x\",\"\")),\"LLL\",\"580\"),BD156)","v":"RB12-7112-190038"},null,{"$f":"IF(i_Location=\"AU\",\"RB12-7102-190238\",\"RB12-7112-190038\")","v":"RB12-7112-190038"},{"$f":"IF(i_Location=\"AU\",\"Booster Decelerator | 1.5'' RH - Red Tail\",\"Decelerator | Universal S38/1.5'' RH - Red Tail\")","v":"Decelerator | Universal S38/1.5'' RH - Red Tail"},null,{"$f":"IF(ISBLANK(BL156),\"\",IF(OR(BL156=L_Units),\"Y\",\"N\"))","v":"N"},null,{"$f":"IFERROR(IF(BG156=\"Y\",((INDEX(T_Deduc[Deduction],MATCH(BH156,T_Deduc[Type],0),0))),\"\"),\"\")","v":""},null,{"$f":"IFERROR(IF(BG156=\"Y\",(INDIRECT(BJ156)-BI156)/IF(Z156=\"\",1,o_nScreens),\"\"),\"\")","v":""},"Piece",{"$f":"IFERROR(IF(ISBLANK(BB156),\"\",INDEX(T_NAV[Base Unit of Measure],MATCH(BB156,T_NAV[No.],0))),\"\")","v":"PIECE"},1,1,{"$f":"IFERROR(INDEX(INDIRECT(\"T_NAV[\"&i_Location&\"]\"),MATCH(1,--(BB156=T_NAV[No.])*--((INDIRECT(\"T_NAV[\"&i_Location&\"]\"))<>\"\"),0))/IF(AND(BF156<>\"\",i_Units=\"Imperial\"),CONVERT(BF156,\"m\",\"in\"),IF(AND(i_Units=\"Imperial\",BM156=\"Metre\"),39.37,IF(BF156<>\"\",BF156,1))),\"\")","v":""},""]
[null,null,null,"1.5\"",0,null,"","Ultra - Skyline",0,null,"","Left Hand",0,"NOT NARROW",1,null,null,null,"",null,"","Standard / Back / Under Roll",{"$f":"IFERROR(IF(ISBLANK(V157),\"\",IF(FIND(V157,INDIRECT($V$147))>0,1,0)),0)","v":0},null,null,null,null,null,null,"",null,null,null,null,null,null,null,null,null,null,null,null,null,"",null,null,"",{"$f":"IF(ISNUMBER(FIND(\"x\",BD157)),IFERROR(INDEX(INDIRECT(\"T_FinishColour[ColourCode-\"&IF(ISNUMBER(FIND(\"xxx\",BD157)),\"xxx\",IF(ISNUMBER(FIND(\"xx\",BD157)),\"xx\",\"error\"))&AQ157&\"]\"),MATCH(AU157,T_FinishColour[Finish / Colour],0)),\"\"),\"\")","v":""},null,"HIDE",null,null,null,"RB12-7111-393038",null,{"$f":"IF(i_Location=\"AU\",\"RB12-7101-393138\",\"RB12-7111-393038\")","v":"RB12-7111-393038"},{"$f":"IF(i_Location=\"AU\",\"Booster Decelerator | 1.5'' LH - Blue Tail\",\"Declerator | Universal S38/1.5'' LH - Blue Tail\")","v":"Declerator | Universal S38/1.5'' LH - Blue Tail"},null,{"$f":"IF(ISBLANK(BL157),\"\",IF(OR(BL157=L_Units),\"Y\",\"N\"))","v":"N"},null,{"$f":"IFERROR(IF(BG157=\"Y\",((INDEX(T_Deduc[Deduction],MATCH(BH157,T_Deduc[Type],0),0))),\"\"),\"\")","v":""},null,"","Piece",{"$f":"IFERROR(IF(ISBLANK(BB157),\"\",INDEX(T_NAV[Base Unit of Measure],MATCH(BB157,T_NAV[No.],0))),\"\")","v":"PIECE"},1,1,{"$f":"IFERROR(INDEX(INDIRECT(\"T_NAV[\"&i_Location&\"]\"),MATCH(1,--(BB157=T_NAV[No.])*--((INDIRECT(\"T_NAV[\"&i_Location&\"]\"))<>\"\"),0))/IF(AND(BF157<>\"\",i_Units=\"Imperial\"),CONVERT(BF157,\"m\",\"in\"),IF(AND(i_Units=\"Imperial\",BM157=\"Metre\"),39.37,IF(BF157<>\"\",BF157,1))),\"\")","v":""},""]
[null,null,null,"1.5\"",{"$f":"IFERROR(IF(ISBLANK(D158),\"\",IF(FIND(D158,INDIRECT($D$147))>0,1,0)),0)","v":0},null,{"$f":"IFERROR(IF(ISBLANK(F158),\"\",IF(FIND(F158,INDIRECT($F$147))>0,1,0)),0)","v":""},null,{"$f":"IFERROR(IF(ISBLANK(H158),\"\",IF(FIND(H158,INDIRECT($H$147))>0,1,0)),0)","v":""},null,{"$f":"IFERROR(IF(ISBLANK(J158),\"\",IF(FIND(J158,INDIRECT($J$147))>0,1,0)),0)","v":""},"Right Hand",{"$f":"IFERROR(IF(ISBLANK(L158),\"\",IF(FIND(L158,INDIRECT($L$147))>0,1,0)),0)","v":0},"NOT NARROW",1,null,null,null,"",null,"","Reverse / Front / Over Roll",{"$f":"IFERROR(IF(ISBLANK(V158),\"\",IF(FIND(V158,INDIRECT($V$147))>0,1,0)),0)","v":0},null,null,null,null,null,null,{"$f":"IFERROR(IF(AND(o_nScreens>1,Z158=\"Y\",PRODUCT(AA158:AC158)=0),o_nScreens,IF(PRODUCT(AA158:AC158)=0,\"\",PRODUCT(AA158:AC158))),\"\")","v":""},null,null,null,null,null,null,null,null,null,null,null,null,null,{"$f":"IF(ISNUMBER(FIND(\"x\",BD158)),IFERROR(INDEX(AH158:AP158,0,MATCH(AS158,AH158:AP158,0)),IF(AH158<>\"\",AH158,i_DefaultColour)),\"\")","v":""},null,null,{"$f":"IF(ISNUMBER(FIND(\"x\",BD158)),IFERROR(INDEX(AH158:AP158,0,MATCH(AS158,AH158:AP158,0)),AR158),\"\")","v":""},{"$f":"IF(ISNUMBER(FIND(\"x\",BD158)),IFERROR(INDEX(INDIRECT(\"T_FinishColour[ColourCode-\"&IF(ISNUMBER(FIND(\"xxx\",BD158)),\"xxx\",IF(ISNUMBER(FIND(\"xx\",BD158)),\"xx\",\"error\"))&AQ158&\"]\"),MATCH(AU158,T_FinishColour[Finish / Colour],0)),\"\"),\"\")","v":""},null,"HIDE",null,null,null,{"$f":"_xlfn.IFNA(SUBSTITUTE(IF(AQ158=\"AU\",SUBSTITUTE(BD158,\"xxx\",AV158),SUBSTITUTE(SUBSTITUTE(BD158,\"xx\",AV158),\"x\",\"\")),\"LLL\",\"580\"),BD158)","v":"RB12-7111-393038"},null,{"$f":"IF(i_Location=\"AU\",\"RB12-7101-393138\",\"RB12-7111-393038\")","v":"RB12-7111-393038"},{"$f":"IF(i_Location=\"AU\",\"Booster Decelerator | 1.5'' LH - Blue Tail\",\"Declerator | Universal S38/1.5'' LH - Blue Tail\")","v":"Declerator | Universal S38/1.5'' LH - Blue Tail"},null,{"$f":"IF(ISBLANK(BL158),\"\",IF(OR(BL158=L_Units),\"Y\",\"N\"))","v":"N"},null,{"$f":"IFERROR(IF(BG158=\"Y\",((INDEX(T_Deduc[Deduction],MATCH(BH158,T_Deduc[Type],0),0))),\"\"),\"\")","v":""},null,{"$f":"IFERROR(IF(BG158=\"Y\",(INDIRECT(BJ158)-BI158)/IF(Z158=\"\",1,o_nScreens),\"\"),\"\")","v":""},"Piece",{"$f":"IFERROR(IF(ISBLANK(BB158),\"\",INDEX(T_NAV[Base Unit of Measure],MATCH(BB158,T_NAV[No.],0))),\"\")","v":"PIECE"},1,{"$f":"IF(ISBLANK(BN158),\"\",PRODUCT(AD158,BN158,ShadeQuantity))","v":1},{"$f":"IFERROR(INDEX(INDIRECT(\"T_NAV[\"&i_Location&\"]\"),MATCH(1,--(BB158=T_NAV[No.])*--((INDIRECT(\"T_NAV[\"&i_Location&\"]\"))<>\"\"),0))/IF(AND(BF158<>\"\",i_Units=\"Imperial\"),CONVERT(BF158,\"m\",\"in\"),IF(AND(i_Units=\"Imperial\",BM158=\"Metre\"),39.37,IF(BF158<>\"\",BF158,1))),\"\")","v":""},""]
[null,null,null,"1.5\"",0,null,"","Ultra - Skyline",0,"COMPACT",0,null,"",null,null,null,null,null,"",null,"",null,null,null,null,null,null,null,null,"",null,null,null,null,null,null,null,null,null,null,null,null,"AU","White",{"$f":"i_Colour","v":0},null,"White",{"$f":"IF(ISNUMBER(FIND(\"x\",BD159)),IFERROR(INDEX(INDIRECT(\"T_FinishColour[ColourCode-\"&IF(ISNUMBER(FIND(\"xxx\",BD159)),\"xxx\",IF(ISNUMBER(FIND(\"xx\",BD159)),\"xx\",\"error\"))&AQ159&\"]\"),MATCH(AU159,T_FinishColour[Finish / Colour],0)),\"\"),\"\")","v":"069"},null,"HIDE",null,null,null,"RB12-3805-069038",null,"RB12-3805-xxx038","Booster+Control+Decelerator | 1.5\" LH | COMPACT SL",null,{"$f":"IF(ISBLANK(BL159),\"\",IF(OR(BL159=L_Units),\"Y\",\"N\"))","v":"N"},null,{"$f":"IFERROR(IF(BG159=\"Y\",((INDEX(T_Deduc[Deduction],MATCH(BH159,T_Deduc[Type],0),0))),\"\"),\"\")","v":""},null,"","Piece",{"$f":"IFERROR(IF(ISBLANK(BB159),\"\",INDEX(T_NAV[Base Unit of Measure],MATCH(BB159,T_NAV[No.],0))),\"\")","v":"PIECE"},1,1,{"$f":"IFERROR(INDEX(INDIRECT(\"T_NAV[\"&i_Location&\"]\"),MATCH(1,--(BB159=T_NAV[No.])*--((INDIRECT(\"T_NAV[\"&i_Location&\"]\"))<>\"\"),0))/IF(AND(BF159<>\"\",i_Units=\"Imperial\"),CONVERT(BF159,\"m\",\"in\"),IF(AND(i_Units=\"Imperial\",BM159=\"Metre\"),39.37,IF(BF159<>\"\",BF159,1))),\"\")","v":""},""]
[null,null,null,"1.5\"",{"$f":"IFERROR(IF(ISBLANK(D160),\"\",IF(FIND(D160,INDIRECT($D$147))>0,1,0)),0)","v":0},null,{"$f":"IFERROR(IF(ISBLANK(F160),\"\",IF(FIND(F160,INDIRECT($F$147))>0,1,0)),0)","v":""},"Ultra - Skyline",{"$f":"IFERROR(IF(ISBLANK(H160),\"\",IF(FIND(H160,INDIRECT($H$147))>0,1,0)),0)","v":0},"COMPACT",{"$f":"IFERROR(IF(ISBLANK(J160),\"\",IF(FIND(J160,INDIRECT($J$147))>0,1,0)),0)","v":0},null,{"$f":"IFERROR(IF(ISBLANK(L160),\"\",IF(FIND(L160,INDIRECT($L$147))>0,1,0)),0)","v":""},null,null,null,null,null,"",null,"",null,null,null,null,null,null,null,null,{"$f":"IFERROR(IF(AND(o_nScreens>1,Z160=\"Y\",PRODUCT(AA160:AC160)=0),o_nScreens,IF(PRODUCT(AA160:AC160)=0,\"\",PRODUCT(AA160:AC160))),\"\")","v":""},null,null,null,null,null,null,null,null,null,null,null,null,"AU",{"$f":"IF(ISNUMBER(FIND(\"x\",BD160)),IFERROR(INDEX(AH160:AP160,0,MATCH(AS160,AH160:AP160,0)),IF(AH160<>\"\",AH160,i_DefaultColour)),\"\")","v":"White"},0,null,{"$f":"IF(ISNUMBER(FIND(\"x\",BD160)),IFERROR(INDEX(AH160:AP160,0,MATCH(AS160,AH160:AP160,0)),AR160),\"\")","v":"White"},{"$f":"IF(ISNUMBER(FIND(\"x\",BD160)),IFERROR(INDEX(INDIRECT(\"T_FinishColour[ColourCode-\"&IF(ISNUMBER(FIND(\"xxx\",BD160)),\"xxx\",IF(ISNUMBER(FIND(\"xx\",BD160)),\"xx\",\"error\"))&AQ160&\"]\"),MATCH(AU160,T_FinishColour[Finish / Colour],0)),\"\"),\"\")","v":"069"},null,"HIDE",null,null,null,{"$f":"_xlfn.IFNA(SUBSTITUTE(IF(AQ160=\"AU\",SUBSTITUTE(BD160,\"xxx\",AV160),SUBSTITUTE(SUBSTITUTE(BD160,\"xx\",AV160),\"x\",\"\")),\"LLL\",\"580\"),BD160)","v":"RB12-6102-069038"},null,"RB12-6102-xxx038","Limiter - Single Stop | Universal SHORT 1.5\"",null,{"$f":"IF(ISBLANK(BL160),\"\",IF(OR(BL160=L_Units),\"Y\",\"N\"))","v":"N"},null,{"$f":"IFERROR(IF(BG160=\"Y\",((INDEX(T_Deduc[Deduction],MATCH(BH160,T_Deduc[Type],0),0))),\"\"),\"\")","v":""},null,{"$f":"IFERROR(IF(BG160=\"Y\",(INDIRECT(BJ160)-BI160)/IF(Z160=\"\",1,o_nScreens),\"\"),\"\")","v":""},"Piece",{"$f":"IFERROR(IF(ISBLANK(BB160),\"\",INDEX(T_NAV[Base Unit of Measure],MATCH(BB160,T_NAV[No.],0))),\"\")","v":"PIECE"},1,{"$f":"IF(ISBLANK(BN160),\"\",PRODUCT(AD160,BN160,ShadeQuantity))","v":1},{"$f":"IFERROR(INDEX(INDIRECT(\"T_NAV[\"&i_Location&\"]\"),MATCH(1,--(BB160=T_NAV[No.])*--((INDIRECT(\"T_NAV[\"&i_Location&\"]\"))<>\"\"),0))/IF(AND(BF160<>\"\",i_Units=\"Imperial\"),CONVERT(BF160,\"m\",\"in\"),IF(AND(i_Units=\"Imperial\",BM160=\"Metre\"),39.37,IF(BF160<>\"\",BF160,1))),\"\")","v":""},""]
[null,null,null,"1.5\"",{"$f":"IFERROR(IF(ISBLANK(D161),\"\",IF(FIND(D161,INDIRECT($D$147))>0,1,0)),0)","v":0},null,"",null,"","SHORT",0,null,"",null,null,null,null,null,"",null,"",null,null,null,null,null,null,null,null,"",null,null,null,null,null,null,null,null,null,null,null,null,"AU","",0,null,"",{"$f":"IF(ISNUMBER(FIND(\"x\",BD161)),IFERROR(INDEX(INDIRECT(\"T_FinishColour[ColourCode-\"&IF(ISNUMBER(FIND(\"xxx\",BD161)),\"xxx\",IF(ISNUMBER(FIND(\"xx\",BD161)),\"xx\",\"error\"))&AQ161&\"]\"),MATCH(AU161,T_FinishColour[Finish / Colour],0)),\"\"),\"\")","v":""},null,"HIDE",null,null,null,"RB12-3800-269038",null,"RB12-3800-269038","Booster Universal | SHORT 1.5\"",null,{"$f":"IF(ISBLANK(BL161),\"\",IF(OR(BL161=L_Units),\"Y\",\"N\"))","v":"N"},null,{"$f":"IFERROR(IF(BG161=\"Y\",((INDEX(T_Deduc[Deduction],MATCH(BH161,T_Deduc[Type],0),0))),\"\"),\"\")","v":""},null,"","Piece",{"$f":"IFERROR(IF(ISBLANK(BB161),\"\",INDEX(T_NAV[Base Unit of Measure],MATCH(BB161,T_NAV[No.],0))),\"\")","v":"PIECE"},1,1,{"$f":"IFERROR(INDEX(INDIRECT(\"T_NAV[\"&i_Location&\"]\"),MATCH(1,--(BB161=T_NAV[No.])*--((INDIRECT(\"T_NAV[\"&i_Location&\"]\"))<>\"\"),0))/IF(AND(BF161<>\"\",i_Units=\"Imperial\"),CONVERT(BF161,\"m\",\"in\"),IF(AND(i_Units=\"Imperial\",BM161=\"Metre\"),39.37,IF(BF161<>\"\",BF161,1))),\"\")","v":""},""]
[null,null,null,"1.5\"",0,null,"",null,"","LIGHT",0,null,"",null,null,null,null,null,"",null,"",null,null,null,null,null,null,null,null,"",null,null,null,null,null,null,null,null,null,null,null,null,"AU",{"$f":"IF(ISNUMBER(FIND(\"x\",BD162)),IFERROR(INDEX(AH162:AP162,0,MATCH(AS162,AH162:AP162,0)),IF(AH162<>\"\",AH162,i_DefaultColour)),\"\")","v":""},0,null,{"$f":"IF(ISNUMBER(FIND(\"x\",BD162)),IFERROR(INDEX(AH162:AP162,0,MATCH(AS162,AH162:AP162,0)),AR162),\"\")","v":""},{"$f":"IF(ISNUMBER(FIND(\"x\",BD162)),IFERROR(INDEX(INDIRECT(\"T_FinishColour[ColourCode-\"&IF(ISNUMBER(FIND(\"xxx\",BD162)),\"xxx\",IF(ISNUMBER(FIND(\"xx\",BD162)),\"xx\",\"error\"))&AQ162&\"]\"),MATCH(AU162,T_FinishColour[Finish / Colour],0)),\"\"),\"\")","v":""},null,"HIDE",null,null,null,"RB12-3801-069038",null,"RB12-3801-069038","Booster Universal | LIGHT 1.5\"",null,{"$f":"IF(ISBLANK(BL162),\"\",IF(OR(BL162=L_Units),\"Y\",\"N\"))","v":"N"},null,{"$f":"IFERROR(IF(BG162=\"Y\",((INDEX(T_Deduc[Deduction],MATCH(BH162,T_Deduc[Type],0),0))),\"\"),\"\")","v":""},null,{"$f":"IFERROR(IF(BG162=\"Y\",(INDIRECT(BJ162)-BI162)/IF(Z162=\"\",1,o_nScreens),\"\"),\"\")","v":""},"Piece",{"$f":"IFERROR(IF(ISBLANK(BB162),\"\",INDEX(T_NAV[Base Unit of Measure],MATCH(BB162,T_NAV[No.],0))),\"\")","v":"PIECE"},1,{"$f":"IF(ISBLANK(BN162),\"\",PRODUCT(AD162,BN162,ShadeQuantity))","v":1},{"$f":"IFERROR(INDEX(INDIRECT(\"T_NAV[\"&i_Location&\"]\"),MATCH(1,--(BB162=T_NAV[No.])*--((INDIRECT(\"T_NAV[\"&i_Location&\"]\"))<>\"\"),0))/IF(AND(BF162<>\"\",i_Units=\"Imperial\"),CONVERT(BF162,\"m\",\"in\"),IF(AND(i_Units=\"Imperial\",BM162=\"Metre\"),39.37,IF(BF162<>\"\",BF162,1))),\"\")","v":""},{"$f":"IF(AND(AX162=\"SHOW\",BP162<>\"\"),BP162*BO162*IF(AND(BK162<>\"\",OR(BM162=\"LENGTH\",BM162=\"METRE\",BM162=\"ROLL\")),IF(BK162=\"^\",INDIRECT(BJ162),(INDIRECT(BJ162)-BI162))/IF(i_Units=\"Metric\",1000,1),1),\"\")","v":""}]
[null,null,null,"1.5\"",0,null,"",null,"","STD",0,null,"",null,null,null,null,null,"",null,"",null,null,null,null,null,null,null,null,{"$f":"IFERROR(IF(AND(o_nScreens>1,Z163=\"Y\",PRODUCT(AA163:AC163)=0),o_nScreens,IF(PRODUCT(AA163:AC163)=0,\"\",PRODUCT(AA163:AC163))),\"\")","v":""},null,null,null,null,null,null,null,null,null,null,null,null,"AU","",0,null,"",{"$f":"IF(ISNUMBER(FIND(\"x\",BD163)),IFERROR(INDEX(INDIRECT(\"T_FinishColour[ColourCode-\"&IF(ISNUMBER(FIND(\"xxx\",BD163)),\"xxx\",IF(ISNUMBER(FIND(\"xx\",BD163)),\"xx\",\"error\"))&AQ163&\"]\"),MATCH(AU163,T_FinishColour[Finish / Colour],0)),\"\"),\"\")","v":""},null,"HIDE",null,null,null,"RB12-3802-338038",null,"RB12-3802-338038","Booster Universal | STD 1.5\"",null,{"$f":"IF(ISBLANK(BL163),\"\",IF(OR(BL163=L_Units),\"Y\",\"N\"))","v":"N"},null,{"$f":"IFERROR(IF(BG163=\"Y\",((INDEX(T_Deduc[Deduction],MATCH(BH163,T_Deduc[Type],0),0))),\"\"),\"\")","v":""},null,"","Piece",{"$f":"IFERROR(IF(ISBLANK(BB163),\"\",INDEX(T_NAV[Base Unit of Measure],MATCH(BB163,T_NAV[No.],0))),\"\")","v":"PIECE"},1,1,{"$f":"IFERROR(INDEX(INDIRECT(\"T_NAV[\"&i_Location&\"]\"),MATCH(1,--(BB163=T_NAV[No.])*--((INDIRECT(\"T_NAV[\"&i_Location&\"]\"))<>\"\"),0))/IF(AND(BF163<>\"\",i_Units=\"Imperial\"),CONVERT(BF163,\"m\",\"in\"),IF(AND(i_Units=\"Imperial\",BM163=\"Metre\"),39.37,IF(BF163<>\"\",BF163,1))),\"\")","v":""},""]
[null,null,null,"1.5\"",{"$f":"IFERROR(IF(ISBLANK(D164),\"\",IF(FIND(D164,INDIRECT($D$147))>0,1,0)),0)","v":0},null,{"$f":"IFERROR(IF(ISBLANK(F164),\"\",IF(FIND(F164,INDIRECT($F$147))>0,1,0)),0)","v":""},null,{"$f":"IFERROR(IF(ISBLANK(H164),\"\",IF(FIND(H164,INDIRECT($H$147))>0,1,0)),0)","v":""},null,{"$f":"IFERROR(IF(ISBLANK(J164),\"\",IF(FIND(J164,INDIRECT($J$147))>0,1,0)),0)","v":""},null,{"$f":"IFERROR(IF(ISBLANK(L164),\"\",IF(FIND(L164,INDIRECT($L$147))>0,1,0)),0)","v":""},null,null,"Yes",{"$f":"IFERROR(IF(ISBLANK(P164),\"\",IF(FIND(P164,INDIRECT($P$147))>0,1,0)),0)","v":0},null,"",null,{"$f":"IFERROR(IF(ISBLANK(T164),\"\",IF(FIND(T164,INDIRECT(T$147))>0,1,0)),0)","v":""},null,{"$f":"IFERROR(IF(ISBLANK(V164),\"\",IF(FIND(V164,INDIRECT($P$147))>0,1,0)),0)","v":""},null,null,null,null,null,null,{"$f":"IFERROR(IF(AND(o_nScreens>1,Z164=\"Y\",PRODUCT(AA164:AC164)=0),o_nScreens,IF(PRODUCT(AA164:AC164)=0,\"\",PRODUCT(AA164:AC164))),\"\")","v":""},null,null,null,null,null,null,null,null,null,null,null,null,"AU",{"$f":"IF(ISNUMBER(FIND(\"x\",BD164)),IFERROR(INDEX(AH164:AP164,0,MATCH(AS164,AH164:AP164,0)),IF(AH164<>\"\",AH164,i_DefaultColour)),\"\")","v":""},0,null,{"$f":"IF(ISNUMBER(FIND(\"x\",BD164)),IFERROR(INDEX(AH164:AP164,0,MATCH(AS164,AH164:AP164,0)),AR164),\"\")","v":""},{"$f":"IF(ISNUMBER(FIND(\"x\",BD164)),IFERROR(INDEX(INDIRECT(\"T_FinishColour[ColourCode-\"&IF(ISNUMBER(FIND(\"xxx\",BD164)),\"xxx\",IF(ISNUMBER(FIND(\"xx\",BD164)),\"xx\",\"error\"))&AQ164&\"]\"),MATCH(AU164,T_FinishColour[Finish / Colour],0)),\"\"),\"\")","v":""},null,"HIDE",null,null,null,{"$f":"_xlfn.IFNA(SUBSTITUTE(IF(AQ164=\"AU\",SUBSTITUTE(BD164,\"xxx\",AV164),SUBSTITUTE(SUBSTITUTE(BD164,\"xx\",AV164),\"x\",\"\")),\"LLL\",\"580\"),BD164)","v":"RB12-3812-503038"},null,"RB12-3812-503038","ESU Pre-tension Retaining Clip 38mm",null,{"$f":"IF(ISBLANK(BL164),\"\",IF(OR(BL164=L_Units),\"Y\",\"N\"))","v":"N"},null,{"$f":"IFERROR(IF(BG164=\"Y\",((INDEX(T_Deduc[Deduction],MATCH(BH164,T_Deduc[Type],0),0))),\"\"),\"\")","v":""},null,{"$f":"IFERROR(IF(BG164=\"Y\",(INDIRECT(BJ164)-BI164)/IF(Z164=\"\",1,o_nScreens),\"\"),\"\")","v":""},"Piece",{"$f":"IFERROR(IF(ISBLANK(BB164),\"\",INDEX(T_NAV[Base Unit of Measure],MATCH(BB164,T_NAV[No.],0))),\"\")","v":"PIECE"},1,{"$f":"IF(ISBLANK(BN164),\"\",PRODUCT(AD164,BN164,ShadeQuantity))","v":1},{"$f":"IFERROR(INDEX(INDIRECT(\"T_NAV[\"&i_Location&\"]\"),MATCH(1,--(BB164=T_NAV[No.])*--((INDIRECT(\"T_NAV[\"&i_Location&\"]\"))<>\"\"),0))/IF(AND(BF164<>\"\",i_Units=\"Imperial\"),CONVERT(BF164,\"m\",\"in\"),IF(AND(i_Units=\"Imperial\",BM164=\"Metre\"),39.37,IF(BF164<>\"\",BF164,1))),\"\")","v":""},""]
[null,null,null,null,"",null,"",null,"",null,"",null,"",null,null,null,null,null,"",null,{"$f":"IFERROR(IF(ISBLANK(T165),\"\",IF(FIND(T165,INDIRECT(T$147))>0,1,0)),0)","v":""},null,null,null,null,null,null,null,null,"",null,null,null,null,null,null,null,null,null,null,null,null,null,"",null,null,"",{"$f":"IF(ISNUMBER(FIND(\"x\",BD165)),IFERROR(INDEX(INDIRECT(\"T_FinishColour[ColourCode-\"&IF(ISNUMBER(FIND(\"xxx\",BD165)),\"xxx\",IF(ISNUMBER(FIND(\"xx\",BD165)),\"xx\",\"error\"))&AQ165&\"]\"),MATCH(AU165,T_FinishColour[Finish / Colour],0)),\"\"),\"\")","v":""},null,"HIDE",null,null,null,"",null,null,null,null,{"$f":"IF(ISBLANK(BL165),\"\",IF(OR(BL165=L_Units),\"Y\",\"N\"))","v":""},null,{"$f":"IFERROR(IF(BG165=\"Y\",((INDEX(T_Deduc[Deduction],MATCH(BH165,T_Deduc[Type],0),0))),\"\"),\"\")","v":""},null,"",null,{"$f":"IFERROR(IF(ISBLANK(BB165),\"\",INDEX(T_NAV[Base Unit of Measure],MATCH(BB165,T_NAV[No.],0))),\"\")","v":""},null,"",{"$f":"IFERROR(INDEX(INDIRECT(\"T_NAV[\"&i_Location&\"]\"),MATCH(1,--(BB165=T_NAV[No.])*--((INDIRECT(\"T_NAV[\"&i_Location&\"]\"))<>\"\"),0))/IF(AND(BF165<>\"\",i_Units=\"Imperial\"),CONVERT(BF165,\"m\",\"in\"),IF(AND(i_Units=\"Imperial\",BM165=\"Metre\"),39.37,IF(BF165<>\"\",BF165,1))),\"\")","v":""},{"$f":"IF(AND(AX165=\"SHOW\",BP165<>\"\"),BP165*BO165*IF(AND(BK165<>\"\",OR(BM165=\"LENGTH\",BM165=\"METRE\",BM165=\"ROLL\")),IF(BK165=\"^\",INDIRECT(BJ165),(INDIRECT(BJ165)-BI165))/IF(i_Units=\"Metric\",1000,1),1),\"\")","v":""}]
[null,null,{"$f":"C167","v":0},null,null,null,null,null,null,null,null,null,null,null,null,null,null,null,"",null,"",null,null,null,null,null,null,null,null,null,null,null,null,null,null,null,null,null,null,null,null,null,null,"",null,null,"",{"$f":"IF(ISNUMBER(FIND(\"x\",BD166)),IFERROR(INDEX(INDIRECT(\"T_FinishColour[ColourCode-\"&IF(ISNUMBER(FIND(\"xxx\",BD166)),\"xxx\",IF(ISNUMBER(FIND(\"xx\",BD166)),\"xx\",\"error\"))&AQ166&\"]\"),MATCH(AU166,T_FinishColour[Finish / Colour],0)),\"\"),\"\")","v":""},null,"HIDE",null,null,null,"",null,null,null,null,null,null,{"$f":"IFERROR(IF(BG166=\"Y\",((INDEX(T_Deduc[Deduction],MATCH(BH166,T_Deduc[Type],0),0))),\"\"),\"\")","v":""},null,"",null,{"$f":"IFERROR(IF(ISBLANK(BB166),\"\",INDEX(T_NAV[Base Unit of Measure],MATCH(BB166,T_NAV[No.],0))),\"\")","v":""},null,"",{"$f":"IFERROR(INDEX(INDIRECT(\"T_NAV[\"&i_Location&\"]\"),MATCH(1,--(BB166=T_NAV[No.])*--((INDIRECT(\"T_NAV[\"&i_Location&\"]\"))<>\"\"),0))/IF(AND(BF166<>\"\",i_Units=\"Imperial\"),CONVERT(BF166,\"m\",\"in\"),IF(AND(i_Units=\"Imperial\",BM166=\"Metre\"),39.37,IF(BF166<>\"\",BF166,1))),\"\")","v":""},""]
[null,null,{"$f":"IFERROR(IF(FIND(D171,INDIRECT($D$147))>0,1,0),0)","v":0},null,null,null,null,null,null,null,null,null,null,null,null,null,null,null,"",null,"",null,null,null,null,null,null,null,null,null,null,null,null,null,null,null,null,null,null,null,null,null,null,"",null,null,"",{"$f":"IF(ISNUMBER(FIND(\"x\",BD167)),IFERROR(INDEX(INDIRECT(\"T_FinishColour[ColourCode-\"&IF(ISNUMBER(FIND(\"xxx\",BD167)),\"xxx\",IF(ISNUMBER(FIND(\"xx\",BD167)),\"xx\",\"error\"))&AQ167&\"]\"),MATCH(AU167,T_FinishColour[Finish / Colour],0)),\"\"),\"\")","v":""},null,"HIDE",null,null,null,"S45",null,"S45",null,null,null,null,{"$f":"IFERROR(IF(BG167=\"Y\",((INDEX(T_Deduc[Deduction],MATCH(BH167,T_Deduc[Type],0),0))),\"\"),\"\")","v":""},null,"",null,{"$f":"IFERROR(IF(ISBLANK(BB167),\"\",INDEX(T_NAV[Base Unit of Measure],MATCH(BB167,T_NAV[No.],0))),\"\")","v":""},null,"",{"$f":"IFERROR(INDEX(INDIRECT(\"T_NAV[\"&i_Location&\"]\"),MATCH(1,--(BB167=T_NAV[No.])*--((INDIRECT(\"T_NAV[\"&i_Location&\"]\"))<>\"\"),0))/IF(AND(BF167<>\"\",i_Units=\"Imperial\"),CONVERT(BF167,\"m\",\"in\"),IF(AND(i_Units=\"Imperial\",BM167=\"Metre\"),39.37,IF(BF167<>\"\",BF167,1))),\"\")","v":""},""]
[null,null,null,"S45",{"$f":"IFERROR(IF(ISBLANK(D168),\"\",IF(FIND(D168,INDIRECT($D$147))>0,1,0)),0)","v":0},null,{"$f":"IFERROR(IF(ISBLANK(F168),\"\",IF(FIND(F168,INDIRECT($F$147))>0,1,0)),0)","v":""},"(ESU)",{"$f":"IFERROR(IF(ISBLANK(H168),\"\",IF(FIND(H168,INDIRECT($H$147))>0,1,0)),0)","v":0},"NOT COMPACT",{"$f":"IF($K$179<>0,0,1)","v":1},null,{"$f":"IFERROR(IF(ISBLANK(L168),\"\",IF(FIND(L168,INDIRECT($L$147))>0,1,0)),0)","v":""},null,null,null,null,"US",0,"Standard",0,null,null,null,null,null,null,null,null,"",null,null,null,null,null,null,null,null,null,null,null,null,"AU","",{"$f":"i_Colour","v":0},null,"",{"$f":"IF(ISNUMBER(FIND(\"x\",BD168)),IFERROR(INDEX(INDIRECT(\"T_FinishColour[ColourCode-\"&IF(ISNUMBER(FIND(\"xxx\",BD168)),\"xxx\",IF(ISNUMBER(FIND(\"xx\",BD168)),\"xx\",\"error\"))&AQ168&\"]\"),MATCH(AU168,T_FinishColour[Finish / Colour],0)),\"\"),\"\")","v":""},null,"HIDE",null,null,null,"RB12-3200-069045",null,"RB12-3200-069045","Single Chainfree  Control | S45",null,{"$f":"IF(ISBLANK(BL168),\"\",IF(OR(BL168=L_Units),\"Y\",\"N\"))","v":"N"},null,{"$f":"IFERROR(IF(BG168=\"Y\",((INDEX(T_Deduc[Deduction],MATCH(BH168,T_Deduc[Type],0),0))),\"\"),\"\")","v":""},null,"","Piece",{"$f":"IFERROR(IF(ISBLANK(BB168),\"\",INDEX(T_NAV[Base Unit of Measure],MATCH(BB168,T_NAV[No.],0))),\"\")","v":"PIECE"},1,1,{"$f":"IFERROR(INDEX(INDIRECT(\"T_NAV[\"&i_Location&\"]\"),MATCH(1,--(BB168=T_NAV[No.])*--((INDIRECT(\"T_NAV[\"&i_Location&\"]\"))<>\"\"),0))/IF(AND(BF168<>\"\",i_Units=\"Imperial\"),CONVERT(BF168,\"m\",\"in\"),IF(AND(i_Units=\"Imperial\",BM168=\"Metre\"),39.37,IF(BF168<>\"\",BF168,1))),\"\")","v":""},""]
[null,null,null,"S45",{"$f":"IFERROR(IF(ISBLANK(D169),\"\",IF(FIND(D169,INDIRECT($D$147))>0,1,0)),0)","v":0},null,{"$f":"IFERROR(IF(ISBLANK(F169),\"\",IF(FIND(F169,INDIRECT($F$147))>0,1,0)),0)","v":""},"(ESU)",{"$f":"IFERROR(IF(ISBLANK(H169),\"\",IF(FIND(H169,INDIRECT($H$147))>0,1,0)),0)","v":0},"NOT COMPACT",1,null,{"$f":"IFERROR(IF(ISBLANK(L169),\"\",IF(FIND(L169,INDIRECT($L$147))>0,1,0)),0)","v":""},null,null,null,null,"US",0,"Tension Adjust",{"$f":"IFERROR(IF(ISBLANK(T169),\"\",IF(FIND(T169,INDIRECT(T$147))>0,1,0)),0)","v":0},null,{"$f":"IFERROR(IF(ISBLANK(V169),\"\",IF(FIND(V169,INDIRECT($P$147))>0,1,0)),0)","v":""},null,null,null,null,null,null,null,null,null,null,null,null,null,null,null,null,null,null,null,"AU",{"$f":"IF(ISNUMBER(FIND(\"x\",BD169)),IFERROR(INDEX(AH169:AP169,0,MATCH(AS169,AH169:AP169,0)),IF(AH169<>\"\",AH169,i_DefaultColour)),\"\")","v":"White"},{"$f":"i_Colour","v":0},null,{"$f":"IF(ISNUMBER(FIND(\"x\",BD169)),IFERROR(INDEX(AH169:AP169,0,MATCH(AS169,AH169:AP169,0)),AR169),\"\")","v":"White"},{"$f":"IF(ISNUMBER(FIND(\"x\",BD169)),IFERROR(INDEX(INDIRECT(\"T_FinishColour[ColourCode-\"&IF(ISNUMBER(FIND(\"xxx\",BD169)),\"xxx\",IF(ISNUMBER(FIND(\"xx\",BD169)),\"xx\",\"error\"))&AQ169&\"]\"),MATCH(AU169,T_FinishColour[Finish / Colour],0)),\"\"),\"\")","v":"069"},null,"HIDE",null,null,null,{"$f":"_xlfn.IFNA(SUBSTITUTE(IF(AQ169=\"AU\",SUBSTITUTE(BD169,\"xxx\",AV169),SUBSTITUTE(SUBSTITUTE(BD169,\"xx\",AV169),\"x\",\"\")),\"LLL\",\"580\"),BD169)","v":"RB12-4550-069045"},null,"RB12-4550-xxx045","Spring Control Tension Adjust S45",null,"N",null,{"$f":"IFERROR(IF(BG169=\"Y\",((INDEX(T_Deduc[Deduction],MATCH(BH169,T_Deduc[Type],0),0))),\"\"),\"\")","v":""},null,{"$f":"IFERROR(IF(BG169=\"Y\",(INDIRECT(BJ169)-BI169)/IF(Z169=\"\",1,o_nScreens),\"\"),\"\")","v":""},"Piece",{"$f":"IFERROR(IF(ISBLANK(BB169),\"\",INDEX(T_NAV[Base Unit of Measure],MATCH(BB169,T_NAV[No.],0))),\"\")","v":"PIECE"},1,1,{"$f":"IFERROR(INDEX(INDIRECT(\"T_NAV[\"&i_Location&\"]\"),MATCH(1,--(BB169=T_NAV[No.])*--((INDIRECT(\"T_NAV[\"&i_Location&\"]\"))<>\"\"),0))/IF(AND(BF169<>\"\",i_Units=\"Imperial\"),CONVERT(BF169,\"m\",\"in\"),IF(AND(i_Units=\"Imperial\",BM169=\"Metre\"),39.37,IF(BF169<>\"\",BF169,1))),\"\")","v":""},""]
[null,null,null,"S45",{"$f":"IFERROR(IF(ISBLANK(D170),\"\",IF(FIND(D170,INDIRECT($D$147))>0,1,0)),0)","v":0},null,null,"(ESU)",{"$f":"IFERROR(IF(ISBLANK(H170),\"\",IF(FIND(H170,INDIRECT($H$147))>0,1,0)),0)","v":0},"NOT COMPACT",1,null,null,null,null,null,null,"AU",0,"Tension Adjust",{"$f":"IFERROR(IF(ISBLANK(T170),\"\",IF(FIND(T170,INDIRECT(T$147))>0,1,0)),0)","v":0},null,null,null,null,null,null,null,null,null,null,null,null,null,null,null,null,null,null,null,null,null,"AU",{"$f":"IF(ISNUMBER(FIND(\"x\",BD170)),IFERROR(INDEX(AH170:AP170,0,MATCH(AS170,AH170:AP170,0)),IF(AH170<>\"\",AH170,i_DefaultColour)),\"\")","v":"White"},0,null,{"$f":"IF(ISNUMBER(FIND(\"x\",BD170)),IFERROR(INDEX(AH170:AP170,0,MATCH(AS170,AH170:AP170,0)),AR170),\"\")","v":"White"},{"$f":"IF(ISNUMBER(FIND(\"x\",BD170)),IFERROR(INDEX(INDIRECT(\"T_FinishColour[ColourCode-\"&IF(ISNUMBER(FIND(\"xxx\",BD170)),\"xxx\",IF(ISNUMBER(FIND(\"xx\",BD170)),\"xx\",\"error\"))&AQ170&\"]\"),MATCH(AU170,T_FinishColour[Finish / Colour],0)),\"\"),\"\")","v":"069"},null,{"$f":"IF(AND(ISBLANK(BD170),ISBLANK(C170)),\"HIDE\",IF(PRODUCT(C170:Y170)=1,\"SHOW\",\"HIDE\"))","v":"HIDE"},null,null,null,{"$f":"_xlfn.IFNA(SUBSTITUTE(IF(AQ170=\"AU\",SUBSTITUTE(BD170,\"xxx\",AV170),SUBSTITUTE(SUBSTITUTE(BD170,\"xx\",AV170),\"x\",\"\")),\"LLL\",\"580\"),BD170)","v":"RB12-4570-069045"},null,"RB12-4570-xxx045","Skyline Spring Control with Tension Adjust S45",null,"N",null,null,null,null,"Piece",{"$f":"IFERROR(IF(ISBLANK(BB170),\"\",INDEX(T_NAV[Base Unit of Measure],MATCH(BB170,T_NAV[No.],0))),\"\")","v":"PIECE"},1,1,{"$f":"IFERROR(INDEX(INDIRECT(\"T_NAV[\"&i_Location&\"]\"),MATCH(1,--(BB170=T_NAV[No.])*--((INDIRECT(\"T_NAV[\"&i_Location&\"]\"))<>\"\"),0))/IF(AND(BF170<>\"\",i_Units=\"Imperial\"),CONVERT(BF170,\"m\",\"in\"),IF(AND(i_Units=\"Imperial\",BM170=\"Metre\"),39.37,IF(BF170<>\"\",BF170,1))),\"\")","v":""},""]
[null,null,null,"S45",0,"Easy-Lock",0,"(ESU)",0,null,null,null,null,null,null,null,null,null,"",null,"",null,null,null,null,null,null,null,null,"",null,null,null,null,null,null,null,null,null,null,null,null,"AU","White",{"$f":"i_Colour","v":0},null,"White",{"$f":"IF(ISNUMBER(FIND(\"x\",BD171)),IFERROR(INDEX(INDIRECT(\"T_FinishColour[ColourCode-\"&IF(ISNUMBER(FIND(\"xxx\",BD171)),\"xxx\",IF(ISNUMBER(FIND(\"xx\",BD171)),\"xx\",\"error\"))&AQ171&\"]\"),MATCH(AU171,T_FinishColour[Finish / Colour],0)),\"\"),\"\")","v":"069"},null,"HIDE",null,null,null,{"$f":"_xlfn.IFNA(SUBSTITUTE(IF(AQ171=\"AU\",SUBSTITUTE(BD171,\"xxx\",AV171),SUBSTITUTE(SUBSTITUTE(BD171,\"xx\",AV171),\"x\",\"\")),\"LLL\",\"580\"),BD171)","v":"RB09-0245-069001"},null,"RB09-0245-xxx001","RB09 Easy-Lock Extendable Idler | S45",null,{"$f":"IF(ISBLANK(BL171),\"\",IF(OR(BL171=L_Units),\"Y\",\"N\"))","v":"N"},null,{"$f":"IFERROR(IF(BG171=\"Y\",((INDEX(T_Deduc[Deduction],MATCH(BH171,T_Deduc[Type],0),0))),\"\"),\"\")","v":""},null,"","Piece",{"$f":"IFERROR(IF(ISBLANK(BB171),\"\",INDEX(T_NAV[Base Unit of Measure],MATCH(BB171,T_NAV[No.],0))),\"\")","v":"PIECE"},1,1,{"$f":"IFERROR(INDEX(INDIRECT(\"T_NAV[\"&i_Location&\"]\"),MATCH(1,--(BB171=T_NAV[No.])*--((INDIRECT(\"T_NAV[\"&i_Location&\"]\"))<>\"\"),0))/IF(AND(BF171<>\"\",i_Units=\"Imperial\"),CONVERT(BF171,\"m\",\"in\"),IF(AND(i_Units=\"Imperial\",BM171=\"Metre\"),39.37,IF(BF171<>\"\",BF171,1))),\"\")","v":""},""]
[null,null,null,"S45",0,null,"",null,"","NOT NARROW",{"$f":"IF(K177=1,0,E172)","v":0},null,{"$f":"IFERROR(IF(ISBLANK(L172),\"\",IF(FIND(L172,INDIRECT($L$147))>0,1,0)),0)","v":""},null,null,null,null,null,"",null,"",null,null,null,null,null,null,null,null,"",null,null,null,null,null,null,null,null,null,null,null,null,"AU","White",{"$f":"i_Colour","v":0},null,"White",{"$f":"IF(ISNUMBER(FIND(\"x\",BD172)),IFERROR(INDEX(INDIRECT(\"T_FinishColour[ColourCode-\"&IF(ISNUMBER(FIND(\"xxx\",BD172)),\"xxx\",IF(ISNUMBER(FIND(\"xx\",BD172)),\"xx\",\"error\"))&AQ172&\"]\"),MATCH(AU172,T_FinishColour[Finish / Colour],0)),\"\"),\"\")","v":"069"},null,"HIDE",null,null,null,"RB12-6101-069045",null,"RB12-6101-xxx045","Skyline Limiter - Single Stop | Universal S45",null,{"$f":"IF(ISBLANK(BL172),\"\",IF(OR(BL172=L_Units),\"Y\",\"N\"))","v":"N"},null,{"$f":"IFERROR(IF(BG172=\"Y\",((INDEX(T_Deduc[Deduction],MATCH(BH172,T_Deduc[Type],0),0))),\"\"),\"\")","v":""},null,"","Piece",{"$f":"IFERROR(IF(ISBLANK(BB172),\"\",INDEX(T_NAV[Base Unit of Measure],MATCH(BB172,T_NAV[No.],0))),\"\")","v":"PIECE"},1,1,{"$f":"IFERROR(INDEX(INDIRECT(\"T_NAV[\"&i_Location&\"]\"),MATCH(1,--(BB172=T_NAV[No.])*--((INDIRECT(\"T_NAV[\"&i_Location&\"]\"))<>\"\"),0))/IF(AND(BF172<>\"\",i_Units=\"Imperial\"),CONVERT(BF172,\"m\",\"in\"),IF(AND(i_Units=\"Imperial\",BM172=\"Metre\"),39.37,IF(BF172<>\"\",BF172,1))),\"\")","v":""},""]
[null,null,null,"S45",0,null,"",null,"","NOT COMPACT",{"$f":"IF($K$179<>0,0,1)","v":1},"Right Hand",0,null,null,null,null,null,null,null,"","Standard / Back / Under Roll",{"$f":"IFERROR(IF(ISBLANK(V173),\"\",IF(FIND(V173,INDIRECT($V$147))>0,1,0)),0)","v":0},null,null,null,null,null,null,"",null,null,null,null,null,null,null,null,null,null,null,null,null,"",null,null,"",{"$f":"IF(ISNUMBER(FIND(\"x\",BD173)),IFERROR(INDEX(INDIRECT(\"T_FinishColour[ColourCode-\"&IF(ISNUMBER(FIND(\"xxx\",BD173)),\"xxx\",IF(ISNUMBER(FIND(\"xx\",BD173)),\"xx\",\"error\"))&AQ173&\"]\"),MATCH(AU173,T_FinishColour[Finish / Colour],0)),\"\"),\"\")","v":""},null,"HIDE",null,null,null,"RB12-7112-190045",null,{"$f":"IF(i_Location=\"AU\",\"RB12-7112-190045\",\"RB12-7112-190045\")","v":"RB12-7112-190045"},{"$f":"IF(i_Location=\"AU\",\"Booster Decelerator | S45 RH - Red Tail\",\"Decelerator | Universal S45 RH - Red Tail\")","v":"Decelerator | Universal S45 RH - Red Tail"},null,{"$f":"IF(ISBLANK(BL173),\"\",IF(OR(BL173=L_Units),\"Y\",\"N\"))","v":"N"},null,{"$f":"IFERROR(IF(BG173=\"Y\",((INDEX(T_Deduc[Deduction],MATCH(BH173,T_Deduc[Type],0),0))),\"\"),\"\")","v":""},null,"","Piece",{"$f":"IFERROR(IF(ISBLANK(BB173),\"\",INDEX(T_NAV[Base Unit of Measure],MATCH(BB173,T_NAV[No.],0))),\"\")","v":"PIECE"},1,1,{"$f":"IFERROR(INDEX(INDIRECT(\"T_NAV[\"&i_Location&\"]\"),MATCH(1,--(BB173=T_NAV[No.])*--((INDIRECT(\"T_NAV[\"&i_Location&\"]\"))<>\"\"),0))/IF(AND(BF173<>\"\",i_Units=\"Imperial\"),CONVERT(BF173,\"m\",\"in\"),IF(AND(i_Units=\"Imperial\",BM173=\"Metre\"),39.37,IF(BF173<>\"\",BF173,1))),\"\")","v":""},""]
[null,null,null,"S45",{"$f":"IFERROR(IF(ISBLANK(D174),\"\",IF(FIND(D174,INDIRECT($D$147))>0,1,0)),0)","v":0},null,{"$f":"IFERROR(IF(ISBLANK(F174),\"\",IF(FIND(F174,INDIRECT($F$147))>0,1,0)),0)","v":""},null,{"$f":"IFERROR(IF(ISBLANK(H174),\"\",IF(FIND(H174,INDIRECT($H$147))>0,1,0)),0)","v":""},"NOT COMPACT",1,"Right Hand",{"$f":"IFERROR(IF(ISBLANK(L174),\"\",IF(FIND(L174,INDIRECT($L$147))>0,1,0)),0)","v":0},null,null,null,null,null,null,null,"","Reverse / Front / Over Roll",{"$f":"IFERROR(IF(ISBLANK(V174),\"\",IF(FIND(V174,INDIRECT($V$147))>0,1,0)),0)","v":0},null,null,null,null,null,null,{"$f":"IFERROR(IF(AND(o_nScreens>1,Z174=\"Y\",PRODUCT(AA174:AC174)=0),o_nScreens,IF(PRODUCT(AA174:AC174)=0,\"\",PRODUCT(AA174:AC174))),\"\")","v":""},null,null,null,null,null,null,null,null,null,null,null,null,null,{"$f":"IF(ISNUMBER(FIND(\"x\",BD174)),IFERROR(INDEX(AH174:AP174,0,MATCH(AS174,AH174:AP174,0)),IF(AH174<>\"\",AH174,i_DefaultColour)),\"\")","v":""},null,null,{"$f":"IF(ISNUMBER(FIND(\"x\",BD174)),IFERROR(INDEX(AH174:AP174,0,MATCH(AS174,AH174:AP174,0)),AR174),\"\")","v":""},{"$f":"IF(ISNUMBER(FIND(\"x\",BD174)),IFERROR(INDEX(INDIRECT(\"T_FinishColour[ColourCode-\"&IF(ISNUMBER(FIND(\"xxx\",BD174)),\"xxx\",IF(ISNUMBER(FIND(\"xx\",BD174)),\"xx\",\"error\"))&AQ174&\"]\"),MATCH(AU174,T_FinishColour[Finish / Colour],0)),\"\"),\"\")","v":""},null,"HIDE",null,null,null,{"$f":"_xlfn.IFNA(SUBSTITUTE(IF(AQ174=\"AU\",SUBSTITUTE(BD174,\"xxx\",AV174),SUBSTITUTE(SUBSTITUTE(BD174,\"xx\",AV174),\"x\",\"\")),\"LLL\",\"580\"),BD174)","v":"RB12-7112-190045"},null,{"$f":"IF(i_Location=\"AU\",\"RB12-7112-190045\",\"RB12-7112-190045\")","v":"RB12-7112-190045"},{"$f":"IF(i_Location=\"AU\",\"Booster Decelerator | S45 RH - Red Tail\",\"Decelerator | Universal S45 RH - Red Tail\")","v":"Decelerator | Universal S45 RH - Red Tail"},null,{"$f":"IF(ISBLANK(BL174),\"\",IF(OR(BL174=L_Units),\"Y\",\"N\"))","v":"N"},null,{"$f":"IFERROR(IF(BG174=\"Y\",((INDEX(T_Deduc[Deduction],MATCH(BH174,T_Deduc[Type],0),0))),\"\"),\"\")","v":""},null,{"$f":"IFERROR(IF(BG174=\"Y\",(INDIRECT(BJ174)-BI174)/IF(Z174=\"\",1,o_nScreens),\"\"),\"\")","v":""},"Piece",{"$f":"IFERROR(IF(ISBLANK(BB174),\"\",INDEX(T_NAV[Base Unit of Measure],MATCH(BB174,T_NAV[No.],0))),\"\")","v":"PIECE"},1,{"$f":"IF(ISBLANK(BN174),\"\",PRODUCT(AD174,BN174,ShadeQuantity))","v":1},{"$f":"IFERROR(INDEX(INDIRECT(\"T_NAV[\"&i_Location&\"]\"),MATCH(1,--(BB174=T_NAV[No.])*--((INDIRECT(\"T_NAV[\"&i_Location&\"]\"))<>\"\"),0))/IF(AND(BF174<>\"\",i_Units=\"Imperial\"),CONVERT(BF174,\"m\",\"in\"),IF(AND(i_Units=\"Imperial\",BM174=\"Metre\"),39.37,IF(BF174<>\"\",BF174,1))),\"\")","v":""},""]
[null,null,null,"S45",0,null,"","(ESU)",0,"NOT COMPACT",1,null,"","NOT NARROW",{"$f":"$K$172","v":0},null,null,null,null,null,"",null,{"$f":"IFERROR(IF(ISBLANK(V175),\"\",IF(FIND(V175,INDIRECT($V$147))>0,1,0)),0)","v":""},null,null,null,null,null,null,"",null,null,null,null,null,null,null,null,null,null,null,null,null,"",null,null,"",{"$f":"IF(ISNUMBER(FIND(\"x\",BD175)),IFERROR(INDEX(INDIRECT(\"T_FinishColour[ColourCode-\"&IF(ISNUMBER(FIND(\"xxx\",BD175)),\"xxx\",IF(ISNUMBER(FIND(\"xx\",BD175)),\"xx\",\"error\"))&AQ175&\"]\"),MATCH(AU175,T_FinishColour[Finish / Colour],0)),\"\"),\"\")","v":""},null,"HIDE",null,null,null,"RB12-7111-393045",null,{"$f":"IF(i_Location=\"AU\",\"RB12-7111-393045\",\"RB12-7111-393045\")","v":"RB12-7111-393045"},{"$f":"IF(i_Location=\"AU\",\"Booster Decelerator | S45 LH - Blue Tail\",\"Decelerator | Universal S45 LH - Blue Tail\")","v":"Decelerator | Universal S45 LH - Blue Tail"},null,{"$f":"IF(ISBLANK(BL175),\"\",IF(OR(BL175=L_Units),\"Y\",\"N\"))","v":"N"},null,{"$f":"IFERROR(IF(BG175=\"Y\",((INDEX(T_Deduc[Deduction],MATCH(BH175,T_Deduc[Type],0),0))),\"\"),\"\")","v":""},null,"","Piece",{"$f":"IFERROR(IF(ISBLANK(BB175),\"\",INDEX(T_NAV[Base Unit of Measure],MATCH(BB175,T_NAV[No.],0))),\"\")","v":"PIECE"},1,1,{"$f":"IFERROR(INDEX(INDIRECT(\"T_NAV[\"&i_Location&\"]\"),MATCH(1,--(BB175=T_NAV[No.])*--((INDIRECT(\"T_NAV[\"&i_Location&\"]\"))<>\"\"),0))/IF(AND(BF175<>\"\",i_Units=\"Imperial\"),CONVERT(BF175,\"m\",\"in\"),IF(AND(i_Units=\"Imperial\",BM175=\"Metre\"),39.37,IF(BF175<>\"\",BF175,1))),\"\")","v":""},""]
[null,null,null,"S45",{"$f":"IFERROR(IF(ISBLANK(D176),\"\",IF(FIND(D176,INDIRECT($D$147))>0,1,0)),0)","v":0},null,{"$f":"IFERROR(IF(ISBLANK(F176),\"\",IF(FIND(F176,INDIRECT($F$147))>0,1,0)),0)","v":""},"(ESU)",{"$f":"IFERROR(IF(ISBLANK(H176),\"\",IF(FIND(H176,INDIRECT($H$147))>0,0,1)),0)","v":0},"NOT COMPACT",{"$f":"IF($K$179<>0,0,1)","v":1},"Left Hand",{"$f":"IFERROR(IF(ISBLANK(L176),\"\",IF(FIND(L176,INDIRECT($L$147))>0,1,0)),0)","v":0},"NOT NARROW",{"$f":"$K$172","v":0},null,null,null,null,null,"",null,{"$f":"IFERROR(IF(ISBLANK(V176),\"\",IF(FIND(V176,INDIRECT($V$147))>0,1,0)),0)","v":""},null,null,null,null,null,null,{"$f":"IFERROR(IF(AND(o_nScreens>1,Z176=\"Y\",PRODUCT(AA176:AC176)=0),o_nScreens,IF(PRODUCT(AA176:AC176)=0,\"\",PRODUCT(AA176:AC176))),\"\")","v":""},null,null,null,null,null,null,null,null,null,null,null,null,null,{"$f":"IF(ISNUMBER(FIND(\"x\",BD176)),IFERROR(INDEX(AH176:AP176,0,MATCH(AS176,AH176:AP176,0)),IF(AH176<>\"\",AH176,i_DefaultColour)),\"\")","v":""},null,null,{"$f":"IF(ISNUMBER(FIND(\"x\",BD176)),IFERROR(INDEX(AH176:AP176,0,MATCH(AS176,AH176:AP176,0)),AR176),\"\")","v":""},{"$f":"IF(ISNUMBER(FIND(\"x\",BD176)),IFERROR(INDEX(INDIRECT(\"T_FinishColour[ColourCode-\"&IF(ISNUMBER(FIND(\"xxx\",BD176)),\"xxx\",IF(ISNUMBER(FIND(\"xx\",BD176)),\"xx\",\"error\"))&AQ176&\"]\"),MATCH(AU176,T_FinishColour[Finish / Colour],0)),\"\"),\"\")","v":""},null,"HIDE",null,null,null,{"$f":"_xlfn.IFNA(SUBSTITUTE(IF(AQ176=\"AU\",SUBSTITUTE(BD176,\"xxx\",AV176),SUBSTITUTE(SUBSTITUTE(BD176,\"xx\",AV176),\"x\",\"\")),\"LLL\",\"580\"),BD176)","v":"RB12-7111-393045"},null,{"$f":"IF(i_Location=\"AU\",\"RB12-7111-393145\",\"RB12-7111-393045\")","v":"RB12-7111-393045"},{"$f":"IF(i_Location=\"AU\",\"Aero Booster Decelerator | S45 LH - Blue Tail\",\"Aero Decelerator | Universal S45 LH - Blue Tail\")","v":"Aero Decelerator | Universal S45 LH - Blue Tail"},null,{"$f":"IF(ISBLANK(BL176),\"\",IF(OR(BL176=L_Units),\"Y\",\"N\"))","v":"N"},null,{"$f":"IFERROR(IF(BG176=\"Y\",((INDEX(T_Deduc[Deduction],MATCH(BH176,T_Deduc[Type],0),0))),\"\"),\"\")","v":""},null,{"$f":"IFERROR(IF(BG176=\"Y\",(INDIRECT(BJ176)-BI176)/IF(Z176=\"\",1,o_nScreens),\"\"),\"\")","v":""},"Piece",{"$f":"IFERROR(IF(ISBLANK(BB176),\"\",INDEX(T_NAV[Base Unit of Measure],MATCH(BB176,T_NAV[No.],0))),\"\")","v":"PIECE"},1,{"$f":"IF(ISBLANK(BN176),\"\",PRODUCT(AD176,BN176,ShadeQuantity))","v":1},{"$f":"IFERROR(INDEX(INDIRECT(\"T_NAV[\"&i_Location&\"]\"),MATCH(1,--(BB176=T_NAV[No.])*--((INDIRECT(\"T_NAV[\"&i_Location&\"]\"))<>\"\"),0))/IF(AND(BF176<>\"\",i_Units=\"Imperial\"),CONVERT(BF176,\"m\",\"in\"),IF(AND(i_Units=\"Imperial\",BM176=\"Metre\"),39.37,IF(BF176<>\"\",BF176,1))),\"\")","v":""},""]
[null,null,null,"S45",0,null,null,null,null,"NARROW OR COMPACT",{"$f":"IF(OR(K178=1,K179=1),1,0)","v":0},null,null,null,null,null,null,null,null,null,"",null,null,null,null,null,null,null,null,null,null,null,null,"White","Black","Silver Grey",null,null,null,null,null,null,"AU","White",0,null,"White",{"$f":"IF(ISNUMBER(FIND(\"x\",BD177)),IFERROR(INDEX(INDIRECT(\"T_FinishColour[ColourCode-\"&IF(ISNUMBER(FIND(\"xxx\",BD177)),\"xxx\",IF(ISNUMBER(FIND(\"xx\",BD177)),\"xx\",\"error\"))&AQ177&\"]\"),MATCH(AU177,T_FinishColour[Finish / Colour],0)),\"\"),\"\")","v":"069"},null,"HIDE",null,null,null,{"$f":"_xlfn.IFNA(SUBSTITUTE(IF(AQ177=\"AU\",SUBSTITUTE(BD177,\"xxx\",AV177),SUBSTITUTE(SUBSTITUTE(BD177,\"xx\",AV177),\"x\",\"\")),\"LLL\",\"580\"),BD177)","v":"RB12-6102-069045"},null,"RB12-6102-xxx045","Skyline Limiter - Single Stop | Universal Short S45",null,{"$f":"IF(ISBLANK(BL177),\"\",IF(OR(BL177=L_Units),\"Y\",\"N\"))","v":"N"},null,{"$f":"IFERROR(IF(BG177=\"Y\",((INDEX(T_Deduc[Deduction],MATCH(BH177,T_Deduc[Type],0),0))),\"\"),\"\")","v":""},null,{"$f":"IFERROR(IF(BG177=\"Y\",(INDIRECT(BJ177)-BI177)/IF(Z177=\"\",1,o_nScreens),\"\"),\"\")","v":""},"Piece",{"$f":"IFERROR(IF(ISBLANK(BB177),\"\",INDEX(T_NAV[Base Unit of Measure],MATCH(BB177,T_NAV[No.],0))),\"\")","v":"PIECE"},1,{"$f":"IF(ISBLANK(BN177),\"\",PRODUCT(AD177,BN177,ShadeQuantity))","v":1},{"$f":"IFERROR(INDEX(INDIRECT(\"T_NAV[\"&i_Location&\"]\"),MATCH(1,--(BB177=T_NAV[No.])*--((INDIRECT(\"T_NAV[\"&i_Location&\"]\"))<>\"\"),0))/IF(AND(BF177<>\"\",i_Units=\"Imperial\"),CONVERT(BF177,\"m\",\"in\"),IF(AND(i_Units=\"Imperial\",BM177=\"Metre\"),39.37,IF(BF177<>\"\",BF177,1))),\"\")","v":""},""]
[null,null,null,"S45",{"$f":"IFERROR(IF(ISBLANK(D178),\"\",IF(FIND(D178,INDIRECT($D$147))>0,1,0)),0)","v":0},null,null,null,null,"NARROW",{"$f":"IFERROR(IF(ISBLANK(J178),\"\",IF(FIND(J178,INDIRECT($J$147))>0,1,0)),0)","v":0},null,null,null,null,null,null,null,null,null,"",null,null,null,null,null,null,null,null,null,null,null,null,"White","Black","Silver Grey",null,null,null,null,null,null,"AU","White",0,null,"White",{"$f":"IF(ISNUMBER(FIND(\"x\",BD178)),IFERROR(INDEX(INDIRECT(\"T_FinishColour[ColourCode-\"&IF(ISNUMBER(FIND(\"xxx\",BD178)),\"xxx\",IF(ISNUMBER(FIND(\"xx\",BD178)),\"xx\",\"error\"))&AQ178&\"]\"),MATCH(AU178,T_FinishColour[Finish / Colour],0)),\"\"),\"\")","v":""},null,"HIDE",null,null,null,{"$f":"_xlfn.IFNA(SUBSTITUTE(IF(AQ178=\"AU\",SUBSTITUTE(BD178,\"xxx\",AV178),SUBSTITUTE(SUBSTITUTE(BD178,\"xx\",AV178),\"x\",\"\")),\"LLL\",\"580\"),BD178)","v":"RB12-4504-050045"},null,"RB12-4504-050045","Booster Universal | NARROW S45",null,{"$f":"IF(ISBLANK(BL178),\"\",IF(OR(BL178=L_Units),\"Y\",\"N\"))","v":"N"},null,{"$f":"IFERROR(IF(BG178=\"Y\",((INDEX(T_Deduc[Deduction],MATCH(BH178,T_Deduc[Type],0),0))),\"\"),\"\")","v":""},null,"","Piece",{"$f":"IFERROR(IF(ISBLANK(BB178),\"\",INDEX(T_NAV[Base Unit of Measure],MATCH(BB178,T_NAV[No.],0))),\"\")","v":"PIECE"},1,1,{"$f":"IFERROR(INDEX(INDIRECT(\"T_NAV[\"&i_Location&\"]\"),MATCH(1,--(BB178=T_NAV[No.])*--((INDIRECT(\"T_NAV[\"&i_Location&\"]\"))<>\"\"),0))/IF(AND(BF178<>\"\",i_Units=\"Imperial\"),CONVERT(BF178,\"m\",\"in\"),IF(AND(i_Units=\"Imperial\",BM178=\"Metre\"),39.37,IF(BF178<>\"\",BF178,1))),\"\")","v":""},""]
[null,null,null,"S45",0,null,null,null,null,"COMPACT",{"$f":"IFERROR(IF(ISBLANK(J179),\"\",IF(FIND(J179,INDIRECT($J$147))>0,1,0)),0)","v":0},null,null,null,null,null,null,null,null,null,"",null,null,null,null,null,null,null,null,null,null,null,null,"White","Black","Silver Grey",null,null,null,null,null,null,"AU","White",0,null,"White",{"$f":"IF(ISNUMBER(FIND(\"x\",BD179)),IFERROR(INDEX(INDIRECT(\"T_FinishColour[ColourCode-\"&IF(ISNUMBER(FIND(\"xxx\",BD179)),\"xxx\",IF(ISNUMBER(FIND(\"xx\",BD179)),\"xx\",\"error\"))&AQ179&\"]\"),MATCH(AU179,T_FinishColour[Finish / Colour],0)),\"\"),\"\")","v":"069"},null,"HIDE",null,null,null,"RB12-4515-069045",null,"RB12-4515-xxx045","Booster Universal | COMPACT S45 | Skyline",null,{"$f":"IF(ISBLANK(BL179),\"\",IF(OR(BL179=L_Units),\"Y\",\"N\"))","v":"N"},null,{"$f":"IFERROR(IF(BG179=\"Y\",((INDEX(T_Deduc[Deduction],MATCH(BH179,T_Deduc[Type],0),0))),\"\"),\"\")","v":""},null,{"$f":"IFERROR(IF(BG179=\"Y\",(INDIRECT(BJ179)-BI179)/IF(Z179=\"\",1,o_nScreens),\"\"),\"\")","v":""},"Piece",{"$f":"IFERROR(IF(ISBLANK(BB179),\"\",INDEX(T_NAV[Base Unit of Measure],MATCH(BB179,T_NAV[No.],0))),\"\")","v":"PIECE"},1,{"$f":"IF(ISBLANK(BN179),\"\",PRODUCT(AD179,BN179,ShadeQuantity))","v":1},{"$f":"IFERROR(INDEX(INDIRECT(\"T_NAV[\"&i_Location&\"]\"),MATCH(1,--(BB179=T_NAV[No.])*--((INDIRECT(\"T_NAV[\"&i_Location&\"]\"))<>\"\"),0))/IF(AND(BF179<>\"\",i_Units=\"Imperial\"),CONVERT(BF179,\"m\",\"in\"),IF(AND(i_Units=\"Imperial\",BM179=\"Metre\"),39.37,IF(BF179<>\"\",BF179,1))),\"\")","v":""},""]
[null,null,null,"S45",0,null,"",null,"","SHORT",0,null,"",null,null,null,null,null,null,null,"",null,null,null,null,null,null,null,null,"",null,null,null,null,null,null,null,null,null,null,null,null,"AU","",0,null,"",{"$f":"IF(ISNUMBER(FIND(\"x\",BD180)),IFERROR(INDEX(INDIRECT(\"T_FinishColour[ColourCode-\"&IF(ISNUMBER(FIND(\"xxx\",BD180)),\"xxx\",IF(ISNUMBER(FIND(\"xx\",BD180)),\"xx\",\"error\"))&AQ180&\"]\"),MATCH(AU180,T_FinishColour[Finish / Colour],0)),\"\"),\"\")","v":""},null,"HIDE",null,null,null,"RB12-4500-269045",null,"RB12-4500-269045","Booster Universal | SHORT S45",null,{"$f":"IF(ISBLANK(BL180),\"\",IF(OR(BL180=L_Units),\"Y\",\"N\"))","v":"N"},null,{"$f":"IFERROR(IF(BG180=\"Y\",((INDEX(T_Deduc[Deduction],MATCH(BH180,T_Deduc[Type],0),0))),\"\"),\"\")","v":""},null,"","Piece",{"$f":"IFERROR(IF(ISBLANK(BB180),\"\",INDEX(T_NAV[Base Unit of Measure],MATCH(BB180,T_NAV[No.],0))),\"\")","v":"PIECE"},1,1,{"$f":"IFERROR(INDEX(INDIRECT(\"T_NAV[\"&i_Location&\"]\"),MATCH(1,--(BB180=T_NAV[No.])*--((INDIRECT(\"T_NAV[\"&i_Location&\"]\"))<>\"\"),0))/IF(AND(BF180<>\"\",i_Units=\"Imperial\"),CONVERT(BF180,\"m\",\"in\"),IF(AND(i_Units=\"Imperial\",BM180=\"Metre\"),39.37,IF(BF180<>\"\",BF180,1))),\"\")","v":""},""]
[null,null,null,"S45",0,null,"",null,"","LIGHT",0,null,"",null,null,null,null,null,null,null,"",null,null,null,null,null,null,null,null,"",null,null,null,null,null,null,null,null,null,null,null,null,"AU","",0,null,"",{"$f":"IF(ISNUMBER(FIND(\"x\",BD181)),IFERROR(INDEX(INDIRECT(\"T_FinishColour[ColourCode-\"&IF(ISNUMBER(FIND(\"xxx\",BD181)),\"xxx\",IF(ISNUMBER(FIND(\"xx\",BD181)),\"xx\",\"error\"))&AQ181&\"]\"),MATCH(AU181,T_FinishColour[Finish / Colour],0)),\"\"),\"\")","v":""},null,"HIDE",null,null,null,"RB12-4501-069045",null,"RB12-4501-069045","Booster Universal | LIGHT S45",null,{"$f":"IF(ISBLANK(BL181),\"\",IF(OR(BL181=L_Units),\"Y\",\"N\"))","v":"N"},null,{"$f":"IFERROR(IF(BG181=\"Y\",((INDEX(T_Deduc[Deduction],MATCH(BH181,T_Deduc[Type],0),0))),\"\"),\"\")","v":""},null,"","Piece",{"$f":"IFERROR(IF(ISBLANK(BB181),\"\",INDEX(T_NAV[Base Unit of Measure],MATCH(BB181,T_NAV[No.],0))),\"\")","v":"PIECE"},1,1,{"$f":"IFERROR(INDEX(INDIRECT(\"T_NAV[\"&i_Location&\"]\"),MATCH(1,--(BB181=T_NAV[No.])*--((INDIRECT(\"T_NAV[\"&i_Location&\"]\"))<>\"\"),0))/IF(AND(BF181<>\"\",i_Units=\"Imperial\"),CONVERT(BF181,\"m\",\"in\"),IF(AND(i_Units=\"Imperial\",BM181=\"Metre\"),39.37,IF(BF181<>\"\",BF181,1))),\"\")","v":""},""]
[null,null,null,"S45",0,null,"",null,"","STD",0,null,"",null,null,null,null,null,null,null,"",null,null,null,null,null,null,null,null,"",null,null,null,null,null,null,null,null,null,null,null,null,"AU","",0,null,"",{"$f":"IF(ISNUMBER(FIND(\"x\",BD182)),IFERROR(INDEX(INDIRECT(\"T_FinishColour[ColourCode-\"&IF(ISNUMBER(FIND(\"xxx\",BD182)),\"xxx\",IF(ISNUMBER(FIND(\"xx\",BD182)),\"xx\",\"error\"))&AQ182&\"]\"),MATCH(AU182,T_FinishColour[Finish / Colour],0)),\"\"),\"\")","v":""},null,"HIDE",null,null,null,"RB12-4502-338045",null,"RB12-4502-338045","Booster Universal | STD S45",null,{"$f":"IF(ISBLANK(BL182),\"\",IF(OR(BL182=L_Units),\"Y\",\"N\"))","v":"N"},null,{"$f":"IFERROR(IF(BG182=\"Y\",((INDEX(T_Deduc[Deduction],MATCH(BH182,T_Deduc[Type],0),0))),\"\"),\"\")","v":""},null,"","Piece",{"$f":"IFERROR(IF(ISBLANK(BB182),\"\",INDEX(T_NAV[Base Unit of Measure],MATCH(BB182,T_NAV[No.],0))),\"\")","v":"PIECE"},1,1,{"$f":"IFERROR(INDEX(INDIRECT(\"T_NAV[\"&i_Location&\"]\"),MATCH(1,--(BB182=T_NAV[No.])*--((INDIRECT(\"T_NAV[\"&i_Location&\"]\"))<>\"\"),0))/IF(AND(BF182<>\"\",i_Units=\"Imperial\"),CONVERT(BF182,\"m\",\"in\"),IF(AND(i_Units=\"Imperial\",BM182=\"Metre\"),39.37,IF(BF182<>\"\",BF182,1))),\"\")","v":""},""]
[null,null,null,"S45",0,null,"",null,"","HD",0,null,"",null,null,null,null,null,null,null,"",null,null,null,null,null,null,null,null,"",null,null,null,null,null,null,null,null,null,null,null,null,"AU","",0,null,"",{"$f":"IF(ISNUMBER(FIND(\"x\",BD183)),IFERROR(INDEX(INDIRECT(\"T_FinishColour[ColourCode-\"&IF(ISNUMBER(FIND(\"xxx\",BD183)),\"xxx\",IF(ISNUMBER(FIND(\"xx\",BD183)),\"xx\",\"error\"))&AQ183&\"]\"),MATCH(AU183,T_FinishColour[Finish / Colour],0)),\"\"),\"\")","v":""},null,"HIDE",null,null,null,"RB12-4503-050045",null,"RB12-4503-050045","Booster Universal | HD S45",null,{"$f":"IF(ISBLANK(BL183),\"\",IF(OR(BL183=L_Units),\"Y\",\"N\"))","v":"N"},null,{"$f":"IFERROR(IF(BG183=\"Y\",((INDEX(T_Deduc[Deduction],MATCH(BH183,T_Deduc[Type],0),0))),\"\"),\"\")","v":""},null,"","Piece",{"$f":"IFERROR(IF(ISBLANK(BB183),\"\",INDEX(T_NAV[Base Unit of Measure],MATCH(BB183,T_NAV[No.],0))),\"\")","v":"PIECE"},1,1,{"$f":"IFERROR(INDEX(INDIRECT(\"T_NAV[\"&i_Location&\"]\"),MATCH(1,--(BB183=T_NAV[No.])*--((INDIRECT(\"T_NAV[\"&i_Location&\"]\"))<>\"\"),0))/IF(AND(BF183<>\"\",i_Units=\"Imperial\"),CONVERT(BF183,\"m\",\"in\"),IF(AND(i_Units=\"Imperial\",BM183=\"Metre\"),39.37,IF(BF183<>\"\",BF183,1))),\"\")","v":""},""]
[null,null,null,"S45",{"$f":"IFERROR(IF(ISBLANK(D184),\"\",IF(FIND(D184,INDIRECT($D$147))>0,1,0)),0)","v":0},null,{"$f":"IFERROR(IF(ISBLANK(F184),\"\",IF(FIND(F184,INDIRECT($F$147))>0,1,0)),0)","v":""},null,{"$f":"IFERROR(IF(ISBLANK(H184),\"\",IF(FIND(H184,INDIRECT($H$147))>0,1,0)),0)","v":""},null,{"$f":"IFERROR(IF(ISBLANK(J184),\"\",IF(FIND(J184,INDIRECT($J$147))>0,1,0)),0)","v":""},null,{"$f":"IFERROR(IF(ISBLANK(L184),\"\",IF(FIND(L184,INDIRECT($L$147))>0,1,0)),0)","v":""},null,null,"Yes",{"$f":"IFERROR(IF(ISBLANK(P184),\"\",IF(FIND(P184,INDIRECT($P$147))>0,1,0)),0)","v":0},null,null,null,"",null,{"$f":"IFERROR(IF(ISBLANK(V184),\"\",IF(FIND(V184,INDIRECT($P$147))>0,1,0)),0)","v":""},null,null,null,null,null,null,{"$f":"IFERROR(IF(AND(o_nScreens>1,Z184=\"Y\",PRODUCT(AA184:AC184)=0),o_nScreens,IF(PRODUCT(AA184:AC184)=0,\"\",PRODUCT(AA184:AC184))),\"\")","v":""},null,null,null,null,null,null,null,null,null,null,null,null,"AU",{"$f":"IF(ISNUMBER(FIND(\"x\",BD184)),IFERROR(INDEX(AH184:AP184,0,MATCH(AS184,AH184:AP184,0)),IF(AH184<>\"\",AH184,i_DefaultColour)),\"\")","v":""},0,null,{"$f":"IF(ISNUMBER(FIND(\"x\",BD184)),IFERROR(INDEX(AH184:AP184,0,MATCH(AS184,AH184:AP184,0)),AR184),\"\")","v":""},{"$f":"IF(ISNUMBER(FIND(\"x\",BD184)),IFERROR(INDEX(INDIRECT(\"T_FinishColour[ColourCode-\"&IF(ISNUMBER(FIND(\"xxx\",BD184)),\"xxx\",IF(ISNUMBER(FIND(\"xx\",BD184)),\"xx\",\"error\"))&AQ184&\"]\"),MATCH(AU184,T_FinishColour[Finish / Colour],0)),\"\"),\"\")","v":""},null,"HIDE",null,null,null,{"$f":"_xlfn.IFNA(SUBSTITUTE(IF(AQ184=\"AU\",SUBSTITUTE(BD184,\"xxx\",AV184),SUBSTITUTE(SUBSTITUTE(BD184,\"xx\",AV184),\"x\",\"\")),\"LLL\",\"580\"),BD184)","v":"RB12-4512-503045"},null,"RB12-4512-503045","ESU Pre-tension Retaining Clip 45mm",null,{"$f":"IF(ISBLANK(BL184),\"\",IF(OR(BL184=L_Units),\"Y\",\"N\"))","v":"N"},null,{"$f":"IFERROR(IF(BG184=\"Y\",((INDEX(T_Deduc[Deduction],MATCH(BH184,T_Deduc[Type],0),0))),\"\"),\"\")","v":""},null,{"$f":"IFERROR(IF(BG184=\"Y\",(INDIRECT(BJ184)-BI184)/IF(Z184=\"\",1,o_nScreens),\"\"),\"\")","v":""},"Piece",{"$f":"IFERROR(IF(ISBLANK(BB184),\"\",INDEX(T_NAV[Base Unit of Measure],MATCH(BB184,T_NAV[No.],0))),\"\")","v":"PIECE"},1,{"$f":"IF(ISBLANK(BN184),\"\",PRODUCT(AD184,BN184,ShadeQuantity))","v":1},{"$f":"IFERROR(INDEX(INDIRECT(\"T_NAV[\"&i_Location&\"]\"),MATCH(1,--(BB184=T_NAV[No.])*--((INDIRECT(\"T_NAV[\"&i_Location&\"]\"))<>\"\"),0))/IF(AND(BF184<>\"\",i_Units=\"Imperial\"),CONVERT(BF184,\"m\",\"in\"),IF(AND(i_Units=\"Imperial\",BM184=\"Metre\"),39.37,IF(BF184<>\"\",BF184,1))),\"\")","v":""},""]
[null,null,null,null,null,null,null,null,null,null,null,null,null,null,null,null,null,null,null,null,null,null,null,null,null,null,null,null,null,null,null,null,null,null,null,null,null,null,null,null,null,null,null,null,null,null,null,null,null,"HIDE",null,null,null,null,null,null,null,null,null,null,null,null,null,null,null,null,null,null,""]
[null,null,{"$f":"C187","v":0},null,null,null,null,null,null,null,null,null,null,null,null,null,null,null,null,null,null,null,null,null,null,null,null,null,null,null,null,null,null,null,null,null,null,null,null,null,null,null,null,"",null,null,"",{"$f":"IF(ISNUMBER(FIND(\"x\",BD186)),IFERROR(INDEX(INDIRECT(\"T_FinishColour[ColourCode-\"&IF(ISNUMBER(FIND(\"xxx\",BD186)),\"xxx\",IF(ISNUMBER(FIND(\"xx\",BD186)),\"xx\",\"error\"))&AQ186&\"]\"),MATCH(AU186,T_FinishColour[Finish / Colour],0)),\"\"),\"\")","v":""},null,{"$f":"IF(AND(ISBLANK(BD186),ISBLANK(C186)),\"HIDE\",IF(PRODUCT(C186:Y186)=1,\"SHOW\",\"HIDE\"))","v":"HIDE"},null,null,null,"",null,null,null,null,null,null,{"$f":"IFERROR(IF(BG186=\"Y\",((INDEX(T_Deduc[Deduction],MATCH(BH186,T_Deduc[Type],0),0))),\"\"),\"\")","v":""},null,"",null,{"$f":"IFERROR(IF(ISBLANK(BB186),\"\",INDEX(T_NAV[Base Unit of Measure],MATCH(BB186,T_NAV[No.],0))),\"\")","v":""},null,"",{"$f":"IFERROR(INDEX(INDIRECT(\"T_NAV[\"&i_Location&\"]\"),MATCH(1,--(BB186=T_NAV[No.])*--((INDIRECT(\"T_NAV[\"&i_Location&\"]\"))<>\"\"),0))/IF(AND(BF186<>\"\",i_Units=\"Imperial\"),CONVERT(BF186,\"m\",\"in\"),IF(AND(i_Units=\"Imperial\",BM186=\"Metre\"),39.37,IF(BF186<>\"\",BF186,1))),\"\")","v":""},""]
[null,null,{"$f":"IF(SUM(E188:E216)>=1,1,0)","v":0},"i_WeightBar",null,"o_wbSpline",null,"i_wbSplineTape",null,"i_wbBallast",null,"i_wbAccessories",null,"i_wbAccessories",null,null,null,null,null,null,null,null,null,null,null,null,null,null,null,"",null,null,null,null,null,null,null,null,null,null,null,null,null,"",null,null,"",{"$f":"IF(ISNUMBER(FIND(\"x\",BD187)),IFERROR(INDEX(INDIRECT(\"T_FinishColour[ColourCode-\"&IF(ISNUMBER(FIND(\"xxx\",BD187)),\"xxx\",IF(ISNUMBER(FIND(\"xx\",BD187)),\"xx\",\"error\"))&AQ187&\"]\"),MATCH(AU187,T_FinishColour[Finish / Colour],0)),\"\"),\"\")","v":""},null,"HIDE",null,null,null,"BOTTOM RAIL",null,"BOTTOM RAIL",null,null,null,null,{"$f":"IFERROR(IF(BG187=\"Y\",((INDEX(T_Deduc[Deduction],MATCH(BH187,T_Deduc[Type],0),0))),\"\"),\"\")","v":""},null,"",null,{"$f":"IFERROR(IF(ISBLANK(BB187),\"\",INDEX(T_NAV[Base Unit of Measure],MATCH(BB187,T_NAV[No.],0))),\"\")","v":""},null,"",{"$f":"IFERROR(INDEX(INDIRECT(\"T_NAV[\"&i_Location&\"]\"),MATCH(1,--(BB187=T_NAV[No.])*--((INDIRECT(\"T_NAV[\"&i_Location&\"]\"))<>\"\"),0))/IF(AND(BF187<>\"\",i_Units=\"Imperial\"),CONVERT(BF187,\"m\",\"in\"),IF(AND(i_Units=\"Imperial\",BM187=\"Metre\"),39.37,IF(BF187<>\"\",BF187,1))),\"\")","v":""},""]
[null,null,null,"D30",{"$f":"IFERROR(IF(ISBLANK(D188),\"\",IF(FIND(D188,INDIRECT($D$187))>0,1,0)),0)","v":0},null,{"$f":"IFERROR(IF(ISBLANK(F188),\"\",IF(FIND(F188,INDIRECT($F$187))>0,1,0)),0)","v":""},null,{"$f":"IFERROR(IF(ISBLANK(H188),\"\",IF(FIND(H188,INDIRECT($H$187))>0,1,0)),0)","v":""},null,{"$f":"IFERROR(IF(ISBLANK(J188),\"\",IF(FIND(J188,INDIRECT($J$187))>0,1,0)),0)","v":""},null,{"$f":"IFERROR(IF(ISBLANK(L188),\"\",IF(FIND(L188,INDIRECT($L$187))>0,1,0)),0)","v":""},null,{"$f":"IFERROR(IF(ISBLANK(N188),\"\",IF(FIND(N188,INDIRECT($N$187))>0,1,0)),0)","v":""},null,null,null,null,null,null,null,null,null,null,"Y",null,null,null,"",null,null,null,"Anodised","White",null,null,null,null,null,null,null,"AU","Anodised",{"$f":"i_Colour","v":0},null,"Anodised",{"$f":"IF(ISNUMBER(FIND(\"x\",BD188)),IFERROR(INDEX(INDIRECT(\"T_FinishColour[ColourCode-\"&IF(ISNUMBER(FIND(\"xxx\",BD188)),\"xxx\",IF(ISNUMBER(FIND(\"xx\",BD188)),\"xx\",\"error\"))&AQ188&\"]\"),MATCH(AU188,T_FinishColour[Finish / Colour],0)),\"\"),\"\")","v":"020"},null,"HIDE",null,null,null,"RB91-1232-020580",null,"RB91-1232-xxxLLL","D30 SILENT Medium Bottom Rail",5.8,{"$f":"IF(ISBLANK(BL188),\"\",IF(OR(BL188=L_Units),\"Y\",\"N\"))","v":{"$error":"#N/A"}},"wb",{"$f":"IFERROR(IF(BG188=\"Y\",((INDEX(T_Deduc[Deduction],MATCH(BH188,T_Deduc[Type],0),0))),\"\"),\"\")","v":""},"i_Width","",{"$f":"INDEX(T_UnitSelection[Units],MATCH(i_Units,T_UnitSelection[UnitSelection],0))","v":{"$error":"#N/A"}},{"$f":"IFERROR(IF(ISBLANK(BB188),\"\",INDEX(T_NAV[Base Unit of Measure],MATCH(BB188,T_NAV[No.],0))),\"\")","v":"LENGTH"},1,1,{"$f":"IFERROR(INDEX(INDIRECT(\"T_NAV[\"&i_Location&\"]\"),MATCH(1,--(BB188=T_NAV[No.])*--((INDIRECT(\"T_NAV[\"&i_Location&\"]\"))<>\"\"),0))/IF(AND(BF188<>\"\",i_Units=\"Imperial\"),CONVERT(BF188,\"m\",\"in\"),IF(AND(i_Units=\"Imperial\",BM188=\"Metre\"),39.37,IF(BF188<>\"\",BF188,1))),\"\")","v":""},""]
[null,null,null,"D30",0,null,"",null,"",null,"",null,"",null,"",null,null,null,null,null,null,null,null,null,null,"Y",null,null,null,"",null,null,null,"White","Black","Sandstone","Silver Grey",null,null,null,null,null,"AU","White",0,null,"White",{"$f":"IF(ISNUMBER(FIND(\"x\",BD189)),IFERROR(INDEX(INDIRECT(\"T_FinishColour[ColourCode-\"&IF(ISNUMBER(FIND(\"xxx\",BD189)),\"xxx\",IF(ISNUMBER(FIND(\"xx\",BD189)),\"xx\",\"error\"))&AQ189&\"]\"),MATCH(AU189,T_FinishColour[Finish / Colour],0)),\"\"),\"\")","v":"069"},null,"HIDE",null,null,null,"RB91-2131-069002",null,"RB91-2131-xxx002","D30 Medium Bottom Rail End Caps LH & RH",null,{"$f":"IF(ISBLANK(BL189),\"\",IF(OR(BL189=L_Units),\"Y\",\"N\"))","v":"N"},null,{"$f":"IFERROR(IF(BG189=\"Y\",((INDEX(T_Deduc[Deduction],MATCH(BH189,T_Deduc[Type],0),0))),\"\"),\"\")","v":""},null,"","Set",{"$f":"IFERROR(IF(ISBLANK(BB189),\"\",INDEX(T_NAV[Base Unit of Measure],MATCH(BB189,T_NAV[No.],0))),\"\")","v":"PAIR"},1,1,{"$f":"IFERROR(INDEX(INDIRECT(\"T_NAV[\"&i_Location&\"]\"),MATCH(1,--(BB189=T_NAV[No.])*--((INDIRECT(\"T_NAV[\"&i_Location&\"]\"))<>\"\"),0))/IF(AND(BF189<>\"\",i_Units=\"Imperial\"),CONVERT(BF189,\"m\",\"in\"),IF(AND(i_Units=\"Imperial\",BM189=\"Metre\"),39.37,IF(BF189<>\"\",BF189,1))),\"\")","v":""},""]
[null,null,null,"Flat",0,null,"",null,"",null,"",null,"",null,"",null,null,null,null,null,null,null,null,null,null,"Y",null,null,null,"",null,null,null,"Anodised","White",null,null,null,null,null,null,null,"AU","Anodised",0,null,"Anodised",{"$f":"IF(ISNUMBER(FIND(\"x\",BD190)),IFERROR(INDEX(INDIRECT(\"T_FinishColour[ColourCode-\"&IF(ISNUMBER(FIND(\"xxx\",BD190)),\"xxx\",IF(ISNUMBER(FIND(\"xx\",BD190)),\"xx\",\"error\"))&AQ190&\"]\"),MATCH(AU190,T_FinishColour[Finish / Colour],0)),\"\"),\"\")","v":"020"},null,"HIDE",null,null,null,{"$f":"_xlfn.IFNA(SUBSTITUTE(IF(AQ190=\"AU\",SUBSTITUTE(BD190,\"xxx\",AV190),SUBSTITUTE(SUBSTITUTE(BD190,\"xx\",AV190),\"x\",\"\")),\"LLL\",\"480\"),BD190)","v":"RB91-1205-020480"},null,"RB91-1205-xxxLLL","Flat Aluminium Bottom Rail",4.8,{"$f":"IF(ISBLANK(BL190),\"\",IF(OR(BL190=L_Units),\"Y\",\"N\"))","v":{"$error":"#N/A"}},"wb",{"$f":"IFERROR(IF(BG190=\"Y\",((INDEX(T_Deduc[Deduction],MATCH(BH190,T_Deduc[Type],0),0))),\"\"),\"\")","v":""},"i_Width","",{"$f":"INDEX(T_UnitSelection[Units],MATCH(i_Units,T_UnitSelection[UnitSelection],0))","v":{"$error":"#N/A"}},{"$f":"IFERROR(IF(ISBLANK(BB190),\"\",INDEX(T_NAV[Base Unit of Measure],MATCH(BB190,T_NAV[No.],0))),\"\")","v":"LENGTH"},1,1,{"$f":"IFERROR(INDEX(INDIRECT(\"T_NAV[\"&i_Location&\"]\"),MATCH(1,--(BB190=T_NAV[No.])*--((INDIRECT(\"T_NAV[\"&i_Location&\"]\"))<>\"\"),0))/IF(AND(BF190<>\"\",i_Units=\"Imperial\"),CONVERT(BF190,\"m\",\"in\"),IF(AND(i_Units=\"Imperial\",BM190=\"Metre\"),39.37,IF(BF190<>\"\",BF190,1))),\"\")","v":""},""]
[null,null,null,"Flat",0,null,"",null,"",null,"",null,"",null,"",null,null,null,null,null,null,null,null,null,null,"Y",null,null,null,"",null,null,null,null,null,null,null,null,null,null,null,null,"AU","White",0,null,"White",{"$f":"IF(ISNUMBER(FIND(\"x\",BD191)),IFERROR(INDEX(INDIRECT(\"T_FinishColour[ColourCode-\"&IF(ISNUMBER(FIND(\"xxx\",BD191)),\"xxx\",IF(ISNUMBER(FIND(\"xx\",BD191)),\"xx\",\"error\"))&AQ191&\"]\"),MATCH(AU191,T_FinishColour[Finish / Colour],0)),\"\"),\"\")","v":"069"},null,"HIDE",null,null,null,{"$f":"_xlfn.IFNA(SUBSTITUTE(IF(AQ191=\"AU\",SUBSTITUTE(BD191,\"xxx\",AV191),SUBSTITUTE(SUBSTITUTE(BD191,\"xx\",AV191),\"x\",\"\")),\"LLL\",\"580\"),BD191)","v":"RB91-2105-069001"},null,"RB91-2105-xxx001","Flat Bottom Rail End Caps",null,{"$f":"IF(ISBLANK(BL191),\"\",IF(OR(BL191=L_Units),\"Y\",\"N\"))","v":"N"},null,{"$f":"IFERROR(IF(BG191=\"Y\",((INDEX(T_Deduc[Deduction],MATCH(BH191,T_Deduc[Type],0),0))),\"\"),\"\")","v":""},null,"","Set",{"$f":"IFERROR(IF(ISBLANK(BB191),\"\",INDEX(T_NAV[Base Unit of Measure],MATCH(BB191,T_NAV[No.],0))),\"\")","v":"PIECE"},1,1,{"$f":"IFERROR(INDEX(INDIRECT(\"T_NAV[\"&i_Location&\"]\"),MATCH(1,--(BB191=T_NAV[No.])*--((INDIRECT(\"T_NAV[\"&i_Location&\"]\"))<>\"\"),0))/IF(AND(BF191<>\"\",i_Units=\"Imperial\"),CONVERT(BF191,\"m\",\"in\"),IF(AND(i_Units=\"Imperial\",BM191=\"Metre\"),39.37,IF(BF191<>\"\",BF191,1))),\"\")","v":""},""]
[null,null,null,"F4115",0,null,"",null,"",null,"",null,"",null,"",null,null,null,null,null,null,null,null,null,null,"Y",null,null,null,"",null,null,null,"Anodised","White",null,null,null,null,null,null,null,"AU","Anodised",0,null,"Anodised",{"$f":"IF(ISNUMBER(FIND(\"x\",BD192)),IFERROR(INDEX(INDIRECT(\"T_FinishColour[ColourCode-\"&IF(ISNUMBER(FIND(\"xxx\",BD192)),\"xxx\",IF(ISNUMBER(FIND(\"xx\",BD192)),\"xx\",\"error\"))&AQ192&\"]\"),MATCH(AU192,T_FinishColour[Finish / Colour],0)),\"\"),\"\")","v":"020"},null,"HIDE",null,null,null,{"$f":"_xlfn.IFNA(SUBSTITUTE(IF(AQ192=\"AU\",SUBSTITUTE(BD192,\"xxx\",AV192),SUBSTITUTE(SUBSTITUTE(BD192,\"xx\",AV192),\"x\",\"\")),\"LLL\",\"580\"),BD192)","v":"SB06-0201-020580"},null,"SB06-0201-xxxLLL","F4115 Flat Heavy Duty Bottom Rail",5.8,{"$f":"IF(ISBLANK(BL192),\"\",IF(OR(BL192=L_Units),\"Y\",\"N\"))","v":{"$error":"#N/A"}},"wb",{"$f":"IFERROR(IF(BG192=\"Y\",((INDEX(T_Deduc[Deduction],MATCH(BH192,T_Deduc[Type],0),0))),\"\"),\"\")","v":""},"i_Width","",{"$f":"INDEX(T_UnitSelection[Units],MATCH(i_Units,T_UnitSelection[UnitSelection],0))","v":{"$error":"#N/A"}},{"$f":"IFERROR(IF(ISBLANK(BB192),\"\",INDEX(T_NAV[Base Unit of Measure],MATCH(BB192,T_NAV[No.],0))),\"\")","v":"LENGTH"},1,1,{"$f":"IFERROR(INDEX(INDIRECT(\"T_NAV[\"&i_Location&\"]\"),MATCH(1,--(BB192=T_NAV[No.])*--((INDIRECT(\"T_NAV[\"&i_Location&\"]\"))<>\"\"),0))/IF(AND(BF192<>\"\",i_Units=\"Imperial\"),CONVERT(BF192,\"m\",\"in\"),IF(AND(i_Units=\"Imperial\",BM192=\"Metre\"),39.37,IF(BF192<>\"\",BF192,1))),\"\")","v":""},""]
[null,null,null,"F4115",0,null,"",null,"",null,"",null,"",null,"",null,null,null,null,null,null,null,null,null,null,"Y",null,null,null,"",null,null,null,null,null,null,null,null,null,null,null,null,"AU","White",0,null,"White",{"$f":"IF(ISNUMBER(FIND(\"x\",BD193)),IFERROR(INDEX(INDIRECT(\"T_FinishColour[ColourCode-\"&IF(ISNUMBER(FIND(\"xxx\",BD193)),\"xxx\",IF(ISNUMBER(FIND(\"xx\",BD193)),\"xx\",\"error\"))&AQ193&\"]\"),MATCH(AU193,T_FinishColour[Finish / Colour],0)),\"\"),\"\")","v":"069"},null,"HIDE",null,null,null,{"$f":"_xlfn.IFNA(SUBSTITUTE(IF(AQ193=\"AU\",SUBSTITUTE(BD193,\"xxx\",AV193),SUBSTITUTE(SUBSTITUTE(BD193,\"xx\",AV193),\"x\",\"\")),\"LLL\",\"580\"),BD193)","v":"SB06-0210-069000"},null,"SB06-0210-xxx000","F4115 Flat Heavy Duty End Cap",null,{"$f":"IF(ISBLANK(BL193),\"\",IF(OR(BL193=L_Units),\"Y\",\"N\"))","v":"N"},null,{"$f":"IFERROR(IF(BG193=\"Y\",((INDEX(T_Deduc[Deduction],MATCH(BH193,T_Deduc[Type],0),0))),\"\"),\"\")","v":""},null,"","Set",{"$f":"IFERROR(IF(ISBLANK(BB193),\"\",INDEX(T_NAV[Base Unit of Measure],MATCH(BB193,T_NAV[No.],0))),\"\")","v":"PIECE"},1,1,{"$f":"IFERROR(INDEX(INDIRECT(\"T_NAV[\"&i_Location&\"]\"),MATCH(1,--(BB193=T_NAV[No.])*--((INDIRECT(\"T_NAV[\"&i_Location&\"]\"))<>\"\"),0))/IF(AND(BF193<>\"\",i_Units=\"Imperial\"),CONVERT(BF193,\"m\",\"in\"),IF(AND(i_Units=\"Imperial\",BM193=\"Metre\"),39.37,IF(BF193<>\"\",BF193,1))),\"\")","v":""},""]
[null,null,null,"Oval",0,null,"",null,"",null,"",null,"",null,"",null,null,null,null,null,null,null,null,null,null,"Y",null,null,null,"",null,null,null,"Anodised","White",null,null,null,null,null,null,null,"AU","Anodised",0,null,"Anodised",{"$f":"IF(ISNUMBER(FIND(\"x\",BD194)),IFERROR(INDEX(INDIRECT(\"T_FinishColour[ColourCode-\"&IF(ISNUMBER(FIND(\"xxx\",BD194)),\"xxx\",IF(ISNUMBER(FIND(\"xx\",BD194)),\"xx\",\"error\"))&AQ194&\"]\"),MATCH(AU194,T_FinishColour[Finish / Colour],0)),\"\"),\"\")","v":"020"},null,"HIDE",null,null,null,{"$f":"_xlfn.IFNA(SUBSTITUTE(IF(AQ194=\"AU\",SUBSTITUTE(BD194,\"xxx\",AV194),SUBSTITUTE(SUBSTITUTE(BD194,\"xx\",AV194),\"x\",\"\")),\"LLL\",\"480\"),BD194)","v":"RB91-1226-020480"},null,"RB91-1226-xxxLLL","Oval Aluminium Bottom Rail",4.8,{"$f":"IF(ISBLANK(BL194),\"\",IF(OR(BL194=L_Units),\"Y\",\"N\"))","v":{"$error":"#N/A"}},"wb",{"$f":"IFERROR(IF(BG194=\"Y\",((INDEX(T_Deduc[Deduction],MATCH(BH194,T_Deduc[Type],0),0))),\"\"),\"\")","v":""},"i_Width","",{"$f":"INDEX(T_UnitSelection[Units],MATCH(i_Units,T_UnitSelection[UnitSelection],0))","v":{"$error":"#N/A"}},{"$f":"IFERROR(IF(ISBLANK(BB194),\"\",INDEX(T_NAV[Base Unit of Measure],MATCH(BB194,T_NAV[No.],0))),\"\")","v":"LENGTH"},1,1,{"$f":"IFERROR(INDEX(INDIRECT(\"T_NAV[\"&i_Location&\"]\"),MATCH(1,--(BB194=T_NAV[No.])*--((INDIRECT(\"T_NAV[\"&i_Location&\"]\"))<>\"\"),0))/IF(AND(BF194<>\"\",i_Units=\"Imperial\"),CONVERT(BF194,\"m\",\"in\"),IF(AND(i_Units=\"Imperial\",BM194=\"Metre\"),39.37,IF(BF194<>\"\",BF194,1))),\"\")","v":""},""]
[null,null,null,"Oval",0,null,"",null,"",null,"",null,"",null,"",null,null,null,null,null,null,null,null,null,null,"Y",null,null,null,"",null,null,null,"Silver Grey","White",null,null,null,null,null,null,null,"AU","Silver Grey",0,null,"Silver Grey",{"$f":"IF(ISNUMBER(FIND(\"x\",BD195)),IFERROR(INDEX(INDIRECT(\"T_FinishColour[ColourCode-\"&IF(ISNUMBER(FIND(\"xxx\",BD195)),\"xxx\",IF(ISNUMBER(FIND(\"xx\",BD195)),\"xx\",\"error\"))&AQ195&\"]\"),MATCH(AU195,T_FinishColour[Finish / Colour],0)),\"\"),\"\")","v":"338"},null,"HIDE",null,null,null,{"$f":"_xlfn.IFNA(SUBSTITUTE(IF(AQ195=\"AU\",SUBSTITUTE(BD195,\"xxx\",AV195),SUBSTITUTE(SUBSTITUTE(BD195,\"xx\",AV195),\"x\",\"\")),\"LLL\",\"580\"),BD195)","v":"RB91-2126-338001"},null,"RB91-2126-xxx001","Oval Bottom Rail End Cap",null,{"$f":"IF(ISBLANK(BL195),\"\",IF(OR(BL195=L_Units),\"Y\",\"N\"))","v":"N"},null,{"$f":"IFERROR(IF(BG195=\"Y\",((INDEX(T_Deduc[Deduction],MATCH(BH195,T_Deduc[Type],0),0))),\"\"),\"\")","v":""},null,"","Set",{"$f":"IFERROR(IF(ISBLANK(BB195),\"\",INDEX(T_NAV[Base Unit of Measure],MATCH(BB195,T_NAV[No.],0))),\"\")","v":"PIECE"},1,1,{"$f":"IFERROR(INDEX(INDIRECT(\"T_NAV[\"&i_Location&\"]\"),MATCH(1,--(BB195=T_NAV[No.])*--((INDIRECT(\"T_NAV[\"&i_Location&\"]\"))<>\"\"),0))/IF(AND(BF195<>\"\",i_Units=\"Imperial\"),CONVERT(BF195,\"m\",\"in\"),IF(AND(i_Units=\"Imperial\",BM195=\"Metre\"),39.37,IF(BF195<>\"\",BF195,1))),\"\")","v":""},""]
[null,null,null,"Round",0,null,"",null,"",null,"",null,"",null,"",null,null,null,null,null,null,null,null,null,null,"Y",null,null,null,"",null,null,null,"Anodised","White",null,null,null,null,null,null,null,"AU","Anodised",0,null,"Anodised",{"$f":"IF(ISNUMBER(FIND(\"x\",BD196)),IFERROR(INDEX(INDIRECT(\"T_FinishColour[ColourCode-\"&IF(ISNUMBER(FIND(\"xxx\",BD196)),\"xxx\",IF(ISNUMBER(FIND(\"xx\",BD196)),\"xx\",\"error\"))&AQ196&\"]\"),MATCH(AU196,T_FinishColour[Finish / Colour],0)),\"\"),\"\")","v":"020"},null,"HIDE",null,null,null,{"$f":"_xlfn.IFNA(SUBSTITUTE(IF(AQ196=\"AU\",SUBSTITUTE(BD196,\"xxx\",AV196),SUBSTITUTE(SUBSTITUTE(BD196,\"xx\",AV196),\"x\",\"\")),\"LLL\",\"580\"),BD196)","v":"RB91-1203-020580"},null,"RB91-1203-xxxLLL","Round Aluminium Bottom Rail",5.8,{"$f":"IF(ISBLANK(BL196),\"\",IF(OR(BL196=L_Units),\"Y\",\"N\"))","v":{"$error":"#N/A"}},"wb",{"$f":"IFERROR(IF(BG196=\"Y\",((INDEX(T_Deduc[Deduction],MATCH(BH196,T_Deduc[Type],0),0))),\"\"),\"\")","v":""},"i_Width","",{"$f":"INDEX(T_UnitSelection[Units],MATCH(i_Units,T_UnitSelection[UnitSelection],0))","v":{"$error":"#N/A"}},{"$f":"IFERROR(IF(ISBLANK(BB196),\"\",INDEX(T_NAV[Base Unit of Measure],MATCH(BB196,T_NAV[No.],0))),\"\")","v":"LENGTH"},1,1,{"$f":"IFERROR(INDEX(INDIRECT(\"T_NAV[\"&i_Location&\"]\"),MATCH(1,--(BB196=T_NAV[No.])*--((INDIRECT(\"T_NAV[\"&i_Location&\"]\"))<>\"\"),0))/IF(AND(BF196<>\"\",i_Units=\"Imperial\"),CONVERT(BF196,\"m\",\"in\"),IF(AND(i_Units=\"Imperial\",BM196=\"Metre\"),39.37,IF(BF196<>\"\",BF196,1))),\"\")","v":""},""]
[null,null,null,"Round",0,null,"",null,"",null,"",null,"",null,"",null,null,null,null,null,null,null,null,null,null,"Y",null,null,null,"",null,null,null,null,null,null,null,null,null,null,null,null,"AU","White",0,null,"White",{"$f":"IF(ISNUMBER(FIND(\"x\",BD197)),IFERROR(INDEX(INDIRECT(\"T_FinishColour[ColourCode-\"&IF(ISNUMBER(FIND(\"xxx\",BD197)),\"xxx\",IF(ISNUMBER(FIND(\"xx\",BD197)),\"xx\",\"error\"))&AQ197&\"]\"),MATCH(AU197,T_FinishColour[Finish / Colour],0)),\"\"),\"\")","v":"069"},null,"HIDE",null,null,null,{"$f":"_xlfn.IFNA(SUBSTITUTE(IF(AQ197=\"AU\",SUBSTITUTE(BD197,\"xxx\",AV197),SUBSTITUTE(SUBSTITUTE(BD197,\"xx\",AV197),\"x\",\"\")),\"LLL\",\"580\"),BD197)","v":"RB91-2104-069022"},null,"RB91-2104-xxx022","Round Slimline Bottom Rail End Cap",null,{"$f":"IF(ISBLANK(BL197),\"\",IF(OR(BL197=L_Units),\"Y\",\"N\"))","v":"N"},null,{"$f":"IFERROR(IF(BG197=\"Y\",((INDEX(T_Deduc[Deduction],MATCH(BH197,T_Deduc[Type],0),0))),\"\"),\"\")","v":""},null,"","Set",{"$f":"IFERROR(IF(ISBLANK(BB197),\"\",INDEX(T_NAV[Base Unit of Measure],MATCH(BB197,T_NAV[No.],0))),\"\")","v":"PIECE"},1,1,{"$f":"IFERROR(INDEX(INDIRECT(\"T_NAV[\"&i_Location&\"]\"),MATCH(1,--(BB197=T_NAV[No.])*--((INDIRECT(\"T_NAV[\"&i_Location&\"]\"))<>\"\"),0))/IF(AND(BF197<>\"\",i_Units=\"Imperial\"),CONVERT(BF197,\"m\",\"in\"),IF(AND(i_Units=\"Imperial\",BM197=\"Metre\"),39.37,IF(BF197<>\"\",BF197,1))),\"\")","v":""},""]
[null,null,null,"Mini",0,null,"",null,"",null,"",null,"",null,"",null,null,null,null,null,null,null,null,null,null,"Y",null,null,null,"",null,null,null,"Mill","Anodised","Black",null,null,null,null,null,null,"AU","Mill",0,null,"Mill",{"$f":"IF(ISNUMBER(FIND(\"x\",BD198)),IFERROR(INDEX(INDIRECT(\"T_FinishColour[ColourCode-\"&IF(ISNUMBER(FIND(\"xxx\",BD198)),\"xxx\",IF(ISNUMBER(FIND(\"xx\",BD198)),\"xx\",\"error\"))&AQ198&\"]\"),MATCH(AU198,T_FinishColour[Finish / Colour],0)),\"\"),\"\")","v":"000"},null,"HIDE",null,null,null,{"$f":"_xlfn.IFNA(SUBSTITUTE(IF(AQ198=\"AU\",SUBSTITUTE(BD198,\"xxx\",AV198),SUBSTITUTE(SUBSTITUTE(BD198,\"xx\",AV198),\"x\",\"\")),\"LLL\",\"430\"),BD198)","v":"RB91-1215-000430"},null,"RB91-1215-xxxLLL","Mini Aluminium Bottom Rail",4.3,{"$f":"IF(ISBLANK(BL198),\"\",IF(OR(BL198=L_Units),\"Y\",\"N\"))","v":{"$error":"#N/A"}},"wb",{"$f":"IFERROR(IF(BG198=\"Y\",((INDEX(T_Deduc[Deduction],MATCH(BH198,T_Deduc[Type],0),0))),\"\"),\"\")","v":""},"i_Width","",{"$f":"INDEX(T_UnitSelection[Units],MATCH(i_Units,T_UnitSelection[UnitSelection],0))","v":{"$error":"#N/A"}},{"$f":"IFERROR(IF(ISBLANK(BB198),\"\",INDEX(T_NAV[Base Unit of Measure],MATCH(BB198,T_NAV[No.],0))),\"\")","v":""},1,1,{"$f":"IFERROR(INDEX(INDIRECT(\"T_NAV[\"&i_Location&\"]\"),MATCH(1,--(BB198=T_NAV[No.])*--((INDIRECT(\"T_NAV[\"&i_Location&\"]\"))<>\"\"),0))/IF(AND(BF198<>\"\",i_Units=\"Imperial\"),CONVERT(BF198,\"m\",\"in\"),IF(AND(i_Units=\"Imperial\",BM198=\"Metre\"),39.37,IF(BF198<>\"\",BF198,1))),\"\")","v":""},""]
[null,null,null,"Mini",0,null,"",null,"",null,"",null,"",null,"",null,null,null,null,null,null,null,null,null,null,"Y",null,null,null,"",null,null,null,"Barley",283,"330/340???",null,null,null,null,null,null,"AU","Barley",0,null,"Barley",{"$f":"IF(ISNUMBER(FIND(\"x\",BD199)),IFERROR(INDEX(INDIRECT(\"T_FinishColour[ColourCode-\"&IF(ISNUMBER(FIND(\"xxx\",BD199)),\"xxx\",IF(ISNUMBER(FIND(\"xx\",BD199)),\"xx\",\"error\"))&AQ199&\"]\"),MATCH(AU199,T_FinishColour[Finish / Colour],0)),\"\"),\"\")","v":"283"},null,"HIDE",null,null,null,{"$f":"_xlfn.IFNA(SUBSTITUTE(IF(AQ199=\"AU\",SUBSTITUTE(BD199,\"xxx\",AV199),SUBSTITUTE(SUBSTITUTE(BD199,\"xx\",AV199),\"x\",\"\")),\"LLL\",\"580\"),BD199)","v":"RB91-2115-283002"},null,"RB91-2115-xxx002","Mini Bottom Rail End Cap",null,{"$f":"IF(ISBLANK(BL199),\"\",IF(OR(BL199=L_Units),\"Y\",\"N\"))","v":"N"},null,{"$f":"IFERROR(IF(BG199=\"Y\",((INDEX(T_Deduc[Deduction],MATCH(BH199,T_Deduc[Type],0),0))),\"\"),\"\")","v":""},null,"","Set",{"$f":"IFERROR(IF(ISBLANK(BB199),\"\",INDEX(T_NAV[Base Unit of Measure],MATCH(BB199,T_NAV[No.],0))),\"\")","v":""},1,1,{"$f":"IFERROR(INDEX(INDIRECT(\"T_NAV[\"&i_Location&\"]\"),MATCH(1,--(BB199=T_NAV[No.])*--((INDIRECT(\"T_NAV[\"&i_Location&\"]\"))<>\"\"),0))/IF(AND(BF199<>\"\",i_Units=\"Imperial\"),CONVERT(BF199,\"m\",\"in\"),IF(AND(i_Units=\"Imperial\",BM199=\"Metre\"),39.37,IF(BF199<>\"\",BF199,1))),\"\")","v":""},""]
[null,null,null,"HB16",0,null,null,null,null,null,null,null,null,null,null,null,null,null,null,null,null,null,null,null,null,"Y",null,null,null,null,null,null,null,"White","Anodised","Mill","Black","Brown","Vanilla",null,null,null,"US","White",0,null,"White",{"$f":"IF(ISNUMBER(FIND(\"x\",BD200)),IFERROR(INDEX(INDIRECT(\"T_FinishColour[ColourCode-\"&IF(ISNUMBER(FIND(\"xxx\",BD200)),\"xxx\",IF(ISNUMBER(FIND(\"xx\",BD200)),\"xx\",\"error\"))&AQ200&\"]\"),MATCH(AU200,T_FinishColour[Finish / Colour],0)),\"\"),\"\")","v":"W"},null,"HIDE",null,null,null,"HB16W",null,"HB16xx","External Hem Bar",4.8,{"$f":"IF(ISBLANK(BL200),\"\",IF(OR(BL200=L_Units),\"Y\",\"N\"))","v":{"$error":"#N/A"}},"wb",{"$f":"IFERROR(IF(BG200=\"Y\",((INDEX(T_Deduc[Deduction],MATCH(BH200,T_Deduc[Type],0),0))),\"\"),\"\")","v":""},"i_Width","",{"$f":"INDEX(T_UnitSelection[Units],MATCH(i_Units,T_UnitSelection[UnitSelection],0))","v":{"$error":"#N/A"}},"LENGTH",1,1,{"$f":"IFERROR(INDEX(INDIRECT(\"T_NAV[\"&i_Location&\"]\"),MATCH(1,--(BB200=T_NAV[No.])*--((INDIRECT(\"T_NAV[\"&i_Location&\"]\"))<>\"\"),0))/IF(AND(BF200<>\"\",i_Units=\"Imperial\"),CONVERT(BF200,\"m\",\"in\"),IF(AND(i_Units=\"Imperial\",BM200=\"Metre\"),39.37,IF(BF200<>\"\",BF200,1))),\"\")","v":""},""]
[null,null,null,"HB16",0,null,null,null,null,null,null,null,null,null,null,null,null,null,null,null,null,null,null,null,null,"Y",null,null,null,null,null,null,null,"White",null,null,"Black","Brown","Vanilla","Gray",null,null,"US","White",0,null,"White",{"$f":"IF(ISNUMBER(FIND(\"x\",BD201)),IFERROR(INDEX(INDIRECT(\"T_FinishColour[ColourCode-\"&IF(ISNUMBER(FIND(\"xxx\",BD201)),\"xxx\",IF(ISNUMBER(FIND(\"xx\",BD201)),\"xx\",\"error\"))&AQ201&\"]\"),MATCH(AU201,T_FinishColour[Finish / Colour],0)),\"\"),\"\")","v":"W"},null,"HIDE",null,null,null,"HBECW",null,"HBECxx","External Hem Bar End Cap with Screw",null,{"$f":"IF(ISBLANK(BL201),\"\",IF(OR(BL201=L_Units),\"Y\",\"N\"))","v":"N"},null,{"$f":"IFERROR(IF(BG201=\"Y\",((INDEX(T_Deduc[Deduction],MATCH(BH201,T_Deduc[Type],0),0))),\"\"),\"\")","v":""},null,"","Piece",{"$f":"IFERROR(IF(ISBLANK(BB201),\"\",INDEX(T_NAV[Base Unit of Measure],MATCH(BB201,T_NAV[No.],0))),\"\")","v":""},2,2,{"$f":"IFERROR(INDEX(INDIRECT(\"T_NAV[\"&i_Location&\"]\"),MATCH(1,--(BB201=T_NAV[No.])*--((INDIRECT(\"T_NAV[\"&i_Location&\"]\"))<>\"\"),0))/IF(AND(BF201<>\"\",i_Units=\"Imperial\"),CONVERT(BF201,\"m\",\"in\"),IF(AND(i_Units=\"Imperial\",BM201=\"Metre\"),39.37,IF(BF201<>\"\",BF201,1))),\"\")","v":""},""]
[null,null,null,"HB16",0,null,null,null,null,null,null,null,null,null,null,null,null,null,null,null,null,null,null,null,null,"Y",null,null,null,null,null,null,null,null,null,null,null,null,null,null,null,null,null,null,null,null,null,null,null,"HIDE",null,null,null,"HBIS",null,"HBIS","Hem Bar Insert",90,"Y","wb",{"$f":"IFERROR(IF(BG202=\"Y\",((INDEX(T_Deduc[Deduction],MATCH(BH202,T_Deduc[Type],0),0))),\"\"),\"\")","v":""},"i_Width","",{"$f":"INDEX(T_UnitSelection[Units],MATCH(i_Units,T_UnitSelection[UnitSelection],0))","v":{"$error":"#N/A"}},"LENGTH",1,1,{"$f":"IFERROR(INDEX(INDIRECT(\"T_NAV[\"&i_Location&\"]\"),MATCH(1,--(BB202=T_NAV[No.])*--((INDIRECT(\"T_NAV[\"&i_Location&\"]\"))<>\"\"),0))/IF(AND(BF202<>\"\",i_Units=\"Imperial\"),CONVERT(BF202,\"m\",\"in\"),IF(AND(i_Units=\"Imperial\",BM202=\"Metre\"),39.37,IF(BF202<>\"\",BF202,1))),\"\")","v":""},""]
[null,null,null,"Internal",0,null,null,null,null,null,null,null,null,null,null,null,null,null,null,null,null,null,null,null,null,"Y",null,null,null,null,null,null,null,null,null,null,null,null,null,null,null,null,null,null,null,null,null,null,null,"HIDE",null,null,null,"RCBIHB16",null,"RCBIHB16","Internal Hem Bar",4.8,"Y","wb",{"$f":"IFERROR(IF(BG203=\"Y\",((INDEX(T_Deduc[Deduction],MATCH(BH203,T_Deduc[Type],0),0))),\"\"),\"\")","v":""},"i_Width",{"$f":"IFERROR(IF(BG203=\"Y\",(INDIRECT(BJ203)-BI203)/IF(Z203=\"\",1,o_nScreens),\"\"),\"\")","v":""},{"$f":"INDEX(T_UnitSelection[Units],MATCH(i_Units,T_UnitSelection[UnitSelection],0))","v":{"$error":"#N/A"}},"LENGTH",1,{"$f":"IF(ISBLANK(BN203),\"\",PRODUCT(AD203,BN203,ShadeQuantity))","v":1},{"$f":"IFERROR(INDEX(INDIRECT(\"T_NAV[\"&i_Location&\"]\"),MATCH(1,--(BB203=T_NAV[No.])*--((INDIRECT(\"T_NAV[\"&i_Location&\"]\"))<>\"\"),0))/IF(AND(BF203<>\"\",i_Units=\"Imperial\"),CONVERT(BF203,\"m\",\"in\"),IF(AND(i_Units=\"Imperial\",BM203=\"Metre\"),39.37,IF(BF203<>\"\",BF203,1))),\"\")","v":""},""]
[null,null,null,"Fabric Wrap",{"$f":"IFERROR(IF(ISBLANK(D204),\"\",IF(FIND(D204,INDIRECT($D$187))>0,1,0)),0)","v":0},null,null,null,null,null,null,null,null,null,null,null,null,null,null,null,null,null,null,null,null,"Y",null,null,null,null,null,null,null,"White","Black","Sandstone","Silver Grey",null,null,null,null,null,"AU",{"$f":"IF(ISNUMBER(FIND(\"x\",BD204)),IFERROR(INDEX(AH204:AP204,0,MATCH(AS204,AH204:AP204,0)),IF(AH204<>\"\",AH204,i_DefaultColour)),\"\")","v":"White"},{"$f":"i_Colour","v":0},null,{"$f":"IF(ISNUMBER(FIND(\"x\",BD204)),IFERROR(INDEX(AH204:AP204,0,MATCH(AS204,AH204:AP204,0)),AR204),\"\")","v":"White"},{"$f":"IF(ISNUMBER(FIND(\"x\",BD204)),IFERROR(INDEX(INDIRECT(\"T_FinishColour[ColourCode-\"&IF(ISNUMBER(FIND(\"xxx\",BD204)),\"xxx\",IF(ISNUMBER(FIND(\"xx\",BD204)),\"xx\",\"error\"))&AQ204&\"]\"),MATCH(AU204,T_FinishColour[Finish / Colour],0)),\"\"),\"\")","v":"069"},null,"HIDE",null,null,null,{"$f":"_xlfn.IFNA(SUBSTITUTE(IF(AQ204=\"AU\",SUBSTITUTE(BD204,\"xxx\",AV204),SUBSTITUTE(SUBSTITUTE(BD204,\"xx\",AV204),\"x\",\"\")),\"LLL\",\"580\"),BD204)","v":"RB91-1236-069490"},null,"RB91-1236-xxx490","Fabric Wrap Hem Bar 16'",4.9000000000000004,"Y","wb",{"$f":"IFERROR(IF(BG204=\"Y\",((INDEX(T_Deduc[Deduction],MATCH(BH204,T_Deduc[Type],0),0))),\"\"),\"\")","v":""},"i_Width",{"$f":"IFERROR(IF(BG204=\"Y\",(INDIRECT(BJ204)-BI204)/IF(Z204=\"\",1,o_nScreens),\"\"),\"\")","v":""},{"$f":"INDEX(T_UnitSelection[Units],MATCH(i_Units,T_UnitSelection[UnitSelection],0))","v":{"$error":"#N/A"}},"LENGTH",1,{"$f":"IF(ISBLANK(BN204),\"\",PRODUCT(AD204,BN204,ShadeQuantity))","v":1},{"$f":"IFERROR(INDEX(INDIRECT(\"T_NAV[\"&i_Location&\"]\"),MATCH(1,--(BB204=T_NAV[No.])*--((INDIRECT(\"T_NAV[\"&i_Location&\"]\"))<>\"\"),0))/IF(AND(BF204<>\"\",i_Units=\"Imperial\"),CONVERT(BF204,\"m\",\"in\"),IF(AND(i_Units=\"Imperial\",BM204=\"Metre\"),39.37,IF(BF204<>\"\",BF204,1))),\"\")","v":""},{"$f":"IF(AND(AX204=\"SHOW\",BP204<>\"\"),BP204*BO204*IF(AND(BK204<>\"\",OR(BM204=\"LENGTH\",BM204=\"METRE\",BM204=\"ROLL\")),IF(BK204=\"^\",INDIRECT(BJ204),(INDIRECT(BJ204)-BI204))/IF(i_Units=\"Metric\",1000,1),1),\"\")","v":""}]
[null,null,null,"Fabric Wrap",{"$f":"IFERROR(IF(ISBLANK(D205),\"\",IF(FIND(D205,INDIRECT($D$187))>0,1,0)),0)","v":0},null,{"$f":"IFERROR(IF(ISBLANK(F205),\"\",IF(FIND(F205,INDIRECT($F$187))>0,1,0)),0)","v":""},null,{"$f":"IFERROR(IF(ISBLANK(H205),\"\",IF(FIND(H205,INDIRECT($H$187))>0,1,0)),0)","v":""},null,{"$f":"IFERROR(IF(ISBLANK(J205),\"\",IF(FIND(J205,INDIRECT($J$187))>0,1,0)),0)","v":""},null,{"$f":"IFERROR(IF(ISBLANK(L205),\"\",IF(FIND(L205,INDIRECT($L$187))>0,1,0)),0)","v":""},null,{"$f":"IFERROR(IF(ISBLANK(N205),\"\",IF(FIND(N205,INDIRECT($N$187))>0,1,0)),0)","v":""},null,null,null,null,null,null,null,null,null,null,"Y",null,null,null,{"$f":"IFERROR(IF(AND(o_nScreens>1,Z205=\"Y\",PRODUCT(AA205:AC205)=0),o_nScreens,IF(PRODUCT(AA205:AC205)=0,\"\",PRODUCT(AA205:AC205))),\"\")","v":""},null,null,null,"White","Black","Sandstone","Silver Grey",null,null,null,null,null,"AU",{"$f":"IF(ISNUMBER(FIND(\"x\",BD205)),IFERROR(INDEX(AH205:AP205,0,MATCH(AS205,AH205:AP205,0)),IF(AH205<>\"\",AH205,i_DefaultColour)),\"\")","v":"White"},0,null,{"$f":"IF(ISNUMBER(FIND(\"x\",BD205)),IFERROR(INDEX(AH205:AP205,0,MATCH(AS205,AH205:AP205,0)),AR205),\"\")","v":"White"},{"$f":"IF(ISNUMBER(FIND(\"x\",BD205)),IFERROR(INDEX(INDIRECT(\"T_FinishColour[ColourCode-\"&IF(ISNUMBER(FIND(\"xxx\",BD205)),\"xxx\",IF(ISNUMBER(FIND(\"xx\",BD205)),\"xx\",\"error\"))&AQ205&\"]\"),MATCH(AU205,T_FinishColour[Finish / Colour],0)),\"\"),\"\")","v":"069"},null,"HIDE",null,null,null,{"$f":"_xlfn.IFNA(SUBSTITUTE(IF(AQ205=\"AU\",SUBSTITUTE(BD205,\"xxx\",AV205),SUBSTITUTE(SUBSTITUTE(BD205,\"xx\",AV205),\"x\",\"\")),\"LLL\",\"580\"),BD205)","v":"RB91-2136-069001"},null,"RB91-2136-xxx001","Fabric Wrap Hem Bar End Cap",null,{"$f":"IF(ISBLANK(BL205),\"\",IF(OR(BL205=L_Units),\"Y\",\"N\"))","v":"N"},null,{"$f":"IFERROR(IF(BG205=\"Y\",((INDEX(T_Deduc[Deduction],MATCH(BH205,T_Deduc[Type],0),0))),\"\"),\"\")","v":""},null,{"$f":"IFERROR(IF(BG205=\"Y\",(INDIRECT(BJ205)-BI205)/IF(Z205=\"\",1,o_nScreens),\"\"),\"\")","v":""},"Piece",{"$f":"IFERROR(IF(ISBLANK(BB205),\"\",INDEX(T_NAV[Base Unit of Measure],MATCH(BB205,T_NAV[No.],0))),\"\")","v":""},2,{"$f":"IF(ISBLANK(BN205),\"\",PRODUCT(AD205,BN205,ShadeQuantity))","v":2},{"$f":"IFERROR(INDEX(INDIRECT(\"T_NAV[\"&i_Location&\"]\"),MATCH(1,--(BB205=T_NAV[No.])*--((INDIRECT(\"T_NAV[\"&i_Location&\"]\"))<>\"\"),0))/IF(AND(BF205<>\"\",i_Units=\"Imperial\"),CONVERT(BF205,\"m\",\"in\"),IF(AND(i_Units=\"Imperial\",BM205=\"Metre\"),39.37,IF(BF205<>\"\",BF205,1))),\"\")","v":""},{"$f":"IF(AND(AX205=\"SHOW\",BP205<>\"\"),BP205*BO205*IF(AND(BK205<>\"\",OR(BM205=\"LENGTH\",BM205=\"METRE\",BM205=\"ROLL\")),IF(BK205=\"^\",INDIRECT(BJ205),(INDIRECT(BJ205)-BI205))/IF(i_Units=\"Metric\",1000,1),1),\"\")","v":""}]
[null,null,null,"Fabric Wrap",{"$f":"IFERROR(IF(ISBLANK(D206),\"\",IF(FIND(D206,INDIRECT($D$187))>0,1,0)),0)","v":0},null,{"$f":"IFERROR(IF(ISBLANK(F206),\"\",IF(FIND(F206,INDIRECT($F$187))>0,1,0)),0)","v":""},null,{"$f":"IFERROR(IF(ISBLANK(H206),\"\",IF(FIND(H206,INDIRECT($H$187))>0,1,0)),0)","v":""},null,{"$f":"IFERROR(IF(ISBLANK(J206),\"\",IF(FIND(J206,INDIRECT($J$187))>0,1,0)),0)","v":""},"Handle",{"$f":"IFERROR(IF(ISBLANK(L206),\"\",IF(FIND(L206,INDIRECT($L$187))>0,1,0)),0)","v":0},null,{"$f":"IFERROR(IF(ISBLANK(N206),\"\",IF(FIND(N206,INDIRECT($N$187))>0,1,0)),0)","v":""},null,null,null,null,null,null,null,null,null,null,"Y",null,null,null,{"$f":"IFERROR(IF(AND(o_nScreens>1,Z206=\"Y\",PRODUCT(AA206:AC206)=0),o_nScreens,IF(PRODUCT(AA206:AC206)=0,\"\",PRODUCT(AA206:AC206))),\"\")","v":""},null,null,null,"White","Black","Sandstone","Silver Grey",null,null,null,null,null,"AU",{"$f":"IF(ISNUMBER(FIND(\"x\",BD206)),IFERROR(INDEX(AH206:AP206,0,MATCH(AS206,AH206:AP206,0)),IF(AH206<>\"\",AH206,i_DefaultColour)),\"\")","v":""},0,null,{"$f":"IF(ISNUMBER(FIND(\"x\",BD206)),IFERROR(INDEX(AH206:AP206,0,MATCH(AS206,AH206:AP206,0)),AR206),\"\")","v":""},{"$f":"IF(ISNUMBER(FIND(\"x\",BD206)),IFERROR(INDEX(INDIRECT(\"T_FinishColour[ColourCode-\"&IF(ISNUMBER(FIND(\"xxx\",BD206)),\"xxx\",IF(ISNUMBER(FIND(\"xx\",BD206)),\"xx\",\"error\"))&AQ206&\"]\"),MATCH(AU206,T_FinishColour[Finish / Colour],0)),\"\"),\"\")","v":""},null,"HIDE",null,null,null,{"$f":"_xlfn.IFNA(SUBSTITUTE(IF(AQ206=\"AU\",SUBSTITUTE(BD206,\"xxx\",AV206),SUBSTITUTE(SUBSTITUTE(BD206,\"xx\",AV206),\"x\",\"\")),\"LLL\",\"580\"),BD206)","v":"RB91-2336-001000"},null,"RB91-2336-001000","Fabric Wrap Hem Bar Handle",null,{"$f":"IF(ISBLANK(BL206),\"\",IF(OR(BL206=L_Units),\"Y\",\"N\"))","v":"N"},null,{"$f":"IFERROR(IF(BG206=\"Y\",((INDEX(T_Deduc[Deduction],MATCH(BH206,T_Deduc[Type],0),0))),\"\"),\"\")","v":""},null,{"$f":"IFERROR(IF(BG206=\"Y\",(INDIRECT(BJ206)-BI206)/IF(Z206=\"\",1,o_nScreens),\"\"),\"\")","v":""},"Set",{"$f":"IFERROR(IF(ISBLANK(BB206),\"\",INDEX(T_NAV[Base Unit of Measure],MATCH(BB206,T_NAV[No.],0))),\"\")","v":""},1,{"$f":"IF(ISBLANK(BN206),\"\",PRODUCT(AD206,BN206,ShadeQuantity))","v":1},{"$f":"IFERROR(INDEX(INDIRECT(\"T_NAV[\"&i_Location&\"]\"),MATCH(1,--(BB206=T_NAV[No.])*--((INDIRECT(\"T_NAV[\"&i_Location&\"]\"))<>\"\"),0))/IF(AND(BF206<>\"\",i_Units=\"Imperial\"),CONVERT(BF206,\"m\",\"in\"),IF(AND(i_Units=\"Imperial\",BM206=\"Metre\"),39.37,IF(BF206<>\"\",BF206,1))),\"\")","v":""},{"$f":"IF(AND(AX206=\"SHOW\",BP206<>\"\"),BP206*BO206*IF(AND(BK206<>\"\",OR(BM206=\"LENGTH\",BM206=\"METRE\",BM206=\"ROLL\")),IF(BK206=\"^\",INDIRECT(BJ206),(INDIRECT(BJ206)-BI206))/IF(i_Units=\"Metric\",1000,1),1),\"\")","v":""}]
[null,null,null,"Fabric Wrap",{"$f":"IFERROR(IF(ISBLANK(D207),\"\",IF(FIND(D207,INDIRECT($D$187))>0,1,0)),0)","v":0},null,{"$f":"IFERROR(IF(ISBLANK(F207),\"\",IF(FIND(F207,INDIRECT($F$187))>0,1,0)),0)","v":""},null,{"$f":"IFERROR(IF(ISBLANK(H207),\"\",IF(FIND(H207,INDIRECT($H$187))>0,1,0)),0)","v":""},null,{"$f":"IFERROR(IF(ISBLANK(J207),\"\",IF(FIND(J207,INDIRECT($J$187))>0,1,0)),0)","v":""},"Pull",{"$f":"IFERROR(IF(ISBLANK(L207),\"\",IF(FIND(L207,INDIRECT($L$187))>0,1,0)),0)","v":0},null,{"$f":"IFERROR(IF(ISBLANK(N207),\"\",IF(FIND(N207,INDIRECT($N$187))>0,1,0)),0)","v":""},null,null,null,null,null,null,null,null,null,null,"Y",null,null,null,{"$f":"IFERROR(IF(AND(o_nScreens>1,Z207=\"Y\",PRODUCT(AA207:AC207)=0),o_nScreens,IF(PRODUCT(AA207:AC207)=0,\"\",PRODUCT(AA207:AC207))),\"\")","v":""},null,null,null,"White","Black","Sandstone","Silver Grey",null,null,null,null,null,"AU",{"$f":"IF(ISNUMBER(FIND(\"x\",BD207)),IFERROR(INDEX(AH207:AP207,0,MATCH(AS207,AH207:AP207,0)),IF(AH207<>\"\",AH207,i_DefaultColour)),\"\")","v":""},0,null,{"$f":"IF(ISNUMBER(FIND(\"x\",BD207)),IFERROR(INDEX(AH207:AP207,0,MATCH(AS207,AH207:AP207,0)),AR207),\"\")","v":""},{"$f":"IF(ISNUMBER(FIND(\"x\",BD207)),IFERROR(INDEX(INDIRECT(\"T_FinishColour[ColourCode-\"&IF(ISNUMBER(FIND(\"xxx\",BD207)),\"xxx\",IF(ISNUMBER(FIND(\"xx\",BD207)),\"xx\",\"error\"))&AQ207&\"]\"),MATCH(AU207,T_FinishColour[Finish / Colour],0)),\"\"),\"\")","v":""},null,"HIDE",null,null,null,{"$f":"_xlfn.IFNA(SUBSTITUTE(IF(AQ207=\"AU\",SUBSTITUTE(BD207,\"xxx\",AV207),SUBSTITUTE(SUBSTITUTE(BD207,\"xx\",AV207),\"x\",\"\")),\"LLL\",\"580\"),BD207)","v":"RB91-2536-069000"},null,"RB91-2536-069000","Hem Bar Pull Hook 2ft/4ft Extn",null,{"$f":"IF(ISBLANK(BL207),\"\",IF(OR(BL207=L_Units),\"Y\",\"N\"))","v":"N"},null,{"$f":"IFERROR(IF(BG207=\"Y\",((INDEX(T_Deduc[Deduction],MATCH(BH207,T_Deduc[Type],0),0))),\"\"),\"\")","v":""},null,{"$f":"IFERROR(IF(BG207=\"Y\",(INDIRECT(BJ207)-BI207)/IF(Z207=\"\",1,o_nScreens),\"\"),\"\")","v":""},"Set",{"$f":"IFERROR(IF(ISBLANK(BB207),\"\",INDEX(T_NAV[Base Unit of Measure],MATCH(BB207,T_NAV[No.],0))),\"\")","v":""},1,{"$f":"IF(ISBLANK(BN207),\"\",PRODUCT(AD207,BN207,ShadeQuantity))","v":1},{"$f":"IFERROR(INDEX(INDIRECT(\"T_NAV[\"&i_Location&\"]\"),MATCH(1,--(BB207=T_NAV[No.])*--((INDIRECT(\"T_NAV[\"&i_Location&\"]\"))<>\"\"),0))/IF(AND(BF207<>\"\",i_Units=\"Imperial\"),CONVERT(BF207,\"m\",\"in\"),IF(AND(i_Units=\"Imperial\",BM207=\"Metre\"),39.37,IF(BF207<>\"\",BF207,1))),\"\")","v":""},{"$f":"IF(AND(AX207=\"SHOW\",BP207<>\"\"),BP207*BO207*IF(AND(BK207<>\"\",OR(BM207=\"LENGTH\",BM207=\"METRE\",BM207=\"ROLL\")),IF(BK207=\"^\",INDIRECT(BJ207),(INDIRECT(BJ207)-BI207))/IF(i_Units=\"Metric\",1000,1),1),\"\")","v":""}]
[null,null,null,null,null,"15 mm Flat Spline",0,"No Tape",0,null,"",null,"",null,"",null,null,null,null,null,null,null,null,null,null,"Y",null,null,null,"",null,null,null,null,null,null,null,null,null,null,null,null,null,{"$f":"IF(ISNUMBER(FIND(\"x\",BD208)),IFERROR(INDEX(AH208:AP208,0,MATCH(AS208,AH208:AP208,0)),IF(AH208<>\"\",AH208,i_DefaultColour)),\"\")","v":""},null,null,{"$f":"IF(ISNUMBER(FIND(\"x\",BD208)),IFERROR(INDEX(AH208:AP208,0,MATCH(AS208,AH208:AP208,0)),AR208),\"\")","v":""},{"$f":"IF(ISNUMBER(FIND(\"x\",BD208)),IFERROR(INDEX(INDIRECT(\"T_FinishColour[ColourCode-\"&IF(ISNUMBER(FIND(\"xxx\",BD208)),\"xxx\",IF(ISNUMBER(FIND(\"xx\",BD208)),\"xx\",\"error\"))&AQ208&\"]\"),MATCH(AU208,T_FinishColour[Finish / Colour],0)),\"\"),\"\")","v":""},null,"HIDE",null,null,null,"RB92-1501-001100",null,"RB92-1501-001100","15mm Flat Spline",100,{"$f":"IF(ISBLANK(BL208),\"\",IF(OR(BL208=L_Units),\"Y\",\"N\"))","v":{"$error":"#N/A"}},"wb",{"$f":"IFERROR(IF(BG208=\"Y\",((INDEX(T_Deduc[Deduction],MATCH(BH208,T_Deduc[Type],0),0))),\"\"),\"\")","v":""},"i_Width","",{"$f":"INDEX(T_UnitSelection[Units],MATCH(i_Units,T_UnitSelection[UnitSelection],0))","v":{"$error":"#N/A"}},{"$f":"IFERROR(IF(ISBLANK(BB208),\"\",INDEX(T_NAV[Base Unit of Measure],MATCH(BB208,T_NAV[No.],0))),\"\")","v":"ROLL"},1,1,{"$f":"IFERROR(INDEX(INDIRECT(\"T_NAV[\"&i_Location&\"]\"),MATCH(1,--(BB208=T_NAV[No.])*--((INDIRECT(\"T_NAV[\"&i_Location&\"]\"))<>\"\"),0))/IF(AND(BF208<>\"\",i_Units=\"Imperial\"),CONVERT(BF208,\"m\",\"in\"),IF(AND(i_Units=\"Imperial\",BM208=\"Metre\"),39.37,IF(BF208<>\"\",BF208,1))),\"\")","v":""},""]
[null,null,null,null,null,"15 mm Flat Spline",0,"One Side",0,null,"",null,"",null,"",null,null,null,null,null,null,null,null,null,null,"Y",null,null,null,"",null,null,null,null,null,null,null,null,null,null,null,null,null,"",null,null,"",{"$f":"IF(ISNUMBER(FIND(\"x\",BD209)),IFERROR(INDEX(INDIRECT(\"T_FinishColour[ColourCode-\"&IF(ISNUMBER(FIND(\"xxx\",BD209)),\"xxx\",IF(ISNUMBER(FIND(\"xx\",BD209)),\"xx\",\"error\"))&AQ209&\"]\"),MATCH(AU209,T_FinishColour[Finish / Colour],0)),\"\"),\"\")","v":""},null,"HIDE",null,null,null,"RB92-1502-001075",null,"RB92-1502-001075","15mm Flat Spline - D/S MP-HR TAPE",75,{"$f":"IF(ISBLANK(BL209),\"\",IF(OR(BL209=L_Units),\"Y\",\"N\"))","v":{"$error":"#N/A"}},"wb",{"$f":"IFERROR(IF(BG209=\"Y\",((INDEX(T_Deduc[Deduction],MATCH(BH209,T_Deduc[Type],0),0))),\"\"),\"\")","v":""},"i_Width","",{"$f":"INDEX(T_UnitSelection[Units],MATCH(i_Units,T_UnitSelection[UnitSelection],0))","v":{"$error":"#N/A"}},{"$f":"IFERROR(IF(ISBLANK(BB209),\"\",INDEX(T_NAV[Base Unit of Measure],MATCH(BB209,T_NAV[No.],0))),\"\")","v":"ROLL"},1,1,{"$f":"IFERROR(INDEX(INDIRECT(\"T_NAV[\"&i_Location&\"]\"),MATCH(1,--(BB209=T_NAV[No.])*--((INDIRECT(\"T_NAV[\"&i_Location&\"]\"))<>\"\"),0))/IF(AND(BF209<>\"\",i_Units=\"Imperial\"),CONVERT(BF209,\"m\",\"in\"),IF(AND(i_Units=\"Imperial\",BM209=\"Metre\"),39.37,IF(BF209<>\"\",BF209,1))),\"\")","v":""},""]
[null,null,null,null,null,"15 mm Flat Spline",0,"Both Sides",0,null,"",null,"",null,"",null,null,null,null,null,null,null,null,null,null,"Y",null,null,null,"",null,null,null,null,null,null,null,null,null,null,null,null,null,"",null,null,"",{"$f":"IF(ISNUMBER(FIND(\"x\",BD210)),IFERROR(INDEX(INDIRECT(\"T_FinishColour[ColourCode-\"&IF(ISNUMBER(FIND(\"xxx\",BD210)),\"xxx\",IF(ISNUMBER(FIND(\"xx\",BD210)),\"xx\",\"error\"))&AQ210&\"]\"),MATCH(AU210,T_FinishColour[Finish / Colour],0)),\"\"),\"\")","v":""},null,"HIDE",null,null,null,"RB92-1503-001075",null,"RB92-1503-001075","15mm Flat Spline - D/S MP-HR TAPE B/SIDES",75,{"$f":"IF(ISBLANK(BL210),\"\",IF(OR(BL210=L_Units),\"Y\",\"N\"))","v":{"$error":"#N/A"}},"wb",{"$f":"IFERROR(IF(BG210=\"Y\",((INDEX(T_Deduc[Deduction],MATCH(BH210,T_Deduc[Type],0),0))),\"\"),\"\")","v":""},"i_Width","",{"$f":"INDEX(T_UnitSelection[Units],MATCH(i_Units,T_UnitSelection[UnitSelection],0))","v":{"$error":"#N/A"}},{"$f":"IFERROR(IF(ISBLANK(BB210),\"\",INDEX(T_NAV[Base Unit of Measure],MATCH(BB210,T_NAV[No.],0))),\"\")","v":"ROLL"},1,1,{"$f":"IFERROR(INDEX(INDIRECT(\"T_NAV[\"&i_Location&\"]\"),MATCH(1,--(BB210=T_NAV[No.])*--((INDIRECT(\"T_NAV[\"&i_Location&\"]\"))<>\"\"),0))/IF(AND(BF210<>\"\",i_Units=\"Imperial\"),CONVERT(BF210,\"m\",\"in\"),IF(AND(i_Units=\"Imperial\",BM210=\"Metre\"),39.37,IF(BF210<>\"\",BF210,1))),\"\")","v":""},""]
[null,null,null,null,null,"10 mm Flat Spline",0,"No Tape",0,null,"",null,"",null,"",null,null,null,null,null,null,null,null,null,null,"Y",null,null,null,"",null,null,null,null,null,null,null,null,null,null,null,null,null,"",null,null,"",{"$f":"IF(ISNUMBER(FIND(\"x\",BD211)),IFERROR(INDEX(INDIRECT(\"T_FinishColour[ColourCode-\"&IF(ISNUMBER(FIND(\"xxx\",BD211)),\"xxx\",IF(ISNUMBER(FIND(\"xx\",BD211)),\"xx\",\"error\"))&AQ211&\"]\"),MATCH(AU211,T_FinishColour[Finish / Colour],0)),\"\"),\"\")","v":""},null,"HIDE",null,null,null,"RB92-1001-001100",null,"RB92-1001-001100","10mm Flat Spline",100,{"$f":"IF(ISBLANK(BL211),\"\",IF(OR(BL211=L_Units),\"Y\",\"N\"))","v":{"$error":"#N/A"}},"wb",{"$f":"IFERROR(IF(BG211=\"Y\",((INDEX(T_Deduc[Deduction],MATCH(BH211,T_Deduc[Type],0),0))),\"\"),\"\")","v":""},"i_Width","",{"$f":"INDEX(T_UnitSelection[Units],MATCH(i_Units,T_UnitSelection[UnitSelection],0))","v":{"$error":"#N/A"}},{"$f":"IFERROR(IF(ISBLANK(BB211),\"\",INDEX(T_NAV[Base Unit of Measure],MATCH(BB211,T_NAV[No.],0))),\"\")","v":"ROLL"},1,1,{"$f":"IFERROR(INDEX(INDIRECT(\"T_NAV[\"&i_Location&\"]\"),MATCH(1,--(BB211=T_NAV[No.])*--((INDIRECT(\"T_NAV[\"&i_Location&\"]\"))<>\"\"),0))/IF(AND(BF211<>\"\",i_Units=\"Imperial\"),CONVERT(BF211,\"m\",\"in\"),IF(AND(i_Units=\"Imperial\",BM211=\"Metre\"),39.37,IF(BF211<>\"\",BF211,1))),\"\")","v":""},""]
[null,null,null,null,null,"10 mm Flat Spline",0,"One Side",0,null,"",null,"",null,"",null,null,null,null,null,null,null,null,null,null,"Y",null,null,null,"",null,null,null,null,null,null,null,null,null,null,null,null,null,"",null,null,"",{"$f":"IF(ISNUMBER(FIND(\"x\",BD212)),IFERROR(INDEX(INDIRECT(\"T_FinishColour[ColourCode-\"&IF(ISNUMBER(FIND(\"xxx\",BD212)),\"xxx\",IF(ISNUMBER(FIND(\"xx\",BD212)),\"xx\",\"error\"))&AQ212&\"]\"),MATCH(AU212,T_FinishColour[Finish / Colour],0)),\"\"),\"\")","v":""},null,"HIDE",null,null,null,"RB92-1002-001075",null,"RB92-1002-001075","10mm Flat Spline - D/S MP-HR TAPE",75,{"$f":"IF(ISBLANK(BL212),\"\",IF(OR(BL212=L_Units),\"Y\",\"N\"))","v":{"$error":"#N/A"}},"wb",{"$f":"IFERROR(IF(BG212=\"Y\",((INDEX(T_Deduc[Deduction],MATCH(BH212,T_Deduc[Type],0),0))),\"\"),\"\")","v":""},"i_Width","",{"$f":"INDEX(T_UnitSelection[Units],MATCH(i_Units,T_UnitSelection[UnitSelection],0))","v":{"$error":"#N/A"}},{"$f":"IFERROR(IF(ISBLANK(BB212),\"\",INDEX(T_NAV[Base Unit of Measure],MATCH(BB212,T_NAV[No.],0))),\"\")","v":"ROLL"},1,1,{"$f":"IFERROR(INDEX(INDIRECT(\"T_NAV[\"&i_Location&\"]\"),MATCH(1,--(BB212=T_NAV[No.])*--((INDIRECT(\"T_NAV[\"&i_Location&\"]\"))<>\"\"),0))/IF(AND(BF212<>\"\",i_Units=\"Imperial\"),CONVERT(BF212,\"m\",\"in\"),IF(AND(i_Units=\"Imperial\",BM212=\"Metre\"),39.37,IF(BF212<>\"\",BF212,1))),\"\")","v":""},""]
[null,null,null,null,null,"10 mm Flat Spline",0,"Both Sides",0,null,"",null,"",null,"",null,null,null,null,null,null,null,null,null,null,"Y",null,null,null,"",null,null,null,null,null,null,null,null,null,null,null,null,null,"",null,null,"",{"$f":"IF(ISNUMBER(FIND(\"x\",BD213)),IFERROR(INDEX(INDIRECT(\"T_FinishColour[ColourCode-\"&IF(ISNUMBER(FIND(\"xxx\",BD213)),\"xxx\",IF(ISNUMBER(FIND(\"xx\",BD213)),\"xx\",\"error\"))&AQ213&\"]\"),MATCH(AU213,T_FinishColour[Finish / Colour],0)),\"\"),\"\")","v":""},null,"HIDE",null,null,null,"RB92-1003-001075",null,"RB92-1003-001075","10mm Flat Spline - D/S MP-HR TAPE B/SIDES",75,{"$f":"IF(ISBLANK(BL213),\"\",IF(OR(BL213=L_Units),\"Y\",\"N\"))","v":{"$error":"#N/A"}},"wb",{"$f":"IFERROR(IF(BG213=\"Y\",((INDEX(T_Deduc[Deduction],MATCH(BH213,T_Deduc[Type],0),0))),\"\"),\"\")","v":""},"i_Width","",{"$f":"INDEX(T_UnitSelection[Units],MATCH(i_Units,T_UnitSelection[UnitSelection],0))","v":{"$error":"#N/A"}},{"$f":"IFERROR(IF(ISBLANK(BB213),\"\",INDEX(T_NAV[Base Unit of Measure],MATCH(BB213,T_NAV[No.],0))),\"\")","v":"ROLL"},1,1,{"$f":"IFERROR(INDEX(INDIRECT(\"T_NAV[\"&i_Location&\"]\"),MATCH(1,--(BB213=T_NAV[No.])*--((INDIRECT(\"T_NAV[\"&i_Location&\"]\"))<>\"\"),0))/IF(AND(BF213<>\"\",i_Units=\"Imperial\"),CONVERT(BF213,\"m\",\"in\"),IF(AND(i_Units=\"Imperial\",BM213=\"Metre\"),39.37,IF(BF213<>\"\",BF213,1))),\"\")","v":""},""]
[null,null,null,"Fabric Wrap",{"$f":"IFERROR(IF(ISBLANK(D214),\"\",IF(FIND(D214,INDIRECT($D$187))>0,1,0)),0)","v":0},null,{"$f":"IFERROR(IF(ISBLANK(F214),\"\",IF(FIND(F214,INDIRECT($F$187))>0,1,0)),0)","v":""},"Round",{"$f":"IFERROR(IF(ISBLANK(H214),\"\",IF(FIND(H214,INDIRECT($H$187))>0,1,0)),0)","v":0},null,{"$f":"IFERROR(IF(ISBLANK(J214),\"\",IF(FIND(J214,INDIRECT($J$187))>0,1,0)),0)","v":""},null,{"$f":"IFERROR(IF(ISBLANK(L214),\"\",IF(FIND(L214,INDIRECT($L$187))>0,1,0)),0)","v":""},null,{"$f":"IFERROR(IF(ISBLANK(N214),\"\",IF(FIND(N214,INDIRECT($N$187))>0,1,0)),0)","v":""},null,null,null,null,null,null,null,null,null,null,"Y",null,null,2,{"$f":"IFERROR(IF(AND(o_nScreens>1,Z214=\"Y\",PRODUCT(AA214:AC214)=0),o_nScreens,IF(PRODUCT(AA214:AC214)=0,\"\",PRODUCT(AA214:AC214))),\"\")","v":2},null,null,null,"White","Black","Sandstone","Silver Grey",null,null,null,null,null,"AU",{"$f":"IF(ISNUMBER(FIND(\"x\",BD214)),IFERROR(INDEX(AH214:AP214,0,MATCH(AS214,AH214:AP214,0)),IF(AH214<>\"\",AH214,i_DefaultColour)),\"\")","v":""},{"$f":"i_Colour","v":0},null,{"$f":"IF(ISNUMBER(FIND(\"x\",BD214)),IFERROR(INDEX(AH214:AP214,0,MATCH(AS214,AH214:AP214,0)),AR214),\"\")","v":""},{"$f":"IF(ISNUMBER(FIND(\"x\",BD214)),IFERROR(INDEX(INDIRECT(\"T_FinishColour[ColourCode-\"&IF(ISNUMBER(FIND(\"xxx\",BD214)),\"xxx\",IF(ISNUMBER(FIND(\"xx\",BD214)),\"xx\",\"error\"))&AQ214&\"]\"),MATCH(AU214,T_FinishColour[Finish / Colour],0)),\"\"),\"\")","v":""},null,"HIDE",null,null,null,"SS91-5350-069000",null,"SS91-5350-069000","Smooth Round Spline | 5.0mm x 820ft Roll",null,{"$f":"IF(ISBLANK(BL214),\"\",IF(OR(BL214=L_Units),\"Y\",\"N\"))","v":{"$error":"#N/A"}},"wb",{"$f":"IFERROR(IF(BG214=\"Y\",((INDEX(T_Deduc[Deduction],MATCH(BH214,T_Deduc[Type],0),0))),\"\"),\"\")","v":""},"i_Width",{"$f":"IFERROR(IF(BG214=\"Y\",(INDIRECT(BJ214)-BI214)/IF(Z214=\"\",1,o_nScreens),\"\"),\"\")","v":""},{"$f":"INDEX(T_UnitSelection[Units],MATCH(i_Units,T_UnitSelection[UnitSelection],0))","v":{"$error":"#N/A"}},{"$f":"IFERROR(IF(ISBLANK(BB214),\"\",INDEX(T_NAV[Base Unit of Measure],MATCH(BB214,T_NAV[No.],0))),\"\")","v":""},1,{"$f":"IF(ISBLANK(BN214),\"\",PRODUCT(AD214,BN214,ShadeQuantity))","v":2},{"$f":"IFERROR(INDEX(INDIRECT(\"T_NAV[\"&i_Location&\"]\"),MATCH(1,--(BB214=T_NAV[No.])*--((INDIRECT(\"T_NAV[\"&i_Location&\"]\"))<>\"\"),0))/IF(AND(BF214<>\"\",i_Units=\"Imperial\"),CONVERT(BF214,\"m\",\"in\"),IF(AND(i_Units=\"Imperial\",BM214=\"Metre\"),39.37,IF(BF214<>\"\",BF214,1))),\"\")","v":""}]
[null,null,null,"Fabric Wrap",{"$f":"IFERROR(IF(ISBLANK(D215),\"\",IF(FIND(D215,INDIRECT($D$187))>0,1,0)),0)","v":0},null,{"$f":"IFERROR(IF(ISBLANK(F215),\"\",IF(FIND(F215,INDIRECT($F$187))>0,1,0)),0)","v":""},null,{"$f":"IFERROR(IF(ISBLANK(H215),\"\",IF(FIND(H215,INDIRECT($H$187))>0,1,0)),0)","v":""},null,{"$f":"IFERROR(IF(ISBLANK(J215),\"\",IF(FIND(J215,INDIRECT($J$187))>0,1,0)),0)","v":""},"Ballast",{"$f":"IFERROR(IF(ISBLANK(L215),\"\",IF(FIND(L215,INDIRECT($L$187))>0,1,0)),0)","v":0},null,{"$f":"IFERROR(IF(ISBLANK(N215),\"\",IF(FIND(N215,INDIRECT($N$187))>0,1,0)),0)","v":""},null,null,null,null,null,null,null,null,null,null,"Y",null,null,null,{"$f":"IFERROR(IF(AND(o_nScreens>1,Z215=\"Y\",PRODUCT(AA215:AC215)=0),o_nScreens,IF(PRODUCT(AA215:AC215)=0,\"\",PRODUCT(AA215:AC215))),\"\")","v":""},null,null,null,"White","Black","Sandstone","Silver Grey",null,null,null,null,null,"AU",{"$f":"IF(ISNUMBER(FIND(\"x\",BD215)),IFERROR(INDEX(AH215:AP215,0,MATCH(AS215,AH215:AP215,0)),IF(AH215<>\"\",AH215,i_DefaultColour)),\"\")","v":""},0,null,{"$f":"IF(ISNUMBER(FIND(\"x\",BD215)),IFERROR(INDEX(AH215:AP215,0,MATCH(AS215,AH215:AP215,0)),AR215),\"\")","v":""},{"$f":"IF(ISNUMBER(FIND(\"x\",BD215)),IFERROR(INDEX(INDIRECT(\"T_FinishColour[ColourCode-\"&IF(ISNUMBER(FIND(\"xxx\",BD215)),\"xxx\",IF(ISNUMBER(FIND(\"xx\",BD215)),\"xx\",\"error\"))&AQ215&\"]\"),MATCH(AU215,T_FinishColour[Finish / Colour],0)),\"\"),\"\")","v":""},null,"HIDE",null,null,null,"VB05-0301-025000",null,"VB05-0301-025000","Oval Ballast 0.2\" x 0.3\" x 10ft Length",null,{"$f":"IF(ISBLANK(BL215),\"\",IF(OR(BL215=L_Units),\"Y\",\"N\"))","v":{"$error":"#N/A"}},"Ballast",{"$f":"IFERROR(IF(BG215=\"Y\",((INDEX(T_Deduc[Deduction],MATCH(BH215,T_Deduc[Type],0),0))),\"\"),\"\")","v":""},"i_Width","",{"$f":"INDEX(T_UnitSelection[Units],MATCH(i_Units,T_UnitSelection[UnitSelection],0))","v":{"$error":"#N/A"}},{"$f":"IFERROR(IF(ISBLANK(BB215),\"\",INDEX(T_NAV[Base Unit of Measure],MATCH(BB215,T_NAV[No.],0))),\"\")","v":""},1,{"$f":"IF(ISBLANK(BN215),\"\",PRODUCT(AD215,BN215,ShadeQuantity))","v":1},{"$f":"IFERROR(INDEX(INDIRECT(\"T_NAV[\"&i_Location&\"]\"),MATCH(1,--(BB215=T_NAV[No.])*--((INDIRECT(\"T_NAV[\"&i_Location&\"]\"))<>\"\"),0))/IF(AND(BF215<>\"\",i_Units=\"Imperial\"),CONVERT(BF215,\"m\",\"in\"),IF(AND(i_Units=\"Imperial\",BM215=\"Metre\"),39.37,IF(BF215<>\"\",BF215,1))),\"\")","v":""},{"$f":"IF(AND(AX215=\"SHOW\",BP215<>\"\"),BP215*BO215*IF(AND(BK215<>\"\",OR(BM215=\"LENGTH\",BM215=\"METRE\",BM215=\"ROLL\")),IF(BK215=\"^\",INDIRECT(BJ215),(INDIRECT(BJ215)-BI215))/IF(i_Units=\"Metric\",1000,1),1),\"\")","v":""}]
[null,null,null,"Fabric Wrap",{"$f":"IFERROR(IF(ISBLANK(D216),\"\",IF(FIND(D216,INDIRECT($D$187))>0,1,0)),0)","v":0},null,null,"One Side",0,null,"",null,"",null,"",null,null,null,null,null,null,null,null,null,null,"Y",null,null,null,"",null,null,null,null,null,null,null,null,null,null,null,null,null,"",null,null,"",{"$f":"IF(ISNUMBER(FIND(\"x\",BD216)),IFERROR(INDEX(INDIRECT(\"T_FinishColour[ColourCode-\"&IF(ISNUMBER(FIND(\"xxx\",BD216)),\"xxx\",IF(ISNUMBER(FIND(\"xx\",BD216)),\"xx\",\"error\"))&AQ216&\"]\"),MATCH(AU216,T_FinishColour[Finish / Colour],0)),\"\"),\"\")","v":""},null,"HIDE",null,null,null,"RB92-0901-001100",null,"RB92-0901-001100","9mm ACM Flat Spline - No Tape",100,{"$f":"IF(ISBLANK(BL216),\"\",IF(OR(BL216=L_Units),\"Y\",\"N\"))","v":{"$error":"#N/A"}},"wb",{"$f":"IFERROR(IF(BG216=\"Y\",((INDEX(T_Deduc[Deduction],MATCH(BH216,T_Deduc[Type],0),0))),\"\"),\"\")","v":""},"i_Width","",{"$f":"INDEX(T_UnitSelection[Units],MATCH(i_Units,T_UnitSelection[UnitSelection],0))","v":{"$error":"#N/A"}},{"$f":"IFERROR(IF(ISBLANK(BB216),\"\",INDEX(T_NAV[Base Unit of Measure],MATCH(BB216,T_NAV[No.],0))),\"\")","v":"ROLL"},1,1,{"$f":"IFERROR(INDEX(INDIRECT(\"T_NAV[\"&i_Location&\"]\"),MATCH(1,--(BB216=T_NAV[No.])*--((INDIRECT(\"T_NAV[\"&i_Location&\"]\"))<>\"\"),0))/IF(AND(BF216<>\"\",i_Units=\"Imperial\"),CONVERT(BF216,\"m\",\"in\"),IF(AND(i_Units=\"Imperial\",BM216=\"Metre\"),39.37,IF(BF216<>\"\",BF216,1))),\"\")","v":""},""]
[null,null,null,null,null,null,null,null,"",null,"",null,"",null,"",null,null,null,null,null,null,null,null,null,null,"Y",null,null,null,{"$f":"IFERROR(IF(AND(o_nScreens>1,Z217=\"Y\",PRODUCT(AA217:AC217)=0),o_nScreens,IF(PRODUCT(AA217:AC217)=0,\"\",PRODUCT(AA217:AC217))),\"\")","v":""},null,null,null,null,null,null,null,null,null,null,null,null,null,"",null,null,"",{"$f":"IF(ISNUMBER(FIND(\"x\",BD217)),IFERROR(INDEX(INDIRECT(\"T_FinishColour[ColourCode-\"&IF(ISNUMBER(FIND(\"xxx\",BD217)),\"xxx\",IF(ISNUMBER(FIND(\"xx\",BD217)),\"xx\",\"error\"))&AQ217&\"]\"),MATCH(AU217,T_FinishColour[Finish / Colour],0)),\"\"),\"\")","v":""},null,"HIDE",null,null,null,"RB92-0902-001075",null,"RB92-0902-001075","9mm Flat Spline - D/S MP-HR TAPE",75,{"$f":"IF(ISBLANK(BL217),\"\",IF(OR(BL217=L_Units),\"Y\",\"N\"))","v":{"$error":"#N/A"}},"wb",{"$f":"IFERROR(IF(BG217=\"Y\",((INDEX(T_Deduc[Deduction],MATCH(BH217,T_Deduc[Type],0),0))),\"\"),\"\")","v":""},"i_Width","",{"$f":"INDEX(T_UnitSelection[Units],MATCH(i_Units,T_UnitSelection[UnitSelection],0))","v":{"$error":"#N/A"}},{"$f":"IFERROR(IF(ISBLANK(BB217),\"\",INDEX(T_NAV[Base Unit of Measure],MATCH(BB217,T_NAV[No.],0))),\"\")","v":"ROLL"},1,1,{"$f":"IFERROR(INDEX(INDIRECT(\"T_NAV[\"&i_Location&\"]\"),MATCH(1,--(BB217=T_NAV[No.])*--((INDIRECT(\"T_NAV[\"&i_Location&\"]\"))<>\"\"),0))/IF(AND(BF217<>\"\",i_Units=\"Imperial\"),CONVERT(BF217,\"m\",\"in\"),IF(AND(i_Units=\"Imperial\",BM217=\"Metre\"),39.37,IF(BF217<>\"\",BF217,1))),\"\")","v":""},""]
[null,null,null,null,null,null,null,"Flat",0,null,"",null,"",null,"",null,null,null,null,null,null,null,null,null,null,"Y",null,null,null,"",null,null,null,null,null,null,null,null,null,null,null,null,null,"",null,null,"",{"$f":"IF(ISNUMBER(FIND(\"x\",BD218)),IFERROR(INDEX(INDIRECT(\"T_FinishColour[ColourCode-\"&IF(ISNUMBER(FIND(\"xxx\",BD218)),\"xxx\",IF(ISNUMBER(FIND(\"xx\",BD218)),\"xx\",\"error\"))&AQ218&\"]\"),MATCH(AU218,T_FinishColour[Finish / Colour],0)),\"\"),\"\")","v":""},null,{"$f":"IF(AND(ISBLANK(BD218),ISBLANK(C218)),\"HIDE\",IF(PRODUCT(C218:Y218)=1,\"SHOW\",\"HIDE\"))","v":"HIDE"},null,null,null,"RB92-0903-001075",null,"RB92-0903-001075","9mm Flat Spline - D/S MP-HR TAPE B/SIDES",75,{"$f":"IF(ISBLANK(BL218),\"\",IF(OR(BL218=L_Units),\"Y\",\"N\"))","v":{"$error":"#N/A"}},"wb",{"$f":"IFERROR(IF(BG218=\"Y\",((INDEX(T_Deduc[Deduction],MATCH(BH218,T_Deduc[Type],0),0))),\"\"),\"\")","v":""},"i_Width","",{"$f":"INDEX(T_UnitSelection[Units],MATCH(i_Units,T_UnitSelection[UnitSelection],0))","v":{"$error":"#N/A"}},{"$f":"IFERROR(IF(ISBLANK(BB218),\"\",INDEX(T_NAV[Base Unit of Measure],MATCH(BB218,T_NAV[No.],0))),\"\")","v":"ROLL"},1,1,{"$f":"IFERROR(INDEX(INDIRECT(\"T_NAV[\"&i_Location&\"]\"),MATCH(1,--(BB218=T_NAV[No.])*--((INDIRECT(\"T_NAV[\"&i_Location&\"]\"))<>\"\"),0))/IF(AND(BF218<>\"\",i_Units=\"Imperial\"),CONVERT(BF218,\"m\",\"in\"),IF(AND(i_Units=\"Imperial\",BM218=\"Metre\"),39.37,IF(BF218<>\"\",BF218,1))),\"\")","v":""},""]
[null,null,null,null,null,null,null,null,"","Yes",0,null,"",null,"",null,null,null,null,null,null,null,null,null,null,"Y",null,null,null,"",null,null,null,"Zinc Plated",null,null,null,null,null,null,null,null,"AU","Zinc Plated",null,null,"Zinc Plated",{"$f":"IF(ISNUMBER(FIND(\"x\",BD219)),IFERROR(INDEX(INDIRECT(\"T_FinishColour[ColourCode-\"&IF(ISNUMBER(FIND(\"xxx\",BD219)),\"xxx\",IF(ISNUMBER(FIND(\"xx\",BD219)),\"xx\",\"error\"))&AQ219&\"]\"),MATCH(AU219,T_FinishColour[Finish / Colour],0)),\"\"),\"\")","v":"025"},null,"HIDE",null,null,null,{"$f":"_xlfn.IFNA(SUBSTITUTE(IF(AQ219=\"AU\",SUBSTITUTE(BD219,\"xxx\",AV219),SUBSTITUTE(SUBSTITUTE(BD219,\"xx\",AV219),\"x\",\"\")),\"LLL\",\"300\"),BD219)","v":"VB05-0301-025300"},null,"VB05-0301-xxxLLL","Base Rail Weight Rod",3,{"$f":"IF(ISBLANK(BL219),\"\",IF(OR(BL219=L_Units),\"Y\",\"N\"))","v":{"$error":"#N/A"}},"Ballast",{"$f":"IFERROR(IF(BG219=\"Y\",((INDEX(T_Deduc[Deduction],MATCH(BH219,T_Deduc[Type],0),0))),\"\"),\"\")","v":""},"i_Width","",{"$f":"INDEX(T_UnitSelection[Units],MATCH(i_Units,T_UnitSelection[UnitSelection],0))","v":{"$error":"#N/A"}},{"$f":"IFERROR(IF(ISBLANK(BB219),\"\",INDEX(T_NAV[Base Unit of Measure],MATCH(BB219,T_NAV[No.],0))),\"\")","v":"LENGTH"},1,1,{"$f":"IFERROR(INDEX(INDIRECT(\"T_NAV[\"&i_Location&\"]\"),MATCH(1,--(BB219=T_NAV[No.])*--((INDIRECT(\"T_NAV[\"&i_Location&\"]\"))<>\"\"),0))/IF(AND(BF219<>\"\",i_Units=\"Imperial\"),CONVERT(BF219,\"m\",\"in\"),IF(AND(i_Units=\"Imperial\",BM219=\"Metre\"),39.37,IF(BF219<>\"\",BF219,1))),\"\")","v":""},""]
[null,null,null,null,null,null,null,null,"",null,"","Yes",0,"Seal",0,null,null,null,null,null,null,null,null,null,null,"Y",null,{"$f":"MID(i_wbAccessories,MIN(FIND({1,2},i_wbAccessories&\"12\")),1)*IF(o_nScreens>1,o_nScreens,1)","v":{"$error":"#VALUE!"}},null,"",null,null,null,null,null,null,null,null,null,null,null,null,null,"",null,null,"",{"$f":"IF(ISNUMBER(FIND(\"x\",BD220)),IFERROR(INDEX(INDIRECT(\"T_FinishColour[ColourCode-\"&IF(ISNUMBER(FIND(\"xxx\",BD220)),\"xxx\",IF(ISNUMBER(FIND(\"xx\",BD220)),\"xx\",\"error\"))&AQ220&\"]\"),MATCH(AU220,T_FinishColour[Finish / Colour],0)),\"\"),\"\")","v":""},null,"HIDE",null,null,null,{"$f":"_xlfn.IFNA(SUBSTITUTE(IF(AQ220=\"AU\",SUBSTITUTE(BD220,\"xxx\",AV220),SUBSTITUTE(SUBSTITUTE(BD220,\"xx\",AV220),\"x\",\"\")),\"LLL\",\"580\"),BD220)","v":"SB91-0005-001100"},null,"SB91-0005-001100","Bubble Seal Small",null,{"$f":"IF(ISBLANK(BL220),\"\",IF(OR(BL220=L_Units),\"Y\",\"N\"))","v":{"$error":"#N/A"}},"wb",{"$f":"IFERROR(IF(BG220=\"Y\",((INDEX(T_Deduc[Deduction],MATCH(BH220,T_Deduc[Type],0),0))),\"\"),\"\")","v":""},"i_Width","",{"$f":"INDEX(T_UnitSelection[Units],MATCH(i_Units,T_UnitSelection[UnitSelection],0))","v":{"$error":"#N/A"}},{"$f":"IFERROR(IF(ISBLANK(BB220),\"\",INDEX(T_NAV[Base Unit of Measure],MATCH(BB220,T_NAV[No.],0))),\"\")","v":"METRE"},1,1,{"$f":"IFERROR(INDEX(INDIRECT(\"T_NAV[\"&i_Location&\"]\"),MATCH(1,--(BB220=T_NAV[No.])*--((INDIRECT(\"T_NAV[\"&i_Location&\"]\"))<>\"\"),0))/IF(AND(BF220<>\"\",i_Units=\"Imperial\"),CONVERT(BF220,\"m\",\"in\"),IF(AND(i_Units=\"Imperial\",BM220=\"Metre\"),39.37,IF(BF220<>\"\",BF220,1))),\"\")","v":""},""]
[null,null,null,null,null,null,null,null,"",null,"","Yes",0,"Brush",0,null,null,null,null,null,null,null,null,null,null,"Y",null,{"$f":"MID(i_wbAccessories,MIN(FIND({1,2},i_wbAccessories&\"12\")),1)*IF(o_nScreens>1,o_nScreens,1)","v":{"$error":"#VALUE!"}},null,"",null,null,null,null,null,null,null,null,null,null,null,null,null,"",null,null,"",{"$f":"IF(ISNUMBER(FIND(\"x\",BD221)),IFERROR(INDEX(INDIRECT(\"T_FinishColour[ColourCode-\"&IF(ISNUMBER(FIND(\"xxx\",BD221)),\"xxx\",IF(ISNUMBER(FIND(\"xx\",BD221)),\"xx\",\"error\"))&AQ221&\"]\"),MATCH(AU221,T_FinishColour[Finish / Colour],0)),\"\"),\"\")","v":""},null,"HIDE",null,null,null,"SB91-0011-050500",null,"SB91-0011-050500","Fabric Brush ",null,{"$f":"IF(ISBLANK(BL221),\"\",IF(OR(BL221=L_Units),\"Y\",\"N\"))","v":{"$error":"#N/A"}},"wb",{"$f":"IFERROR(IF(BG221=\"Y\",((INDEX(T_Deduc[Deduction],MATCH(BH221,T_Deduc[Type],0),0))),\"\"),\"\")","v":""},"i_Width","",{"$f":"INDEX(T_UnitSelection[Units],MATCH(i_Units,T_UnitSelection[UnitSelection],0))","v":{"$error":"#N/A"}},{"$f":"IFERROR(IF(ISBLANK(BB221),\"\",INDEX(T_NAV[Base Unit of Measure],MATCH(BB221,T_NAV[No.],0))),\"\")","v":"METRE"},1,1,{"$f":"IFERROR(INDEX(INDIRECT(\"T_NAV[\"&i_Location&\"]\"),MATCH(1,--(BB221=T_NAV[No.])*--((INDIRECT(\"T_NAV[\"&i_Location&\"]\"))<>\"\"),0))/IF(AND(BF221<>\"\",i_Units=\"Imperial\"),CONVERT(BF221,\"m\",\"in\"),IF(AND(i_Units=\"Imperial\",BM221=\"Metre\"),39.37,IF(BF221<>\"\",BF221,1))),\"\")","v":""},""]
[null,null,{"$f":"C223","v":0},null,null,null,null,null,null,null,null,null,null,null,null,null,null,null,null,null,null,null,null,null,null,null,null,null,null,null,null,null,null,null,null,null,null,null,null,null,null,null,null,"",null,null,"",{"$f":"IF(ISNUMBER(FIND(\"x\",BD222)),IFERROR(INDEX(INDIRECT(\"T_FinishColour[ColourCode-\"&IF(ISNUMBER(FIND(\"xxx\",BD222)),\"xxx\",IF(ISNUMBER(FIND(\"xx\",BD222)),\"xx\",\"error\"))&AQ222&\"]\"),MATCH(AU222,T_FinishColour[Finish / Colour],0)),\"\"),\"\")","v":""},null,"HIDE",null,null,null,"",null,null,null,null,{"$f":"IF(ISBLANK(BL222),\"\",IF(OR(BL222=L_Units),\"Y\",\"N\"))","v":""},null,{"$f":"IFERROR(IF(BG222=\"Y\",((INDEX(T_Deduc[Deduction],MATCH(BH222,T_Deduc[Type],0),0))),\"\"),\"\")","v":""},null,"",null,{"$f":"IFERROR(IF(ISBLANK(BB222),\"\",INDEX(T_NAV[Base Unit of Measure],MATCH(BB222,T_NAV[No.],0))),\"\")","v":""},null,"",{"$f":"IFERROR(INDEX(INDIRECT(\"T_NAV[\"&i_Location&\"]\"),MATCH(1,--(BB222=T_NAV[No.])*--((INDIRECT(\"T_NAV[\"&i_Location&\"]\"))<>\"\"),0))/IF(AND(BF222<>\"\",i_Units=\"Imperial\"),CONVERT(BF222,\"m\",\"in\"),IF(AND(i_Units=\"Imperial\",BM222=\"Metre\"),39.37,IF(BF222<>\"\",BF222,1))),\"\")","v":""},""]
[null,null,{"$f":"IF(SUM(E224:E235)>=1,1,0)","v":0},"i_Tube",null,"i_TubeExtras",null,"i_Location",null,null,null,null,null,null,null,null,null,null,null,null,null,null,null,null,null,null,null,null,null,{"$f":"IFERROR(IF(AND(o_nScreens>1,Z223=\"Y\",PRODUCT(AA223:AC223)=0),o_nScreens,IF(PRODUCT(AA223:AC223)=0,\"\",PRODUCT(AA223:AC223))),\"\")","v":""},null,null,null,null,null,null,null,null,null,null,null,null,null,"",null,null,"",{"$f":"IF(ISNUMBER(FIND(\"x\",BD223)),IFERROR(INDEX(INDIRECT(\"T_FinishColour[ColourCode-\"&IF(ISNUMBER(FIND(\"xxx\",BD223)),\"xxx\",IF(ISNUMBER(FIND(\"xx\",BD223)),\"xx\",\"error\"))&AQ223&\"]\"),MATCH(AU223,T_FinishColour[Finish / Colour],0)),\"\"),\"\")","v":""},null,"HIDE",null,null,null,"TUBE",null,"TUBE",null,null,null,null,{"$f":"IFERROR(IF(BG223=\"Y\",((INDEX(T_Deduc[Deduction],MATCH(BH223,T_Deduc[Type],0),0))),\"\"),\"\")","v":""},null,"",null,{"$f":"IFERROR(IF(ISBLANK(BB223),\"\",INDEX(T_NAV[Base Unit of Measure],MATCH(BB223,T_NAV[No.],0))),\"\")","v":""},null,"",{"$f":"IFERROR(INDEX(INDIRECT(\"T_NAV[\"&i_Location&\"]\"),MATCH(1,--(BB223=T_NAV[No.])*--((INDIRECT(\"T_NAV[\"&i_Location&\"]\"))<>\"\"),0))/IF(AND(BF223<>\"\",i_Units=\"Imperial\"),CONVERT(BF223,\"m\",\"in\"),IF(AND(i_Units=\"Imperial\",BM223=\"Metre\"),39.37,IF(BF223<>\"\",BF223,1))),\"\")","v":""},""]
[null,null,null,"1.5\"",{"$f":"IFERROR(IF(ISBLANK(D224),\"\",IF(FIND(D224,INDIRECT($D$223))>0,1,0)),0)","v":0},null,{"$f":"IFERROR(IF(ISBLANK(F224),\"\",IF(FIND(F224,INDIRECT($F$223))>0,1,0)),0)","v":""},"AU",{"$f":"IFERROR(IF(ISBLANK(H224),\"\",IF(FIND(H224,INDIRECT($H$223))>0,1,0)),0)","v":0},null,null,null,null,null,null,null,null,null,null,null,null,null,null,null,null,"Y",null,null,null,"",null,null,null,null,null,null,null,null,null,null,null,null,null,"",null,null,"",{"$f":"IF(ISNUMBER(FIND(\"x\",BD224)),IFERROR(INDEX(INDIRECT(\"T_FinishColour[ColourCode-\"&IF(ISNUMBER(FIND(\"xxx\",BD224)),\"xxx\",IF(ISNUMBER(FIND(\"xx\",BD224)),\"xx\",\"error\"))&AQ224&\"]\"),MATCH(AU224,T_FinishColour[Finish / Colour],0)),\"\"),\"\")","v":""},null,"HIDE",null,null,null,"RTEA-4T05-000580",null,"RTEA-4T05-000580","Rollease Tube + M/P Tape | 1-1/2\" ",5.8,{"$f":"IF(ISBLANK(BL224),\"\",IF(OR(BL224=L_Units),\"Y\",\"N\"))","v":{"$error":"#N/A"}},"Tube",{"$f":"IFERROR(IF(BG224=\"Y\",((INDEX(T_Deduc[Deduction],MATCH(BH224,T_Deduc[Type],0),0))),\"\"),\"\")","v":""},"i_Width","",{"$f":"INDEX(T_UnitSelection[Units],MATCH(i_Units,T_UnitSelection[UnitSelection],0))","v":{"$error":"#N/A"}},{"$f":"IFERROR(IF(ISBLANK(BB224),\"\",INDEX(T_NAV[Base Unit of Measure],MATCH(BB224,T_NAV[No.],0))),\"\")","v":"LENGTH"},1,1,{"$f":"IFERROR(INDEX(INDIRECT(\"T_NAV[\"&i_Location&\"]\"),MATCH(1,--(BB224=T_NAV[No.])*--((INDIRECT(\"T_NAV[\"&i_Location&\"]\"))<>\"\"),0))/IF(AND(BF224<>\"\",i_Units=\"Imperial\"),CONVERT(BF224,\"m\",\"in\"),IF(AND(i_Units=\"Imperial\",BM224=\"Metre\"),39.37,IF(BF224<>\"\",BF224,1))),\"\")","v":""},""]
[null,null,null,"1.5\"",0,null,{"$f":"IFERROR(IF(ISBLANK(F225),\"\",IF(FIND(F225,INDIRECT($F$223))>0,1,0)),0)","v":""},"US",{"$f":"IFERROR(IF(ISBLANK(H225),\"\",IF(FIND(H225,INDIRECT($H$223))>0,1,0)),0)","v":0},null,null,null,null,null,null,null,null,null,null,null,null,null,null,null,null,"Y",null,null,null,"",null,null,null,null,null,null,null,null,null,null,null,null,null,"",null,null,"",{"$f":"IF(ISNUMBER(FIND(\"x\",BD225)),IFERROR(INDEX(INDIRECT(\"T_FinishColour[ColourCode-\"&IF(ISNUMBER(FIND(\"xxx\",BD225)),\"xxx\",IF(ISNUMBER(FIND(\"xx\",BD225)),\"xx\",\"error\"))&AQ225&\"]\"),MATCH(AU225,T_FinishColour[Finish / Colour],0)),\"\"),\"\")","v":""},null,"HIDE",null,null,null,{"$f":"_xlfn.IFNA(SUBSTITUTE(IF(AQ225=\"AU\",SUBSTITUTE(BD225,\"xxx\",AV225),SUBSTITUTE(SUBSTITUTE(BD225,\"xx\",AV225),\"x\",\"\")),\"LLL\",\"580\"),BD225)","v":"RTEA4T16"},null,"RTEA4T16","Tube Aluminum 1-1/2\" x 16' Taped",4.8,{"$f":"IF(ISBLANK(BL225),\"\",IF(OR(BL225=L_Units),\"Y\",\"N\"))","v":{"$error":"#N/A"}},"Tube",{"$f":"IFERROR(IF(BG225=\"Y\",((INDEX(T_Deduc[Deduction],MATCH(BH225,T_Deduc[Type],0),0))),\"\"),\"\")","v":""},"i_Width","",{"$f":"INDEX(T_UnitSelection[Units],MATCH(i_Units,T_UnitSelection[UnitSelection],0))","v":{"$error":"#N/A"}},{"$f":"IFERROR(IF(ISBLANK(BB225),\"\",INDEX(T_NAV[Base Unit of Measure],MATCH(BB225,T_NAV[No.],0))),\"\")","v":"LENGTH"},1,1,{"$f":"IFERROR(INDEX(INDIRECT(\"T_NAV[\"&i_Location&\"]\"),MATCH(1,--(BB225=T_NAV[No.])*--((INDIRECT(\"T_NAV[\"&i_Location&\"]\"))<>\"\"),0))/IF(AND(BF225<>\"\",i_Units=\"Imperial\"),CONVERT(BF225,\"m\",\"in\"),IF(AND(i_Units=\"Imperial\",BM225=\"Metre\"),39.37,IF(BF225<>\"\",BF225,1))),\"\")","v":""},""]
[null,null,null,null,"",null,{"$f":"IFERROR(IF(ISBLANK(F226),\"\",IF(FIND(F226,INDIRECT($F$223))>0,1,0)),0)","v":""},null,"",null,null,null,null,null,null,null,null,null,null,null,null,null,null,null,null,"Y",null,null,null,"",null,null,null,null,null,null,null,null,null,null,null,null,null,"",null,null,"",{"$f":"IF(ISNUMBER(FIND(\"x\",BD226)),IFERROR(INDEX(INDIRECT(\"T_FinishColour[ColourCode-\"&IF(ISNUMBER(FIND(\"xxx\",BD226)),\"xxx\",IF(ISNUMBER(FIND(\"xx\",BD226)),\"xx\",\"error\"))&AQ226&\"]\"),MATCH(AU226,T_FinishColour[Finish / Colour],0)),\"\"),\"\")","v":""},null,"HIDE",null,null,null,"TAPE36",null,"TAPE36","Multi-Purpose Double Sided Tape 1/2\"",null,{"$f":"IF(ISBLANK(BL226),\"\",IF(OR(BL226=L_Units),\"Y\",\"N\"))","v":{"$error":"#N/A"}},"Tube",{"$f":"IFERROR(IF(BG226=\"Y\",((INDEX(T_Deduc[Deduction],MATCH(BH226,T_Deduc[Type],0),0))),\"\"),\"\")","v":""},"i_Width","",{"$f":"INDEX(T_UnitSelection[Units],MATCH(i_Units,T_UnitSelection[UnitSelection],0))","v":{"$error":"#N/A"}},{"$f":"IFERROR(IF(ISBLANK(BB226),\"\",INDEX(T_NAV[Base Unit of Measure],MATCH(BB226,T_NAV[No.],0))),\"\")","v":""},1,1,{"$f":"IFERROR(INDEX(INDIRECT(\"T_NAV[\"&i_Location&\"]\"),MATCH(1,--(BB226=T_NAV[No.])*--((INDIRECT(\"T_NAV[\"&i_Location&\"]\"))<>\"\"),0))/IF(AND(BF226<>\"\",i_Units=\"Imperial\"),CONVERT(BF226,\"m\",\"in\"),IF(AND(i_Units=\"Imperial\",BM226=\"Metre\"),39.37,IF(BF226<>\"\",BF226,1))),\"\")","v":""},""]
[null,null,null,"S45 LT",{"$f":"IFERROR(IF(ISBLANK(D227),\"\",IF(FIND(D227,INDIRECT($D$223))>0,1,0)),0)","v":0},"Spline",0,null,"",null,null,null,null,null,null,null,null,null,null,null,null,null,null,null,null,"Y",null,null,null,"",null,null,null,"Mill",null,null,null,null,null,null,null,null,"AU","Mill",{"$f":"i_Colour","v":0},null,"Mill",{"$f":"IF(ISNUMBER(FIND(\"x\",BD227)),IFERROR(INDEX(INDIRECT(\"T_FinishColour[ColourCode-\"&IF(ISNUMBER(FIND(\"xxx\",BD227)),\"xxx\",IF(ISNUMBER(FIND(\"xx\",BD227)),\"xx\",\"error\"))&AQ227&\"]\"),MATCH(AU227,T_FinishColour[Finish / Colour],0)),\"\"),\"\")","v":"000"},null,"HIDE",null,null,null,"RB93-0443-000580",null,"RB93-0443-xxxLLL","S45 | LIGHT T-SPLINE Alum. Tube",5.8,{"$f":"IF(ISBLANK(BL227),\"\",IF(OR(BL227=L_Units),\"Y\",\"N\"))","v":{"$error":"#N/A"}},"Tube",{"$f":"IFERROR(IF(BG227=\"Y\",((INDEX(T_Deduc[Deduction],MATCH(BH227,T_Deduc[Type],0),0))),\"\"),\"\")","v":""},"i_Width","",{"$f":"INDEX(T_UnitSelection[Units],MATCH(i_Units,T_UnitSelection[UnitSelection],0))","v":{"$error":"#N/A"}},{"$f":"IFERROR(IF(ISBLANK(BB227),\"\",INDEX(T_NAV[Base Unit of Measure],MATCH(BB227,T_NAV[No.],0))),\"\")","v":"LENGTH"},1,1,{"$f":"IFERROR(INDEX(INDIRECT(\"T_NAV[\"&i_Location&\"]\"),MATCH(1,--(BB227=T_NAV[No.])*--((INDIRECT(\"T_NAV[\"&i_Location&\"]\"))<>\"\"),0))/IF(AND(BF227<>\"\",i_Units=\"Imperial\"),CONVERT(BF227,\"m\",\"in\"),IF(AND(i_Units=\"Imperial\",BM227=\"Metre\"),39.37,IF(BF227<>\"\",BF227,1))),\"\")","v":""},""]
[null,null,null,"S45 LT",{"$f":"IFERROR(IF(ISBLANK(D228),\"\",IF(FIND(D228,INDIRECT($D$223))>0,1,0)),0)","v":0},"Tape",0,null,"",null,null,null,null,null,null,null,null,null,null,null,null,null,null,null,null,"Y",null,null,null,{"$f":"IFERROR(IF(AND(o_nScreens>1,Z228=\"Y\",PRODUCT(AA228:AC228)=0),o_nScreens,IF(PRODUCT(AA228:AC228)=0,\"\",PRODUCT(AA228:AC228))),\"\")","v":""},null,null,null,"Mill",null,null,null,null,null,null,null,null,"AU","Mill",0,null,"Mill",{"$f":"IF(ISNUMBER(FIND(\"x\",BD228)),IFERROR(INDEX(INDIRECT(\"T_FinishColour[ColourCode-\"&IF(ISNUMBER(FIND(\"xxx\",BD228)),\"xxx\",IF(ISNUMBER(FIND(\"xx\",BD228)),\"xx\",\"error\"))&AQ228&\"]\"),MATCH(AU228,T_FinishColour[Finish / Colour],0)),\"\"),\"\")","v":"000"},null,"HIDE",null,null,null,"RB93-6443-000580",null,"RB93-6443-xxxLLL","S45 | LIGHT T-SPLINE Alum. Tube (with D/S Tape)",5.8,{"$f":"IF(ISBLANK(BL228),\"\",IF(OR(BL228=L_Units),\"Y\",\"N\"))","v":{"$error":"#N/A"}},"Tube",{"$f":"IFERROR(IF(BG228=\"Y\",((INDEX(T_Deduc[Deduction],MATCH(BH228,T_Deduc[Type],0),0))),\"\"),\"\")","v":""},"i_Width","",{"$f":"INDEX(T_UnitSelection[Units],MATCH(i_Units,T_UnitSelection[UnitSelection],0))","v":{"$error":"#N/A"}},{"$f":"IFERROR(IF(ISBLANK(BB228),\"\",INDEX(T_NAV[Base Unit of Measure],MATCH(BB228,T_NAV[No.],0))),\"\")","v":"LENGTH"},1,1,{"$f":"IFERROR(INDEX(INDIRECT(\"T_NAV[\"&i_Location&\"]\"),MATCH(1,--(BB228=T_NAV[No.])*--((INDIRECT(\"T_NAV[\"&i_Location&\"]\"))<>\"\"),0))/IF(AND(BF228<>\"\",i_Units=\"Imperial\"),CONVERT(BF228,\"m\",\"in\"),IF(AND(i_Units=\"Imperial\",BM228=\"Metre\"),39.37,IF(BF228<>\"\",BF228,1))),\"\")","v":""},""]
[null,null,null,"S45 STD",0,"Spline",0,null,"",null,null,null,null,null,null,null,null,null,null,null,null,null,null,null,null,"Y",null,null,null,"",null,null,null,"Mill",null,null,null,null,null,null,null,null,"AU","Mill",0,null,"Mill",{"$f":"IF(ISNUMBER(FIND(\"x\",BD229)),IFERROR(INDEX(INDIRECT(\"T_FinishColour[ColourCode-\"&IF(ISNUMBER(FIND(\"xxx\",BD229)),\"xxx\",IF(ISNUMBER(FIND(\"xx\",BD229)),\"xx\",\"error\"))&AQ229&\"]\"),MATCH(AU229,T_FinishColour[Finish / Colour],0)),\"\"),\"\")","v":"000"},null,"HIDE",null,null,null,"RB93-0444-000580",null,"RB93-0444-xxxLLL","S45 | STD T-SPLINE Alum. Tube",5.8,{"$f":"IF(ISBLANK(BL229),\"\",IF(OR(BL229=L_Units),\"Y\",\"N\"))","v":{"$error":"#N/A"}},"Tube",{"$f":"IFERROR(IF(BG229=\"Y\",((INDEX(T_Deduc[Deduction],MATCH(BH229,T_Deduc[Type],0),0))),\"\"),\"\")","v":""},"i_Width",{"$f":"IFERROR(IF(BG229=\"Y\",(INDIRECT(BJ229)-BI229)/IF(Z229=\"\",1,o_nScreens),\"\"),\"\")","v":""},{"$f":"INDEX(T_UnitSelection[Units],MATCH(i_Units,T_UnitSelection[UnitSelection],0))","v":{"$error":"#N/A"}},{"$f":"IFERROR(IF(ISBLANK(BB229),\"\",INDEX(T_NAV[Base Unit of Measure],MATCH(BB229,T_NAV[No.],0))),\"\")","v":"LENGTH"},1,1,{"$f":"IFERROR(INDEX(INDIRECT(\"T_NAV[\"&i_Location&\"]\"),MATCH(1,--(BB229=T_NAV[No.])*--((INDIRECT(\"T_NAV[\"&i_Location&\"]\"))<>\"\"),0))/IF(AND(BF229<>\"\",i_Units=\"Imperial\"),CONVERT(BF229,\"m\",\"in\"),IF(AND(i_Units=\"Imperial\",BM229=\"Metre\"),39.37,IF(BF229<>\"\",BF229,1))),\"\")","v":""},""]
[null,null,null,"S45 STD",{"$f":"IFERROR(IF(ISBLANK(D230),\"\",IF(FIND(D230,INDIRECT($D$223))>0,1,0)),0)","v":0},"Tape",0,null,"",null,null,null,null,null,null,null,null,null,null,null,null,null,null,null,null,"Y",null,null,null,{"$f":"IFERROR(IF(AND(o_nScreens>1,Z230=\"Y\",PRODUCT(AA230:AC230)=0),o_nScreens,IF(PRODUCT(AA230:AC230)=0,\"\",PRODUCT(AA230:AC230))),\"\")","v":""},null,null,null,"Mill",null,null,null,null,null,null,null,null,"AU","Mill",0,null,"Mill",{"$f":"IF(ISNUMBER(FIND(\"x\",BD230)),IFERROR(INDEX(INDIRECT(\"T_FinishColour[ColourCode-\"&IF(ISNUMBER(FIND(\"xxx\",BD230)),\"xxx\",IF(ISNUMBER(FIND(\"xx\",BD230)),\"xx\",\"error\"))&AQ230&\"]\"),MATCH(AU230,T_FinishColour[Finish / Colour],0)),\"\"),\"\")","v":"000"},null,"HIDE",null,null,null,"RB93-6444-000580",null,"RB93-6444-xxxLLL","S45 | STD T-SPLINE Alum. Tube (with D/S Tape)",5.8,{"$f":"IF(ISBLANK(BL230),\"\",IF(OR(BL230=L_Units),\"Y\",\"N\"))","v":{"$error":"#N/A"}},"Tube",{"$f":"IFERROR(IF(BG230=\"Y\",((INDEX(T_Deduc[Deduction],MATCH(BH230,T_Deduc[Type],0),0))),\"\"),\"\")","v":""},"i_Width","",{"$f":"INDEX(T_UnitSelection[Units],MATCH(i_Units,T_UnitSelection[UnitSelection],0))","v":{"$error":"#N/A"}},{"$f":"IFERROR(IF(ISBLANK(BB230),\"\",INDEX(T_NAV[Base Unit of Measure],MATCH(BB230,T_NAV[No.],0))),\"\")","v":"LENGTH"},1,1,{"$f":"IFERROR(INDEX(INDIRECT(\"T_NAV[\"&i_Location&\"]\"),MATCH(1,--(BB230=T_NAV[No.])*--((INDIRECT(\"T_NAV[\"&i_Location&\"]\"))<>\"\"),0))/IF(AND(BF230<>\"\",i_Units=\"Imperial\"),CONVERT(BF230,\"m\",\"in\"),IF(AND(i_Units=\"Imperial\",BM230=\"Metre\"),39.37,IF(BF230<>\"\",BF230,1))),\"\")","v":""},""]
[null,null,null,"S45 HD",0,"Spline",0,null,"",null,null,null,null,null,null,null,null,null,null,null,null,null,null,null,null,"Y",null,null,null,"",null,null,null,"Mill",null,null,null,null,null,null,null,null,"AU","Mill",0,null,"Mill",{"$f":"IF(ISNUMBER(FIND(\"x\",BD231)),IFERROR(INDEX(INDIRECT(\"T_FinishColour[ColourCode-\"&IF(ISNUMBER(FIND(\"xxx\",BD231)),\"xxx\",IF(ISNUMBER(FIND(\"xx\",BD231)),\"xx\",\"error\"))&AQ231&\"]\"),MATCH(AU231,T_FinishColour[Finish / Colour],0)),\"\"),\"\")","v":"000"},null,"HIDE",null,null,null,"RB93-0449-000580",null,"RB93-0449-xxxLLL","S45 | HD T-SPLINE Alum. Tube",5.8,{"$f":"IF(ISBLANK(BL231),\"\",IF(OR(BL231=L_Units),\"Y\",\"N\"))","v":{"$error":"#N/A"}},"Tube",{"$f":"IFERROR(IF(BG231=\"Y\",((INDEX(T_Deduc[Deduction],MATCH(BH231,T_Deduc[Type],0),0))),\"\"),\"\")","v":""},"i_Width","",{"$f":"INDEX(T_UnitSelection[Units],MATCH(i_Units,T_UnitSelection[UnitSelection],0))","v":{"$error":"#N/A"}},{"$f":"IFERROR(IF(ISBLANK(BB231),\"\",INDEX(T_NAV[Base Unit of Measure],MATCH(BB231,T_NAV[No.],0))),\"\")","v":"LENGTH"},1,1,{"$f":"IFERROR(INDEX(INDIRECT(\"T_NAV[\"&i_Location&\"]\"),MATCH(1,--(BB231=T_NAV[No.])*--((INDIRECT(\"T_NAV[\"&i_Location&\"]\"))<>\"\"),0))/IF(AND(BF231<>\"\",i_Units=\"Imperial\"),CONVERT(BF231,\"m\",\"in\"),IF(AND(i_Units=\"Imperial\",BM231=\"Metre\"),39.37,IF(BF231<>\"\",BF231,1))),\"\")","v":""},""]
[null,null,null,"S45 HD",{"$f":"IFERROR(IF(ISBLANK(D232),\"\",IF(FIND(D232,INDIRECT($D$223))>0,1,0)),0)","v":0},"Tape",0,null,"",null,null,null,null,null,null,null,null,null,null,null,null,null,null,null,null,"Y",null,null,null,{"$f":"IFERROR(IF(AND(o_nScreens>1,Z232=\"Y\",PRODUCT(AA232:AC232)=0),o_nScreens,IF(PRODUCT(AA232:AC232)=0,\"\",PRODUCT(AA232:AC232))),\"\")","v":""},null,null,null,"Mill",null,null,null,null,null,null,null,null,"AU","Mill",0,null,"Mill",{"$f":"IF(ISNUMBER(FIND(\"x\",BD232)),IFERROR(INDEX(INDIRECT(\"T_FinishColour[ColourCode-\"&IF(ISNUMBER(FIND(\"xxx\",BD232)),\"xxx\",IF(ISNUMBER(FIND(\"xx\",BD232)),\"xx\",\"error\"))&AQ232&\"]\"),MATCH(AU232,T_FinishColour[Finish / Colour],0)),\"\"),\"\")","v":"000"},null,"HIDE",null,null,null,"RB93-6449-000580",null,"RB93-6449-xxxLLL","S45 | HD T-SPLINE Alum. Tube (with D/S Tape)",5.8,{"$f":"IF(ISBLANK(BL232),\"\",IF(OR(BL232=L_Units),\"Y\",\"N\"))","v":{"$error":"#N/A"}},"Tube",{"$f":"IFERROR(IF(BG232=\"Y\",((INDEX(T_Deduc[Deduction],MATCH(BH232,T_Deduc[Type],0),0))),\"\"),\"\")","v":""},"i_Width","",{"$f":"INDEX(T_UnitSelection[Units],MATCH(i_Units,T_UnitSelection[UnitSelection],0))","v":{"$error":"#N/A"}},{"$f":"IFERROR(IF(ISBLANK(BB232),\"\",INDEX(T_NAV[Base Unit of Measure],MATCH(BB232,T_NAV[No.],0))),\"\")","v":"LENGTH"},1,1,{"$f":"IFERROR(INDEX(INDIRECT(\"T_NAV[\"&i_Location&\"]\"),MATCH(1,--(BB232=T_NAV[No.])*--((INDIRECT(\"T_NAV[\"&i_Location&\"]\"))<>\"\"),0))/IF(AND(BF232<>\"\",i_Units=\"Imperial\"),CONVERT(BF232,\"m\",\"in\"),IF(AND(i_Units=\"Imperial\",BM232=\"Metre\"),39.37,IF(BF232<>\"\",BF232,1))),\"\")","v":""},""]
[null,null,null,"S45",0,"Spline",0,null,"",null,null,null,null,null,null,null,null,null,null,null,null,null,null,null,null,"Y",null,null,null,"",null,null,null,null,null,null,null,null,null,null,null,null,null,"",null,null,"",{"$f":"IF(ISNUMBER(FIND(\"x\",BD233)),IFERROR(INDEX(INDIRECT(\"T_FinishColour[ColourCode-\"&IF(ISNUMBER(FIND(\"xxx\",BD233)),\"xxx\",IF(ISNUMBER(FIND(\"xx\",BD233)),\"xx\",\"error\"))&AQ233&\"]\"),MATCH(AU233,T_FinishColour[Finish / Colour],0)),\"\"),\"\")","v":""},null,"HIDE",null,null,null,"RB92-0404-311215",null,"RB92-0404-311215","T-Spline Slide-on",200,{"$f":"IF(ISBLANK(BL233),\"\",IF(OR(BL233=L_Units),\"Y\",\"N\"))","v":{"$error":"#N/A"}},"Tube",{"$f":"IFERROR(IF(BG233=\"Y\",((INDEX(T_Deduc[Deduction],MATCH(BH233,T_Deduc[Type],0),0))),\"\"),\"\")","v":""},"i_Width","",{"$f":"INDEX(T_UnitSelection[Units],MATCH(i_Units,T_UnitSelection[UnitSelection],0))","v":{"$error":"#N/A"}},{"$f":"IFERROR(IF(ISBLANK(BB233),\"\",INDEX(T_NAV[Base Unit of Measure],MATCH(BB233,T_NAV[No.],0))),\"\")","v":"ROLL"},1,1,{"$f":"IFERROR(INDEX(INDIRECT(\"T_NAV[\"&i_Location&\"]\"),MATCH(1,--(BB233=T_NAV[No.])*--((INDIRECT(\"T_NAV[\"&i_Location&\"]\"))<>\"\"),0))/IF(AND(BF233<>\"\",i_Units=\"Imperial\"),CONVERT(BF233,\"m\",\"in\"),IF(AND(i_Units=\"Imperial\",BM233=\"Metre\"),39.37,IF(BF233<>\"\",BF233,1))),\"\")","v":""},""]
[null,null,1,null,null,null,null,null,null,null,null,null,null,null,null,null,null,null,null,null,null,null,null,null,null,null,null,null,null,"",null,null,null,null,null,null,null,null,null,null,null,null,null,"",null,null,"",{"$f":"IF(ISNUMBER(FIND(\"x\",BD234)),IFERROR(INDEX(INDIRECT(\"T_FinishColour[ColourCode-\"&IF(ISNUMBER(FIND(\"xxx\",BD234)),\"xxx\",IF(ISNUMBER(FIND(\"xx\",BD234)),\"xx\",\"error\"))&AQ234&\"]\"),MATCH(AU234,T_FinishColour[Finish / Colour],0)),\"\"),\"\")","v":""},null,"SHOW",null,null,null,{"$f":"_xlfn.IFNA(SUBSTITUTE(IF(AQ234=\"AU\",SUBSTITUTE(BD234,\"xxx\",AV234),SUBSTITUTE(SUBSTITUTE(BD234,\"xx\",AV234),\"x\",\"\")),\"LLL\",\"580\"),BD234)","v":""},null,null,null,null,{"$f":"IF(ISBLANK(BL234),\"\",IF(OR(BL234=L_Units),\"Y\",\"N\"))","v":""},null,{"$f":"IFERROR(IF(BG234=\"Y\",((INDEX(T_Deduc[Deduction],MATCH(BH234,T_Deduc[Type],0),0))),\"\"),\"\")","v":""},null,"",null,{"$f":"IFERROR(IF(ISBLANK(BB234),\"\",INDEX(T_NAV[Base Unit of Measure],MATCH(BB234,T_NAV[No.],0))),\"\")","v":""},null,"",{"$f":"IFERROR(INDEX(INDIRECT(\"T_NAV[\"&i_Location&\"]\"),MATCH(1,--(BB234=T_NAV[No.])*--((INDIRECT(\"T_NAV[\"&i_Location&\"]\"))<>\"\"),0))/IF(AND(BF234<>\"\",i_Units=\"Imperial\"),CONVERT(BF234,\"m\",\"in\"),IF(AND(i_Units=\"Imperial\",BM234=\"Metre\"),39.37,IF(BF234<>\"\",BF234,1))),\"\")","v":""},{"$f":"IF(AND(AX234=\"SHOW\",BP234<>\"\"),BP234*BO234*IF(AND(BK234<>\"\",OR(BM234=\"LENGTH\",BM234=\"METRE\",BM234=\"ROLL\")),IF(BK234=\"^\",i_Width,(i_Width-BI234))/IF(i_Units=\"Metric\",1000,1),1),\"\")","v":""}]
[null,null,1,"i_FabricWrap",null,"i_WeightBar",null,null,null,null,null,null,null,null,null,null,null,null,null,null,null,null,null,null,null,null,null,null,null,null,null,null,null,null,null,null,null,null,null,null,null,null,null,"",null,null,"",{"$f":"IF(ISNUMBER(FIND(\"x\",BD235)),IFERROR(INDEX(INDIRECT(\"T_FinishColour[ColourCode-\"&IF(ISNUMBER(FIND(\"xxx\",BD235)),\"xxx\",IF(ISNUMBER(FIND(\"xx\",BD235)),\"xx\",\"error\"))&AQ235&\"]\"),MATCH(AU235,T_FinishColour[Finish / Colour],0)),\"\"),\"\")","v":""},null,"SHOW",null,null,null,"FABRIC",null,"FABRIC",null,null,null,null,{"$f":"IFERROR(IF(BG235=\"Y\",((INDEX(T_Deduc[Deduction],MATCH(BH235,T_Deduc[Type],0),0))),\"\"),\"\")","v":""},null,"",null,{"$f":"IFERROR(IF(ISBLANK(BB235),\"\",INDEX(T_NAV[Base Unit of Measure],MATCH(BB235,T_NAV[No.],0))),\"\")","v":""},null,"",{"$f":"IFERROR(INDEX(INDIRECT(\"T_NAV[\"&i_Location&\"]\"),MATCH(1,--(BB235=T_NAV[No.])*--((INDIRECT(\"T_NAV[\"&i_Location&\"]\"))<>\"\"),0))/IF(AND(BF235<>\"\",i_Units=\"Imperial\"),CONVERT(BF235,\"m\",\"in\"),IF(AND(i_Units=\"Imperial\",BM235=\"Metre\"),39.37,IF(BF235<>\"\",BF235,1))),\"\")","v":""},""]
[null,null,1,null,null,null,null,null,null,null,null,null,null,null,null,null,null,null,null,null,null,null,null,null,null,"Y",null,null,null,"",null,null,null,null,null,null,null,null,null,null,null,null,null,"",null,null,"",{"$f":"IF(ISNUMBER(FIND(\"x\",BD236)),IFERROR(INDEX(INDIRECT(\"T_FinishColour[ColourCode-\"&IF(ISNUMBER(FIND(\"xxx\",BD236)),\"xxx\",IF(ISNUMBER(FIND(\"xx\",BD236)),\"xx\",\"error\"))&AQ236&\"]\"),MATCH(AU236,T_FinishColour[Finish / Colour],0)),\"\"),\"\")","v":""},null,"SHOW",null,null,null,"SHADE FABRIC",null,"NOT SUPPLIED","Fabric Width",null,{"$f":"IF(ISBLANK(BL236),\"\",IF(OR(BL236=L_Units),\"Y\",\"N\"))","v":{"$error":"#N/A"}},"Fabric",{"$f":"IFERROR(IF(BG236=\"Y\",((INDEX(T_Deduc[Deduction],MATCH(BH236,T_Deduc[Type],0),0))),\"\"),\"\")","v":""},"i_Width",{"$f":"IFERROR(IF(BG236=\"Y\",(INDIRECT(BJ236)-BI236)/IF(Z236=\"\",1,o_nScreens),\"\"),\"\")","v":""},{"$f":"INDEX(T_UnitSelection[Units],MATCH(i_Units,T_UnitSelection[UnitSelection],0))","v":{"$error":"#N/A"}},{"$f":"IFERROR(IF(ISBLANK(BB236),\"\",INDEX(T_NAV[Base Unit of Measure],MATCH(BB236,T_NAV[No.],0))),\"\")","v":""},1,1,{"$f":"IFERROR(INDEX(INDIRECT(\"T_NAV[\"&i_Location&\"]\"),MATCH(1,--(BB236=T_NAV[No.])*--((INDIRECT(\"T_NAV[\"&i_Location&\"]\"))<>\"\"),0))/IF(AND(BF236<>\"\",i_Units=\"Imperial\"),CONVERT(BF236,\"m\",\"in\"),IF(AND(i_Units=\"Imperial\",BM236=\"Metre\"),39.37,IF(BF236<>\"\",BF236,1))),\"\")","v":""},""]
[null,null,1,null,null,null,null,null,null,null,null,null,null,null,null,null,null,null,null,null,null,null,null,null,null,"Y",null,null,null,{"$f":"IFERROR(IF(AND(o_nScreens>1,Z237=\"Y\",PRODUCT(AA237:AC237)=0),o_nScreens,IF(PRODUCT(AA237:AC237)=0,\"\",PRODUCT(AA237:AC237))),\"\")","v":""},null,null,null,null,null,null,null,null,null,null,null,null,null,{"$f":"IF(ISNUMBER(FIND(\"x\",BD237)),IFERROR(INDEX(AH237:AP237,0,MATCH(AS237,AH237:AP237,0)),IF(AH237<>\"\",AH237,i_DefaultColour)),\"\")","v":""},null,null,{"$f":"IF(ISNUMBER(FIND(\"x\",BD237)),IFERROR(INDEX(AH237:AP237,0,MATCH(AS237,AH237:AP237,0)),AR237),\"\")","v":""},{"$f":"IF(ISNUMBER(FIND(\"x\",BD237)),IFERROR(INDEX(INDIRECT(\"T_FinishColour[ColourCode-\"&IF(ISNUMBER(FIND(\"xxx\",BD237)),\"xxx\",IF(ISNUMBER(FIND(\"xx\",BD237)),\"xx\",\"error\"))&AQ237&\"]\"),MATCH(AU237,T_FinishColour[Finish / Colour],0)),\"\"),\"\")","v":""},null,"SHOW",null,null,null,null,null,null,"Fabric Drop",null,{"$f":"IF(ISBLANK(BL237),\"\",IF(OR(BL237=L_Units),\"Y\",\"N\"))","v":{"$error":"#N/A"}},"Fabric_drop",{"$f":"IFERROR(IF(BG237=\"Y\",((INDEX(T_Deduc[Deduction],MATCH(BH237,T_Deduc[Type],0),0))),\"\"),\"\")","v":""},"i_Drop",{"$f":"IFERROR(IF(BG237=\"Y\",(INDIRECT(BJ237)-BI237),\"\"),\"\")","v":""},{"$f":"INDEX(T_UnitSelection[Units],MATCH(i_Units,T_UnitSelection[UnitSelection],0))","v":{"$error":"#N/A"}},{"$f":"IFERROR(IF(ISBLANK(BB237),\"\",INDEX(T_NAV[Base Unit of Measure],MATCH(BB237,T_NAV[No.],0))),\"\")","v":""},null,null,{"$f":"IFERROR(INDEX(INDIRECT(\"T_NAV[\"&i_Location&\"]\"),MATCH(1,--(BB237=T_NAV[No.])*--((INDIRECT(\"T_NAV[\"&i_Location&\"]\"))<>\"\"),0))/IF(AND(BF237<>\"\",i_Units=\"Imperial\"),CONVERT(BF237,\"m\",\"in\"),IF(AND(i_Units=\"Imperial\",BM237=\"Metre\"),39.37,IF(BF237<>\"\",BF237,1))),\"\")","v":""},{"$f":"IF(AND(AX237=\"SHOW\",BP237<>\"\"),BP237*BO237*IF(AND(BK237<>\"\",OR(BM237=\"LENGTH\",BM237=\"METRE\",BM237=\"ROLL\")),IF(BK237=\"^\",i_Width,(i_Width-BI237))/IF(i_Units=\"Metric\",1000,1),1),\"\")","v":""}]
[null,null,null,"Yes",{"$f":"IFERROR(IF(ISBLANK(D238),\"\",IF(FIND(D238,INDIRECT($D$235))>0,1,0)),0)","v":0},null,null,null,null,null,null,null,null,null,null,null,null,null,null,null,null,null,null,null,null,"Y",null,null,null,"",null,null,null,null,null,null,null,null,null,null,null,null,null,"",null,null,"",{"$f":"IF(ISNUMBER(FIND(\"x\",BD238)),IFERROR(INDEX(INDIRECT(\"T_FinishColour[ColourCode-\"&IF(ISNUMBER(FIND(\"xxx\",BD238)),\"xxx\",IF(ISNUMBER(FIND(\"xx\",BD238)),\"xx\",\"error\"))&AQ238&\"]\"),MATCH(AU238,T_FinishColour[Finish / Colour],0)),\"\"),\"\")","v":""},null,"HIDE",null,null,null,"CASSETTE WRAP",null,"NOT SUPPLIED","Cassette Wrap Width",null,"Y","Mounting Rail",{"$f":"IFERROR(IF(BG238=\"Y\",((INDEX(T_Deduc[Deduction],MATCH(BH238,T_Deduc[Type],0),0))),\"\"),\"\")","v":""},"i_Width",{"$f":"IFERROR(IF(BG238=\"Y\",(INDIRECT(BJ238)-BI238)/IF(Z238=\"\",1,o_nScreens),\"\"),\"\")","v":""},{"$f":"INDEX(T_UnitSelection[Units],MATCH(i_Units,T_UnitSelection[UnitSelection],0))","v":{"$error":"#N/A"}},{"$f":"IFERROR(IF(ISBLANK(BB238),\"\",INDEX(T_NAV[Base Unit of Measure],MATCH(BB238,T_NAV[No.],0))),\"\")","v":""},1,1,{"$f":"IFERROR(INDEX(INDIRECT(\"T_NAV[\"&i_Location&\"]\"),MATCH(1,--(BB238=T_NAV[No.])*--((INDIRECT(\"T_NAV[\"&i_Location&\"]\"))<>\"\"),0))/IF(AND(BF238<>\"\",i_Units=\"Imperial\"),CONVERT(BF238,\"m\",\"in\"),IF(AND(i_Units=\"Imperial\",BM238=\"Metre\"),39.37,IF(BF238<>\"\",BF238,1))),\"\")","v":""},""]
[null,null,null,"Yes",{"$f":"IFERROR(IF(ISBLANK(D239),\"\",IF(FIND(D239,INDIRECT($D$235))>0,1,0)),0)","v":0},null,null,null,null,null,null,null,null,null,null,null,null,null,null,null,null,null,null,null,null,"Y",null,null,null,"",null,null,null,null,null,null,null,null,null,null,null,null,null,"",null,null,"",{"$f":"IF(ISNUMBER(FIND(\"x\",BD239)),IFERROR(INDEX(INDIRECT(\"T_FinishColour[ColourCode-\"&IF(ISNUMBER(FIND(\"xxx\",BD239)),\"xxx\",IF(ISNUMBER(FIND(\"xx\",BD239)),\"xx\",\"error\"))&AQ239&\"]\"),MATCH(AU239,T_FinishColour[Finish / Colour],0)),\"\"),\"\")","v":""},null,{"$f":"AX238","v":"HIDE"},null,null,null,null,null,null,"Cassette Wrap Drop",null,{"$f":"IF(ISBLANK(BL239),\"\",IF(OR(BL239=L_Units),\"Y\",\"N\"))","v":{"$error":"#N/A"}},"Fabric",null,"i_Drop",170,{"$f":"INDEX(T_UnitSelection[Units],MATCH(i_Units,T_UnitSelection[UnitSelection],0))","v":{"$error":"#N/A"}},{"$f":"IFERROR(IF(ISBLANK(BB239),\"\",INDEX(T_NAV[Base Unit of Measure],MATCH(BB239,T_NAV[No.],0))),\"\")","v":""},null,null,{"$f":"IFERROR(INDEX(INDIRECT(\"T_NAV[\"&i_Location&\"]\"),MATCH(1,--(BB239=T_NAV[No.])*--((INDIRECT(\"T_NAV[\"&i_Location&\"]\"))<>\"\"),0))/IF(AND(BF239<>\"\",i_Units=\"Imperial\"),CONVERT(BF239,\"m\",\"in\"),IF(AND(i_Units=\"Imperial\",BM239=\"Metre\"),39.37,IF(BF239<>\"\",BF239,1))),\"\")","v":""},""]
[null,null,1,null,null,null,null,null,null,null,null,null,null,null,null,null,null,null,null,null,null,null,null,null,null,null,null,null,null,null,null,null,null,null,null,null,null,null,null,null,null,null,null,{"$f":"IF(ISNUMBER(FIND(\"x\",BD240)),IFERROR(INDEX(AH240:AP240,0,MATCH(AS240,AH240:AP240,0)),IF(AH240<>\"\",AH240,i_DefaultColour)),\"\")","v":""},null,null,{"$f":"IF(ISNUMBER(FIND(\"x\",BD240)),IFERROR(INDEX(AH240:AP240,0,MATCH(AS240,AH240:AP240,0)),AR240),\"\")","v":""},{"$f":"IF(ISNUMBER(FIND(\"x\",BD240)),IFERROR(INDEX(INDIRECT(\"T_FinishColour[ColourCode-\"&IF(ISNUMBER(FIND(\"xxx\",BD240)),\"xxx\",IF(ISNUMBER(FIND(\"xx\",BD240)),\"xx\",\"error\"))&AQ240&\"]\"),MATCH(AU240,T_FinishColour[Finish / Colour],0)),\"\"),\"\")","v":""},null,{"$f":"IF(AND(ISBLANK(BD240),ISBLANK(C240)),\"HIDE\",IF(PRODUCT(C240:Y240)=1,\"SHOW\",\"HIDE\"))","v":"SHOW"}]
[null,null,1,null,null,null,null,null,null,null,null,null,null,null,null,null,null,null,null,null,null,null,null,null,null,null,null,null,null,null,null,null,null,null,null,null,null,null,null,null,null,null,null,"",null,null,"",{"$f":"IF(ISNUMBER(FIND(\"x\",BD241)),IFERROR(INDEX(INDIRECT(\"T_FinishColour[ColourCode-\"&IF(ISNUMBER(FIND(\"xxx\",BD241)),\"xxx\",IF(ISNUMBER(FIND(\"xx\",BD241)),\"xx\",\"error\"))&AQ241&\"]\"),MATCH(AU241,T_FinishColour[Finish / Colour],0)),\"\"),\"\")","v":""},null,"SHOW",null,null,null,"NOTES",null,"NOTES"]
[null,null,1,null,null,null,null,null,null,null,null,null,null,null,null,null,null,null,null,null,null,null,null,null,null,null,null,null,null,null,null,null,null,null,null,null,null,null,null,null,null,null,null,{"$f":"IF(ISNUMBER(FIND(\"x\",BD242)),IFERROR(INDEX(AH242:AP242,0,MATCH(AS242,AH242:AP242,0)),IF(AH242<>\"\",AH242,i_DefaultColour)),\"\")","v":""},null,null,{"$f":"IF(ISNUMBER(FIND(\"x\",BD242)),IFERROR(INDEX(AH242:AP242,0,MATCH(AS242,AH242:AP242,0)),AR242),\"\")","v":""},{"$f":"IF(ISNUMBER(FIND(\"x\",BD242)),IFERROR(INDEX(INDIRECT(\"T_FinishColour[ColourCode-\"&IF(ISNUMBER(FIND(\"xxx\",BD242)),\"xxx\",IF(ISNUMBER(FIND(\"xx\",BD242)),\"xx\",\"error\"))&AQ242&\"]\"),MATCH(AU242,T_FinishColour[Finish / Colour],0)),\"\"),\"\")","v":""},null,"SHOW",null,null,null,{"$f":"\"Recommended Booster Size: \"&o_BoosterRec&\", Estimated Pre-turns: \"&o_BoosterPreturnRec","v":{"$error":"#N/A"}}]
[null,null,1,null,null,null,null,null,null,null,null,null,null,null,null,null,null,null,null,null,null,null,null,null,null,null,null,null,null,null,null,null,null,null,null,null,null,null,null,null,null,null,null,{"$f":"IF(ISNUMBER(FIND(\"x\",BD243)),IFERROR(INDEX(AH243:AP243,0,MATCH(AS243,AH243:AP243,0)),IF(AH243<>\"\",AH243,i_DefaultColour)),\"\")","v":""},null,null,{"$f":"IF(ISNUMBER(FIND(\"x\",BD243)),IFERROR(INDEX(AH243:AP243,0,MATCH(AS243,AH243:AP243,0)),AR243),\"\")","v":""},{"$f":"IF(ISNUMBER(FIND(\"x\",BD243)),IFERROR(INDEX(INDIRECT(\"T_FinishColour[ColourCode-\"&IF(ISNUMBER(FIND(\"xxx\",BD243)),\"xxx\",IF(ISNUMBER(FIND(\"xx\",BD243)),\"xx\",\"error\"))&AQ243&\"]\"),MATCH(AU243,T_FinishColour[Finish / Colour],0)),\"\"),\"\")","v":""},null,"SHOW",null,null,null,{"$f":"\"Fabric Orientation: \"&i_FabricOrientation","v":"Fabric Orientation: "}]
[null,null,null,null,null,null,null,null,null,null,null,null,null,null,null,null,null,null,null,null,null,null,null,null,null,null,null,null,null,null,null,null,null,null,null,null,null,null,null,null,null,null,null,{"$f":"IF(ISNUMBER(FIND(\"x\",BD244)),IFERROR(INDEX(AH244:AP244,0,MATCH(AS244,AH244:AP244,0)),IF(AH244<>\"\",AH244,i_DefaultColour)),\"\")","v":""},null,null,{"$f":"IF(ISNUMBER(FIND(\"x\",BD244)),IFERROR(INDEX(AH244:AP244,0,MATCH(AS244,AH244:AP244,0)),AR244),\"\")","v":""},{"$f":"IF(ISNUMBER(FIND(\"x\",BD244)),IFERROR(INDEX(INDIRECT(\"T_FinishColour[ColourCode-\"&IF(ISNUMBER(FIND(\"xxx\",BD244)),\"xxx\",IF(ISNUMBER(FIND(\"xx\",BD244)),\"xx\",\"error\"))&AQ244&\"]\"),MATCH(AU244,T_FinishColour[Finish / Colour],0)),\"\"),\"\")","v":""},null,"HIDE"]
[null,null,1,null,null,null,null,null,null,null,null,null,null,null,null,null,null,null,null,null,null,null,null,null,null,null,null,null,null,null,null,null,null,null,null,null,null,null,null,null,null,null,null,"",null,null,"",{"$f":"IF(ISNUMBER(FIND(\"x\",BD245)),IFERROR(INDEX(INDIRECT(\"T_FinishColour[ColourCode-\"&IF(ISNUMBER(FIND(\"xxx\",BD245)),\"xxx\",IF(ISNUMBER(FIND(\"xx\",BD245)),\"xx\",\"error\"))&AQ245&\"]\"),MATCH(AU245,T_FinishColour[Finish / Colour],0)),\"\"),\"\")","v":""},null,"SHOW"]
[null,null,1,null,null,null,null,null,null,null,null,null,null,null,null,null,null,null,null,null,null,null,null,null,null,null,null,null,null,null,null,null,null,null,null,null,null,null,null,null,null,null,null,"",null,null,"",{"$f":"IF(ISNUMBER(FIND(\"x\",BD246)),IFERROR(INDEX(INDIRECT(\"T_FinishColour[ColourCode-\"&IF(ISNUMBER(FIND(\"xxx\",BD246)),\"xxx\",IF(ISNUMBER(FIND(\"xx\",BD246)),\"xx\",\"error\"))&AQ246&\"]\"),MATCH(AU246,T_FinishColour[Finish / Colour],0)),\"\"),\"\")","v":""},null,{"$f":"IF(i_Location=\"AU\",\"SHOW\",\"HIDE\")","v":"HIDE"},null,null,null,null,null,null,null,null,null,null,null,null,null,null,null,null,{"$f":"\"ESTIMATED COST: (\"&i_Currency&\")\"","v":{"$error":"#N/A"}},null,{"$f":"SUM(BQ16:BQ239)","v":0}]
[null,null,1,null,null,null,null,null,null,null,null,null,null,null,null,null,null,null,null,null,null,null,null,null,null,null,null,null,null,null,null,null,null,null,null,null,null,null,null,null,null,null,null,"",null,null,"",{"$f":"IF(ISNUMBER(FIND(\"x\",BD247)),IFERROR(INDEX(INDIRECT(\"T_FinishColour[ColourCode-\"&IF(ISNUMBER(FIND(\"xxx\",BD247)),\"xxx\",IF(ISNUMBER(FIND(\"xx\",BD247)),\"xx\",\"error\"))&AQ247&\"]\"),MATCH(AU247,T_FinishColour[Finish / Colour],0)),\"\"),\"\")","v":""},null,"HIDE",null,null,null,null,null,null,null,null,null,null,null,null,null,null,null,null,{"$f":"\"Discount (\"&i_Discount*100&\"%)\"","v":"Discount (0%)"},null,{"$f":"BQ246*i_Discount","v":0}]
[null,null,1,null,null,null,null,null,null,null,null,null,null,null,null,null,null,null,null,null,null,null,null,null,null,null,null,null,null,null,null,null,null,null,null,null,null,null,null,null,null,null,null,"",null,null,"",{"$f":"IF(ISNUMBER(FIND(\"x\",BD248)),IFERROR(INDEX(INDIRECT(\"T_FinishColour[ColourCode-\"&IF(ISNUMBER(FIND(\"xxx\",BD248)),\"xxx\",IF(ISNUMBER(FIND(\"xx\",BD248)),\"xx\",\"error\"))&AQ248&\"]\"),MATCH(AU248,T_FinishColour[Finish / Colour],0)),\"\"),\"\")","v":""},null,"HIDE",null,null,null,null,null,null,null,null,null,null,null,null,null,null,null,null,{"$f":"\"TOTAL Est. ex. GST: (\"&i_Currency&\")\"","v":{"$error":"#N/A"}},null,{"$f":"BQ246-BQ247","v":0}]
[null,null,null,null,null,null,null,null,null,null,null,null,null,null,null,null,null,null,null,null,null,null,null,null,null,null,null,null,null,null,null,null,null,null,null,null,null,null,null,null,null,null,null,"",null,null,"",{"$f":"IF(ISNUMBER(FIND(\"x\",BD249)),IFERROR(INDEX(INDIRECT(\"T_FinishColour[ColourCode-\"&IF(ISNUMBER(FIND(\"xxx\",BD249)),\"xxx\",IF(ISNUMBER(FIND(\"xx\",BD249)),\"xx\",\"error\"))&AQ249&\"]\"),MATCH(AU249,T_FinishColour[Finish / Colour],0)),\"\"),\"\")","v":""},null,"HIDE"]
[null,null,null,null,null,null,null,null,null,null,null,null,null,null,null,null,null,null,null,null,null,null,null,null,null,null,null,null,null,null,null,null,null,null,null,null,null,null,null,null,null,null,null,"",null,null,"",{"$f":"IF(ISNUMBER(FIND(\"x\",BD250)),IFERROR(INDEX(INDIRECT(\"T_FinishColour[ColourCode-\"&IF(ISNUMBER(FIND(\"xxx\",BD250)),\"xxx\",IF(ISNUMBER(FIND(\"xx\",BD250)),\"xx\",\"error\"))&AQ250&\"]\"),MATCH(AU250,T_FinishColour[Finish / Colour],0)),\"\"),\"\")","v":""},null,"HIDE"]
[null,null,null,null,null,null,null,null,null,null,null,null,null,null,null,null,null,null,null,null,null,null,null,null,null,null,null,null,null,null,null,null,null,null,null,null,null,null,null,null,null,null,null,"",null,null,"",{"$f":"IF(ISNUMBER(FIND(\"x\",BD251)),IFERROR(INDEX(INDIRECT(\"T_FinishColour[ColourCode-\"&IF(ISNUMBER(FIND(\"xxx\",BD251)),\"xxx\",IF(ISNUMBER(FIND(\"xx\",BD251)),\"xx\",\"error\"))&AQ251&\"]\"),MATCH(AU251,T_FinishColour[Finish / Colour],0)),\"\"),\"\")","v":""},null,"HIDE"]
[null,null,null,null,null,null,null,null,null,null,null,null,null,null,null,null,null,null,null,null,null,null,null,null,null,null,null,null,null,null,null,null,null,null,null,null,null,null,null,null,null,null,null,"",null,null,"",{"$f":"IF(ISNUMBER(FIND(\"x\",BD252)),IFERROR(INDEX(INDIRECT(\"T_FinishColour[ColourCode-\"&IF(ISNUMBER(FIND(\"xxx\",BD252)),\"xxx\",IF(ISNUMBER(FIND(\"xx\",BD252)),\"xx\",\"error\"))&AQ252&\"]\"),MATCH(AU252,T_FinishColour[Finish / Colour],0)),\"\"),\"\")","v":""},null,"HIDE"]
[null,null,null,null,null,null,null,null,null,null,null,null,null,null,null,null,null,null,null,null,null,null,null,null,null,null,null,null,null,null,null,null,null,null,null,null,null,null,null,null,null,null,null,"",null,null,"",{"$f":"IF(ISNUMBER(FIND(\"x\",BD253)),IFERROR(INDEX(INDIRECT(\"T_FinishColour[ColourCode-\"&IF(ISNUMBER(FIND(\"xxx\",BD253)),\"xxx\",IF(ISNUMBER(FIND(\"xx\",BD253)),\"xx\",\"error\"))&AQ253&\"]\"),MATCH(AU253,T_FinishColour[Finish / Colour],0)),\"\"),\"\")","v":""},null,"HIDE"]
[null,null,null,null,null,null,null,null,null,null,null,null,null,null,null,null,null,null,null,null,null,null,null,null,null,null,null,null,null,null,null,null,null,null,null,null,null,null,null,null,null,null,null,"",null,null,"",{"$f":"IF(ISNUMBER(FIND(\"x\",BD254)),IFERROR(INDEX(INDIRECT(\"T_FinishColour[ColourCode-\"&IF(ISNUMBER(FIND(\"xxx\",BD254)),\"xxx\",IF(ISNUMBER(FIND(\"xx\",BD254)),\"xx\",\"error\"))&AQ254&\"]\"),MATCH(AU254,T_FinishColour[Finish / Colour],0)),\"\"),\"\")","v":""},null,{"$f":"IF(AND(ISBLANK(BD254),ISBLANK(C254)),\"HIDE\",IF(PRODUCT(C254:Y254)=1,\"SHOW\",\"HIDE\"))","v":"HIDE"}]
[null,null,null,null,null,null,null,null,null,null,null,null,null,null,null,null,null,null,null,null,null,null,null,null,null,null,null,null,null,null,null,null,null,null,null,null,null,null,null,null,null,null,null,"",null,null,"",{"$f":"IF(ISNUMBER(FIND(\"x\",BD255)),IFERROR(INDEX(INDIRECT(\"T_FinishColour[ColourCode-\"&IF(ISNUMBER(FIND(\"xxx\",BD255)),\"xxx\",IF(ISNUMBER(FIND(\"xx\",BD255)),\"xx\",\"error\"))&AQ255&\"]\"),MATCH(AU255,T_FinishColour[Finish / Colour],0)),\"\"),\"\")","v":""},null,{"$f":"IF(AND(ISBLANK(BD255),ISBLANK(C255)),\"HIDE\",IF(PRODUCT(C255:Y255)=1,\"SHOW\",\"HIDE\"))","v":"HIDE"}]
[null,null,null,null,null,null,null,null,null,null,null,null,null,null,null,null,null,null,null,null,null,null,null,null,null,null,null,null,null,null,null,null,null,null,null,null,null,null,null,null,null,null,null,null,null,null,"",{"$f":"IF(ISNUMBER(FIND(\"x\",BD256)),IFERROR(INDEX(INDIRECT(\"T_FinishColour[ColourCode-\"&IF(ISNUMBER(FIND(\"xxx\",BD256)),\"xxx\",IF(ISNUMBER(FIND(\"xx\",BD256)),\"xx\",\"error\"))&AQ256&\"]\"),MATCH(AU256,T_FinishColour[Finish / Colour],0)),\"\"),\"\")","v":""},null,{"$f":"IF(AND(ISBLANK(BD256),ISBLANK(C256)),\"HIDE\",IF(PRODUCT(C256:Y256)=1,\"SHOW\",\"HIDE\"))","v":"HIDE"}]

{"sheet":"Ctrl_Selections","index":3,"n_rows":536,"n_cols":14,"rows_kept":536,"cut":false,"hidden":true,"merged":[[392,2,393,2],[392,3,393,3],[517,3,519,3],[517,2,519,2],[489,4,489,13],[491,2,492,2],[491,3,492,3],[502,3,502,13],[514,4,514,13],[423,3,424,3],[458,3,460,3],[461,3,462,3],[425,3,429,3],[425,2,429,2],[440,3,440,13],[364,2,369,2],[364,3,369,3],[290,3,290,13],[307,2,310,2],[303,4,303,13],[350,2,356,2],[350,3,356,3],[346,3,349,3],[357,3,363,3],[69,2,70,2],[69,3,70,3],[82,3,82,13],[121,4,121,13],[94,4,94,13],[96,2,98,2],[96,3,98,3],[109,3,109,13],[99,2,100,2],[99,3,100,3],[2,0,2,1],[33,4,33,13],[37,3,39,3],[275,3,277,3],[251,3,251,13],[200,3,202,3],[200,2,202,2],[272,4,272,13],[233,4,233,13],[235,2,239,2],[235,3,239,3],[123,2,126,2],[143,3,143,13],[158,2,161,2],[156,4,156,13],[158,3,161,3],[275,2,277,2],[162,2,165,2],[162,3,165,3],[197,2,199,2],[197,3,199,3],[182,3,182,13],[203,2,207,2],[203,3,207,3],[166,2,172,2],[243,3,244,3],[258,3,258,13],[127,2,130,2],[166,3,172,3],[131,2,135,2],[131,3,135,3],[195,4,195,13],[123,3,126,3],[127,3,130,3],[217,3,217,13],[408,3,408,13],[279,3,280,3],[390,4,390,13],[67,3,68,3],[5,4,5,13],[20,3,20,13],[7,2,8,2],[7,3,8,3],[52,3,52,13],[35,2,36,2],[35,3,36,3],[37,2,39,2],[65,4,65,13],[67,2,68,2],[528,3,528,13],[305,2,306,2],[344,4,344,13],[346,2,349,2],[376,3,376,13],[357,2,363,2],[327,3,327,13],[311,2,316,2],[452,4,452,13],[477,3,477,13],[454,2,457,2],[458,2,460,2],[461,2,462,2],[421,4,421,13],[423,2,424,2],[454,3,457,3]]}
[null,null,"=IF(INDIRECT(\"i_\"&SUBSTITUTE(D55,\" \",\"\")),0,\"No\") if a default value is required"]
[]
["Configuration Matrix"]
[]
[]
[null,null,"INPUT DEPENDENCIES","SELECTION OPTIONS","CONFIGURATIONS"]
[null,null,"Ref Position →",{"$f":"COUNTA(D8:D11)","v":1},{"$f":"SUM(COUNTIF(E8:E11,$C8:$C11))","v":0},{"$f":"SUM(COUNTIF(F8:F11,$C8:$C11))","v":0},{"$f":"SUM(COUNTIF(G8:G11,$C$198:$C$203))","v":0},{"$f":"SUM(COUNTIF(H8:H11,$C$198:$C$203))","v":0},{"$f":"SUM(COUNTIF(I8:I11,$C$198:$C$203))","v":0},{"$f":"SUM(COUNTIF(J8:J11,$C$198:$C$203))","v":0},{"$f":"SUM(COUNTIF(K8:K11,$C$198:$C$203))","v":0},{"$f":"SUM(COUNTIF(L8:L11,$C$198:$C$203))","v":0},{"$f":"SUM(COUNTIF(M8:M11,$C$198:$C$203))","v":0},{"$f":"SUM(COUNTIF(N8:N11,$C$198:$C$203))","v":0}]
[null,"Input Selection 2->",{"$f":"INDIRECT(\"i_\"&SUBSTITUTE(D8,\" \",\"\"))","v":0},"Location","AU","US"]
[null,"Input Selection 3->",null,null,"EU"]
[]
[null,"Input Selection 4->"]
[]
[null,null,null,{"$f":"MAX(E13:N13)","v":0},{"$f":"IF(E7<>$D7,0,COUNTA(E14:E20))","v":0},{"$f":"IF(F7<>$D7,0,COUNTA(F14:F20))","v":0},{"$f":"IF(G7<>$D7,0,COUNTA(G14:G20))","v":0},0,0,0,0,0,0,0]
[null,"Dependent (Output List) 1 -> ",null,"Control Type","Easy Spring Wand (ESW)","Easy Spring Wand (ESW)"]
[null,null,null,null,"Easy Spring Ultra (ESU)","Easy Spring Ultra (ESU)"]
[null,null,null,null,null,"Easy Spring Ultra - Skyline"]
[]
[]
[]
[]
[null,null,null,"DO NOT FILL"]
[]
[]
[null,null,null,{"$f":"D14","v":"Control Type"}]
[null,null,"row",{"$f":"MATCH(D24,$D7:$D22,0)","v":8}]
[null,null,"column",{"$f":"MATCH(OFFSET($D7,MATCH(D24,$D7:$D22,0)-2,0),OFFSET($D7,MATCH(D24,$D7:$D22,0)-2,1,1,11),0)+1","v":2}]
[null,null,"Size",{"$f":"OFFSET($D7,MATCH(D24,$D7:$D22,0)-2,0,)","v":0},{"$f":"OFFSET(Ctrl_Selections!$D$7,Ctrl_Selections!$D$25-1,Ctrl_Selections!$D$26-1,Ctrl_Selections!$D$27)","v":{"$error":"#REF!"}}]
[null,null,"Test →"]
[null,null,"Data Validation Name",{"$f":"\"L_\"&SUBSTITUTE(D24,\" \",\"\")","v":"L_ControlType"}]
[]
[]
[]
[]
[null,null,"INPUT DEPENDENCIES","SELECTION OPTIONS","CONFIGURATIONS"]
[null,null,"Ref Position →",{"$f":"COUNTA(D36:D40)","v":2},{"$f":"SUM(COUNTIF(E36:E40,$C36:$C40))","v":0},{"$f":"SUM(COUNTIF(F36:F40,$C36:$C40))","v":0},{"$f":"SUM(COUNTIF(G36:G40,$C36:$C40))","v":0},{"$f":"SUM(COUNTIF(H36:H40,$C36:$C40))","v":0},{"$f":"SUM(COUNTIF(I36:I40,$C36:$C40))","v":0},{"$f":"SUM(COUNTIF(J36:J40,$C36:$C40))","v":0},{"$f":"SUM(COUNTIF(K36:K40,$C36:$C40))","v":0},{"$f":"SUM(COUNTIF(L36:L40,$C36:$C40))","v":0},{"$f":"SUM(COUNTIF(M36:M40,$C36:$C40))","v":0},{"$f":"SUM(COUNTIF(N36:N40,$C36:$C40))","v":0}]
[null,"Input Selection 1 ->",{"$f":"INDIRECT(\"i_\"&SUBSTITUTE(D36,\" \",\"\"))","v":0},"Location","AU","US","US","EU"]
[]
[null,"Input Selection 3->",{"$f":"INDIRECT(\"i_\"&SUBSTITUTE(D38,\" \",\"\"))","v":0},"Control Type","Easy Spring Wand (ESW)","Easy Spring Wand (ESW)","Easy Spring Ultra - Skyline","Easy Spring Wand (ESW)"]
[null,null,null,null,"Easy Spring Ultra (ESU)","Easy Spring Ultra (ESU)",null,"Easy Spring Ultra (ESU)"]
[null,"Input Selection 4->"]
[]
[null,null,null,{"$f":"MAX(E42:N42)","v":0},{"$f":"IF(E35<>$D35,0,COUNTA(E43:E52))","v":0},0,0,0,0,0,0,0,0,0]
[null,"Dependent (Output List) 1 -> ",null,"Installation Type","CF90 Cassette","Cassette 100","Skyline Fascia","CF90 Cassette"]
[null,null,null,null,"CF90 Fascia","Cassette 110","Cassette 100","CF90 Fascia"]
[null,null,null,null,"Mounting Rail","Cassette 120","Cassette 110","Mounting Rail"]
[null,null,null,null,"P95 Semi Cassette","CF90 Cassette","Cassette 120","Open"]
[null,null,null,null,"Open","CF90 Fascia","CF90 Cassette"]
[null,null,null,null,null,"Mounting Rail","CF90 Fascia"]
[null,null,null,null,null,"P95 Semi Cassette","Mounting Rail"]
[null,null,null,null,null,"Open","P95 Semi Cassette"]
[null,null,null,null,null,null,"Open"]
[]
[null,null,null,"DO NOT FILL"]
[]
[]
[null,null,null,{"$f":"D43","v":"Installation Type"},"FRS Valance 80","FRS Valance 80","FRS Valance 80",{"$f":"IFERROR(INDEX(#REF!, MATCH(0, COUNTIF($D56:G$221,#REF!) + ( COUNTIF(#REF!,#REF!)<>1), 0)), \"\")","v":""},{"$f":"IFERROR(INDEX(#REF!, MATCH(0, COUNTIF($D56:H$221,#REF!) + ( COUNTIF(#REF!,#REF!)<>1), 0)), \"\")","v":""}]
[null,null,"row",{"$f":"MATCH(D56,$D35:$D54,0)","v":9},"FRS Valance 100","FRS Valance 100","FRS Valance 100"]
[null,null,"column",{"$f":"MATCH(OFFSET($D35,MATCH(D56,$D35:$D54,0)-2,0),OFFSET($D35,MATCH(D56,$D35:$D54,0)-2,1,1,11),0)+1","v":2}]
[null,null,"Size",{"$f":"OFFSET($D35,MATCH(D56,$D35:$D54,0)-2,0,)","v":0}]
[null,null,"Test →"]
[null,null,"Data Validation Name",{"$f":"\"L_\"&SUBSTITUTE(D56,\" \",\"\")","v":"L_InstallationType"}]
[]
[]
[]
[]
[null,null,"INPUT DEPENDENCIES","SELECTION OPTIONS","CONFIGURATIONS"]
[null,null,"Ref Position →",{"$f":"COUNTA(D68:D70)","v":2},{"$f":"SUM(COUNTIF(E68:E73,$C$68:$C$73))","v":0},{"$f":"SUM(COUNTIF(F68:F73,$C$67:$C$73))","v":0},{"$f":"SUM(COUNTIF(G68:G73,$C$67:$C$73))","v":0},{"$f":"SUM(COUNTIF(H68:H73,#REF!))","v":0},{"$f":"SUM(COUNTIF(I68:I73,#REF!))","v":0},{"$f":"SUM(COUNTIF(J68:J73,#REF!))","v":0},{"$f":"SUM(COUNTIF(K68:K73,#REF!))","v":0},{"$f":"SUM(COUNTIF(L68:L73,#REF!))","v":0},{"$f":"SUM(COUNTIF(M68:M73,#REF!))","v":0},{"$f":"SUM(COUNTIF(N68:N73,#REF!))","v":0}]
[null,"Input Selection 1 ->",{"$f":"i_Location","v":0},"Location","US","AU","US"]
[null,"Input Selection 2->"]
[null,"Input Selection 3->",{"$f":"i_InstallationType","v":0},"Installation Type","P95 Semi Cassette","P95 Semi Cassette","Cassette 110"]
[]
[]
[null,"Input Selection 4->"]
[]
[null,null,null,{"$f":"MAX(E75:N75)","v":0},{"$f":"IF(E67<>$D67,0,COUNTA(E76:E82))","v":0},{"$f":"IF(F67<>$D67,0,COUNTA(F76:F82))","v":0},0,0,0,0,0,0,0,0]
[null,"Dependent (Output List) 1 -> ",null,"PelmetSpline","4.1mm Round Spline + Flat Spline No Tape","4.6mm Round Spline + Flat Spline No Tape","4.6mm Round Spline + Flat Spline No Tape"]
[null,null,null,null,"4.1mm Round Spline + Flat Spline DBL Side Tape x1 Side","4.6mm Round Spline + Flat Spline DBL Side Tape x1 Side","4.6mm Round Spline + Flat Spline DBL Side Tape x1 Side"]
[null,null,null,null,"4.1mm Round Spline + Flat Spline DBL Side Tape x2 Side","4.6mm Round Spline + Flat Spline DBL Side Tape x2 Side","4.6mm Round Spline + Flat Spline DBL Side Tape x2 Side"]
[null,null,null,null,"4.6mm Round Spline + Flat Spline No Tape"]
[null,null,null,null,"4.6mm Round Spline + Flat Spline DBL Side Tape x1 Side"]
[null,null,null,null,"4.6mm Round Spline + Flat Spline DBL Side Tape x2 Side"]
[]
[null,null,null,"DO NOT FILL"]
[]
[null,null,null,{"$f":"D76","v":"PelmetSpline"},null,null,null,{"$f":"IFERROR(INDEX(#REF!, MATCH(0, COUNTIF($D85:G$221,#REF!) + ( COUNTIF(#REF!,#REF!)<>1), 0)), \"\")","v":""},{"$f":"IFERROR(INDEX(#REF!, MATCH(0, COUNTIF($D85:H$221,#REF!) + ( COUNTIF(#REF!,#REF!)<>1), 0)), \"\")","v":""}]
[null,null,"row",{"$f":"MATCH(D85,$D67:$D84,0)","v":10}]
[null,null,"column",{"$f":"MATCH(OFFSET($D67,MATCH(D85,$D67:$D84,0)-2,0),OFFSET($D67,MATCH(D85,$D67:$D84,0)-2,1,1,11),0)+1","v":2}]
[null,null,"Size",{"$f":"OFFSET($D67,MATCH(D85,$D67:$D84,0)-2,0,)","v":0}]
[null,null,"Test →","4.1mm Round Spline + Flat Spline No Tape"]
[null,null,"Data Validation Name",{"$f":"\"L_\"&SUBSTITUTE(D85,\" \",\"\")","v":"L_PelmetSpline"}]
[]
[]
[]
[]
[null,null,"INPUT DEPENDENCIES","SELECTION OPTIONS","CONFIGURATIONS"]
[null,null,"Ref Position →",{"$f":"COUNTA(D97:D100)","v":1},{"$f":"SUM(COUNTIF(E97:E103,$C$97:$C$103))","v":0},{"$f":"SUM(COUNTIF(F97:F103,$C$97:$C$103))","v":0},{"$f":"SUM(COUNTIF(G97:G103,$C$97:$C$103))","v":0},{"$f":"SUM(COUNTIF(H97:H103,$C$97:$C$103))","v":0},{"$f":"SUM(COUNTIF(I97:I103,$C$97:$C$103))","v":0},{"$f":"SUM(COUNTIF(J97:J103,#REF!))","v":0},{"$f":"SUM(COUNTIF(K97:K103,#REF!))","v":0},{"$f":"SUM(COUNTIF(L97:L103,#REF!))","v":0},{"$f":"SUM(COUNTIF(M97:M103,#REF!))","v":0},{"$f":"SUM(COUNTIF(N97:N103,#REF!))","v":0}]
[null,"Input Selection 1 ->",{"$f":"i_InstallationType","v":0},"Installation Type","CF90 Cassette","P95 Semi Cassette","Cassette 100","Cassette 120","Cassette 110"]
[null,null,null,null,"CF90 Fascia"]
[null,"Input Selection 2->"]
[null,"Input Selection 3->"]
[]
[]
[null,"Input Selection 4->"]
[]
[null,null,null,{"$f":"MAX(E105:N105)","v":0},{"$f":"IF(E96<>$D96,0,COUNTA(E106:E109))","v":0},{"$f":"IF(F96<>$D96,0,COUNTA(F106:F109))","v":0},0,0,0,0,0,0,0,0]
[null,"Dependent (Output List) 1 -> ",null,"FixingOptions","Top Fix w/ Mounting Bracket","Universal Fix","100/110 Mounting Bracket","120 Mounting Bracket","100/110 Mounting Bracket"]
[null,null,null,null,"Face Fix w/ Mounting Bracket","Top/Ceiling Fix",null,null,"Direct Screw Fixing (No Bracket)"]
[]
[]
[null,null,null,"DO NOT FILL"]
[]
[null,null,null,{"$f":"D106","v":"FixingOptions"},null,null,null,{"$f":"IFERROR(INDEX(#REF!, MATCH(0, COUNTIF($D112:G$221,#REF!) + ( COUNTIF(#REF!,#REF!)<>1), 0)), \"\")","v":""},{"$f":"IFERROR(INDEX(#REF!, MATCH(0, COUNTIF($D112:H$221,#REF!) + ( COUNTIF(#REF!,#REF!)<>1), 0)), \"\")","v":""}]
[null,null,"row",{"$f":"MATCH(D112,$D96:$D111,0)","v":11}]
[null,null,"column",{"$f":"MATCH(OFFSET($D96,MATCH(D112,$D96:$D111,0)-2,0),OFFSET($D96,MATCH(D112,$D96:$D111,0)-2,1,1,11),0)+1","v":2}]
[null,null,"Size",{"$f":"OFFSET($D96,MATCH(D112,$D96:$D111,0)-2,0,)","v":0}]
[null,null,"Test →","Universal Fix"]
[null,null,"Data Validation Name",{"$f":"\"L_\"&SUBSTITUTE(D112,\" \",\"\")","v":"L_FixingOptions"}]
[]
[]
[]
[]
[null,null,"INPUT DEPENDENCIES","SELECTION OPTIONS","CONFIGURATIONS"]
[null,null,"Ref Position →",{"$f":"COUNTA(D124:D136)","v":2},{"$f":"SUM(COUNTIF(E124:E136,$C$124:$C$136))","v":0},{"$f":"SUM(COUNTIF(F124:F136,$C$124:$C$136))","v":0},{"$f":"SUM(COUNTIF(G124:G136,$C$124:$C$136))","v":0},{"$f":"SUM(COUNTIF(H124:H136,$C$124:$C$136))","v":0},{"$f":"SUM(COUNTIF(I124:I136,$C$124:$C$136))","v":0},{"$f":"SUM(COUNTIF(J124:J136,$C$124:$C$136))","v":0},{"$f":"SUM(COUNTIF(K124:K136,$C$124:$C$136))","v":0},{"$f":"SUM(COUNTIF(L124:L136,$C$124:$C$136))","v":0},{"$f":"SUM(COUNTIF(M124:M136,$C$124:$C$136))","v":0},{"$f":"SUM(COUNTIF(N124:N136,$C$124:$C$136))","v":0}]
[null,"Input Selection 3->",{"$f":"i_Location","v":0},"Location","US","US","AU","US"]
[null,null,null,null,null,null,"EU"]
[]
[]
[null,null,{"$f":"i_ControlType","v":0},"Control Type","Easy Spring Ultra - Skyline","Easy Spring Ultra (ESU)","Easy Spring Ultra (ESU)","Easy Spring Wand (ESW)"]
[null,null,null,null,null,null,"Easy Spring Wand (ESW)"]
[]
[]
[]
[]
[]
[]
[]
[]
[null,null,null,{"$f":"MAX(E138:N138)","v":0},{"$f":"IF(E123<>$D123,0,COUNTA(E139:E143))","v":0},0,0,0,0,0,0,0,0,0]
[null,"Dependent (Output List) 1 -> ",null,"Tube","1.5\"","S45 LT","S45 LT","1.5\""]
[null,null,null,null,null,"S45 STD","S45 STD","S45 LT"]
[null,null,null,null,null,"S45 HD","S45 HD","S45 STD"]
[null,null,null,null,null,null,null,"S45 HD"]
[]
[null,null,null,"DO NOT FILL"]
[]
[]
[null,null,null,{"$f":"D139","v":"Tube"},null,"FRS Valance 80"]
[null,null,"row",{"$f":"MATCH(D147,$D123:$D145,0)","v":17},null,"FRS Valance 100"]
[null,null,"column",{"$f":"MATCH(OFFSET($D123,MATCH(D147,$D123:$D145,0)-2,0),OFFSET($D123,MATCH(D147,$D123:$D145,0)-2,1,1,11),0)+1","v":2}]
[null,null,"Size",{"$f":"OFFSET($D123,MATCH(D147,$D123:$D145,0)-2,0,)","v":0},null,"=OFFSET($D$134,OFFSET(INDIRECT(ADDRESS(ROW(),COLUMN(),4)),-3,0)-1,OFFSET(INDIRECT(ADDRESS(ROW(),COLUMN(),4)),-2,0)-1,OFFSET(INDIRECT(ADDRESS(ROW(),COLUMN(),4)),-1,0))"]
[null,null,"Test →"]
[null,null,"Data Validation Name",{"$f":"\"L_\"&SUBSTITUTE(D147,\" \",\"\")","v":"L_Tube"}]
[]
[]
[]
[]
[null,null,"INPUT DEPENDENCIES","SELECTION OPTIONS","CONFIGURATIONS"]
[null,null,"Ref Position →",{"$f":"COUNTA(D159:D173)","v":3},{"$f":"SUM(COUNTIF(E159:E173,$C159:$C173))","v":0},{"$f":"SUM(COUNTIF(F159:F173,$C159:$C173))","v":0},{"$f":"SUM(COUNTIF(G159:G176,$C159:$C173))","v":0},{"$f":"SUM(COUNTIF(H159:H176,$C159:$C173))","v":0},{"$f":"SUM(COUNTIF(I159:I173,$C159:$C173))","v":0},{"$f":"SUM(COUNTIF(J159:J173,$C159:$C173))","v":0},{"$f":"SUM(COUNTIF(K159:K173,$C159:$C173))","v":0},{"$f":"SUM(COUNTIF(L159:L173,$C159:$C173))","v":0},{"$f":"SUM(COUNTIF(M159:M173,$C159:$C173))","v":0},{"$f":"SUM(COUNTIF(N159:N173,$C159:$C173))","v":0}]
[null,"Input Selection 1 ->",{"$f":"INDIRECT(\"i_\"&SUBSTITUTE(D159,\" \",\"\"))","v":0},"Location","US","US","US","AU",null,"US","US","US","US"]
[null,"Input Selection 2->",null,null,null,null,"AU"]
[]
[]
[null,"Input Selection 1 ->",{"$f":"INDIRECT(\"i_\"&SUBSTITUTE(D163,\" \",\"\"))","v":0},"Control Type","Easy Spring Ultra (ESU)","Easy Spring Ultra - Skyline","Easy Spring Wand (ESW)","Easy Spring Ultra (ESU)",null,"Easy Spring Ultra - Skyline","Easy Spring Ultra - Skyline","Easy Spring Ultra - Skyline","Easy Spring Ultra - Skyline"]
[null,"Input Selection 2->",null,null,"Easy Spring Wand (ESW)",null,null,null,null,null,"Easy Spring Wand (ESW)"]
[]
[]
[null,"Input Selection 3->",{"$f":"INDIRECT(\"i_\"&SUBSTITUTE(D167,\" \",\"\"))","v":0},"Installation Type","Cassette 100","Cassette 100","CF90 Cassette","CF90 Cassette",null,"CF90 Cassette","Open","Skyline Fascia","Mounting Rail"]
[null,null,null,null,"Cassette 120","Cassette 120","CF90 Fascia","CF90 Fascia",null,"CF90 Fascia"]
[null,null,null,null,null,null,"Mounting Rail","Mounting Rail",null,"Cassette 110"]
[null,null,null,null,null,null,"P95 Semi Cassette","P95 Semi Cassette",null,"P95 Semi Cassette"]
[null,null,null,null,null,null,"FRS Valance 80","FRS Valance 80",null,"FRS Valance 80"]
[null,null,null,null,null,null,"FRS Valance 100","FRS Valance 100",null,"FRS Valance 100"]
[null,"Input Selection 4->",null,null,null,null,"Cassette 110","Cassette 110"]
[]
[]
[null,null,null,null,null,null,null,"Open"]
[null,null,null,{"$f":"MAX(E177:N177)","v":0},{"$f":"IF(E158<>$D158,0,COUNTA(E178:E182))","v":0},{"$f":"IF(F158<>$D158,0,COUNTA(F178:F182))","v":0},{"$f":"IF(G158<>$D158,0,COUNTA(G178:G182))","v":0},{"$f":"IF(H158<>$D158,0,COUNTA(H178:H182))","v":0},{"$f":"IF(I158<>$D158,0,COUNTA(I178:I182))","v":0},{"$f":"IF(J158<>$D158,0,COUNTA(J178:J182))","v":0},{"$f":"IF(K158<>$D158,0,COUNTA(K178:K182))","v":0},{"$f":"IF(L158<>$D158,0,COUNTA(L178:L182))","v":0},{"$f":"IF(M158<>$D158,0,COUNTA(M178:M182))","v":0},{"$f":"IF(N158<>$D158,0,COUNTA(N178:N182))","v":0}]
[null,"Dependent (Output List) 1 -> ",null,"Bracket Options","Cassette 100/120 Limiter Bracket Set","Cassette 100/120 Brackets","LX Skyline Bracket | 40mm Pitch","LX Skyline Bracket",null,"LX Skyline Bracket | 40mm Pitch","LX Skyline Bracket | 40mm Pitch","Skyline 3\" Fascia Brackets","LX Skyline Bracket | 40mm Pitch"]
[null,null,null,null,null,null,null,null,null,null,"LX Skyline Bracket | 55mm Pitch","Skyline 4\" Fascia Brackets","LX Skyline Bracket | 55mm Pitch"]
[null,null,null,null,null,null,null,null,null,null,"Skyline Standard Brackets"]
[]
[]
[null,null,null,"DO NOT FILL"]
[]
[null,null,null,{"$f":"D178","v":"Bracket Options"},null,"RB12-2501-xxx138","Skyline Limiter Standartd Bracket Set","CRUSLB660xx","Cassette 100/120 Bracket"]
[null,null,"row",{"$f":"MATCH(D185,$D158:$D184,0)","v":21},null,"RB12-2502-xxx138","Cassette 100/120 Limiter Bracket Set","CRUSLB660EXTxx","Cassette 100/120 External Bracket"]
[null,null,"column",{"$f":"MATCH(OFFSET(D158,MATCH(D185,$D158:$D182,0)-2,0),OFFSET(D158,MATCH(D185,$D158:$D182,0)-2,1,1,11),0)+1","v":2},null,"RB12-2503-xxx140","LX Limiter Bracket Set","SLB660xx","Skyline Standard Bracket"]
[null,null,"Size",{"$f":"OFFSET($D158,MATCH(D185,$D158:$D184,0)-2,0,)","v":0},null,"SL01-0306-xxx040","LX Skyline Bracket","SLNB660xx","Skyline Narrow Bracket"]
[null,null,"Test →","LX Skyline Bracket",null,null,null,"SLFBKT3xx","Skyline 3\" Fascia Brackets"]
[null,null,"Data Validation Name",{"$f":"\"L_\"&SUBSTITUTE(D185,\" \",\"\")","v":"L_BracketOptions"},null,null,null,"SLFBKT4xx","Skyline 4\" Fascia Brackets"]
[]
[]
[]
[]
[]
[null,null,"INPUT DEPENDENCIES","SELECTION OPTIONS","CONFIGURATIONS"]
[null,null,"Ref Position →",{"$f":"COUNTA(D198:D208)","v":3},{"$f":"SUM(COUNTIF(E198:E208,$C198:$C208))","v":0},{"$f":"SUM(COUNTIF(F198:F208,$C198:$C208))","v":0},{"$f":"SUM(COUNTIF(G198:G208,$C198:$C208))","v":0},{"$f":"SUM(COUNTIF(H198:H208,$C198:$C208))","v":0},{"$f":"SUM(COUNTIF(I198:I208,$C198:$C208))","v":0},{"$f":"SUM(COUNTIF(J198:J208,$C198:$C208))","v":0},{"$f":"SUM(COUNTIF(K198:K203,$C$198:$C$203))","v":0},{"$f":"SUM(COUNTIF(L198:L203,$C$198:$C$203))","v":0},{"$f":"SUM(COUNTIF(M198:M203,$C$198:$C$203))","v":0},{"$f":"SUM(COUNTIF(N198:N203,$C$198:$C$203))","v":0}]
[null,"Input Selection 2->",{"$f":"i_Location","v":0},"Location","AU","AU","US",null,"US","US"]
[null,null,null,null,"EU","EU"]
[]
[null,"Input Selection 3->",{"$f":"i_ControlType","v":0},"Control Type","Easy Spring Ultra (ESU)","Easy Spring Wand (ESW)","Easy Spring Ultra (ESU)",null,"Easy Spring Wand (ESW)","Easy Spring Ultra - Skyline"]
[]
[]
[null,null,{"$f":"i_Tube","v":0},"Tube","S45 LT","S45 LT","S45 LT",null,"1.5\"","1.5\""]
[null,null,null,null,"S45 STD","S45 STD","S45 STD",null,"S45 LT"]
[null,null,null,null,"S45 HD","S45 HD","S45 HD",null,"S45 STD"]
[null,null,null,null,null,null,null,null,"S45 HD"]
[]
[]
[null,null,null,{"$f":"MAX(E210:N210)","v":0},{"$f":"IF(E197<>$D197,0,COUNTA(E211:E217))","v":0},0,0,0,0,0,0,0,0,0]
[null,"Dependent (Output List) 1 -> ",null,"Booster","Booster | COMPACT","Booster Universal | SHORT","Booster | COMPACT",null,"Booster Universal | SHORT","Booster | COMPACT"]
[null,null,null,null,"Booster Universal | SHORT","Booster Universal | LIGHT","Booster Universal | SHORT",null,"Booster Universal | LIGHT","Booster Universal | SHORT"]
[null,null,null,null,"Booster Universal | LIGHT","Booster Universal | STD","Booster Universal | LIGHT",null,"Booster Universal | STD","Booster Universal | LIGHT"]
[null,null,null,null,"Booster Universal | STD","Booster Universal | HD","Booster Universal | STD",null,null,"Booster Universal | STD"]
[null,null,null,null,"Booster Universal | HD"]
[]
[]
[null,null,null,"DO NOT FILL"]
[]
[]
[null,null,null,{"$f":"D211","v":"Booster"}]
[null,null,"row",{"$f":"MATCH(D221,$D197:$D219,0)","v":15}]
[null,null,"column",{"$f":"MATCH(OFFSET($D197,MATCH(D221,$D197:$D219,0)-2,0),OFFSET($D197,MATCH(D221,$D197:$D219,0)-2,1,1,11),0)+1","v":2}]
[null,null,"Size",{"$f":"OFFSET($D197,MATCH(D221,$D197:$D219,0)-2,0,)","v":0}]
[null,null,"Test →"]
[null,null,"Data Validation Name",{"$f":"\"L_\"&SUBSTITUTE(D221,\" \",\"\")","v":"L_Booster"}]
[]
[]
[]
[]
[]
[]
[]
[null,null,"INPUT DEPENDENCIES","SELECTION OPTIONS","CONFIGURATIONS"]
[null,null,"Ref Position →",{"$f":"COUNTA(D236:D245)","v":3},{"$f":"SUM(COUNTIF(E236:E245,$C236:$C245))","v":0},{"$f":"SUM(COUNTIF(F236:F245,$C236:$C245))","v":0},{"$f":"SUM(COUNTIF(G236:G245,$C236:$C245))","v":0},{"$f":"SUM(COUNTIF(H236:H245,$C236:$C245))","v":0},{"$f":"SUM(COUNTIF(I236:I245,$C236:$C245))","v":0},{"$f":"SUM(COUNTIF(J236:J245,$C236:$C245))","v":0},{"$f":"SUM(COUNTIF(K236:K245,$C236:$C245))","v":0},{"$f":"SUM(COUNTIF(L236:L245,$C236:$C245))","v":0},{"$f":"SUM(COUNTIF(M236:M245,$C236:$C245))","v":0},{"$f":"SUM(COUNTIF(N236:N245,$C236:$C245))","v":0}]
[null,null,{"$f":"i_Booster","v":0},"Booster","Booster Universal | SHORT","Booster | COMPACT","Booster Universal | SHORT","Booster Universal | SHORT"]
[null,null,null,null,"Booster Universal | LIGHT",null,"Booster Universal | LIGHT","Booster Universal | LIGHT"]
[null,null,null,null,"Booster Universal | STD",null,"Booster Universal | STD","Booster Universal | STD"]
[null,null,null,null,"Booster Universal | HD",null,"Booster Universal | HD","Booster Universal | HD"]
[]
[null,null,{"$f":"i_ControlType","v":0},"Control Type","Easy Spring Ultra (ESU)","Easy Spring Ultra (ESU)","Easy Spring Ultra (ESU)","Easy Spring Wand (ESW)"]
[null,null,null,null,"Easy Spring Wand (ESW)","Easy Spring Wand (ESW)"]
[null,null,null,null,"Easy Spring Ultra - Skyline","Easy Spring Ultra - Skyline"]
[null,"Input Selection 3->",{"$f":"i_Location","v":0},"Location","US","AU","AU","AU"]
[null,"Input Selection 4->",null,null,null,"US"]
[]
[null,null,null,{"$f":"MAX(E247:N247)","v":2},{"$f":"IF(E235<>$D235,0,COUNTA(E248:E251))","v":0},{"$f":"IF(F235<>$D235,0,COUNTA(F248:F251))","v":0},{"$f":"IF(G228<>$D228,0,COUNTA(G248:G251))","v":1},2,0,0,0,0,0,0]
[null,"Dependent (Output List) 1 -> ",null,"Control Side","Left Hand","Left Hand","Left Hand","Left Hand"]
[null,null,null,null,"Right Hand","Right Hand",null,"Right Hand"]
[]
[]
[null,null,null,"DO NOT FILL"]
[]
[null,null,null,{"$f":"MAX(E254:N254)","v":0},{"$f":"IF(E235<>$D235,0,COUNTA(E255:E258))","v":0},0,0,0,0,0,0,0,0,0]
[null,"Dependent (Output List) 1 -> ",null,"Fabric Orientation","Standard / Back / Under Roll","Standard / Back / Under Roll","Standard / Back / Under Roll","Standard / Back / Under Roll"]
[null,null,null,null,"Reverse / Front / Over Roll"]
[]
[]
[null,null,null,"DO NOT FILL"]
[]
[]
[]
[null,null,null,{"$f":"D248","v":"Control Side"},{"$f":"D255","v":"Fabric Orientation"},null,null,{"$f":"IFERROR(INDEX(#REF!, MATCH(0, COUNTIF($D263:G$387,#REF!) + ( COUNTIF(#REF!,#REF!)<>1), 0)), \"\")","v":""},{"$f":"IFERROR(INDEX(#REF!, MATCH(0, COUNTIF($D263:H$387,#REF!) + ( COUNTIF(#REF!,#REF!)<>1), 0)), \"\")","v":""}]
[null,null,"row",{"$f":"MATCH(D263,$D235:$D260,0)","v":14},{"$f":"MATCH(E263,$D235:$D260,0)","v":21}]
[null,null,"column",{"$f":"MATCH(OFFSET($D235,MATCH(D263,$D235:$D260,0)-2,0),OFFSET($D235,MATCH(D263,$D235:$D260,0)-2,1,1,11),0)+1","v":5},{"$f":"MATCH(OFFSET($D235,MATCH(E263,$D235:$D260,0)-2,0),OFFSET($D235,MATCH(E263,$D235:$D260,0)-2,1,1,11),0)+1","v":2}]
[null,null,"Size",{"$f":"OFFSET($D235,MATCH(D263,$D235:$D260,0)-2,0,)","v":2},{"$f":"OFFSET($D235,MATCH(E263,$D235:$D260,0)-2,0,)","v":0}]
[null,null,"Test →","Left Hand","Standard / Back / Under Roll",{"$f":"OFFSET(Ctrl_Selections!$D$235,Ctrl_Selections!$D$264-1,Ctrl_Selections!$D$265-1,Ctrl_Selections!$D$266)","v":"Left Hand"}]
[null,null,"Data Validation Name",{"$f":"\"L_\"&SUBSTITUTE(D263,\" \",\"\")","v":"L_ControlSide"},{"$f":"\"L_\"&SUBSTITUTE(E263,\" \",\"\")","v":"L_FabricOrientation"},"Right Hand"]
[]
[]
[]
[]
[null,null,"INPUT DEPENDENCIES","SELECTION OPTIONS","CONFIGURATIONS"]
[null,null,"Ref Position →",{"$f":"COUNTA(D275:D281)","v":2},{"$f":"SUM(COUNTIF(E275:E281,$C275:$C281))","v":0},{"$f":"SUM(COUNTIF(F275:F281,$C275:$C281))","v":1},{"$f":"SUM(COUNTIF(G275:G281,$C275:$C281))","v":1},{"$f":"SUM(COUNTIF(H275:H281,$C275:$C281))","v":0},{"$f":"SUM(COUNTIF(I275:I281,$C275:$C281))","v":0},{"$f":"SUM(COUNTIF(J275:J281,$C275:$C281))","v":0},{"$f":"SUM(COUNTIF(K275:K281,$C275:$C281))","v":0},{"$f":"SUM(COUNTIF(L275:L281,$C275:$C281))","v":0},{"$f":"SUM(COUNTIF(M275:M281,$C275:$C281))","v":0},{"$f":"SUM(COUNTIF(N275:N281,$C275:$C281))","v":0}]
[null,"Input Selection 1 ->",{"$f":"IF(INDIRECT(\"i_\"&SUBSTITUTE(D275,\" \",\"\"))=0,\"No\",INDIRECT(\"i_\"&SUBSTITUTE(D275,\" \",\"\")))","v":"No"},"Dim Out","Yes","No","No"]
[null,null,{"$f":"i_Location","v":0},"Location","AU","AU","US"]
[null,null,null,null,"US","EU"]
[null,null,null,null,"EU"]
[]
[null,"Input Selection 3->"]
[null,"Input Selection 4->"]
[]
[null,null,null,{"$f":"MAX(E283:N283)","v":0},{"$f":"IF(E274<>$D274,0,COUNTA(E284:E290))","v":0},0,0,0,0,0,0,0,0,0]
[null,"Dependent (Output List) 1 -> ",null,"Weight Bar","D30","D30","D30"]
[null,null,null,null,null,"Flat","F4115"]
[null,null,null,null,null,"F4115","External Hem Bar"]
[null,null,null,null,null,"Oval","Internal Hem Bar"]
[null,null,null,null,null,"Round","No Hem Bar"]
[null,null,null,null,null,"No Weight Bar","Fabric Wrap"]
[]
[null,null,null,"DO NOT FILL"]
[]
[]
[]
[null,null,null,{"$f":"D284","v":"Weight Bar"},null,null,null,{"$f":"IFERROR(INDEX(#REF!, MATCH(0, COUNTIF($D295:G$387,#REF!) + ( COUNTIF(#REF!,#REF!)<>1), 0)), \"\")","v":""},{"$f":"IFERROR(INDEX(#REF!, MATCH(0, COUNTIF($D295:H$387,#REF!) + ( COUNTIF(#REF!,#REF!)<>1), 0)), \"\")","v":""}]
[null,null,"row",{"$f":"MATCH(D295,$D274:$D292,0)","v":11}]
[null,null,"column",{"$f":"MATCH(OFFSET($D274,MATCH(D295,$D274:$D292,0)-2,0),OFFSET($D274,MATCH(D295,$D274:$D292,0)-2,1,1,11),0)+1","v":2}]
[null,null,"Size",{"$f":"OFFSET($D274,MATCH(D295,$D274:$D292,0)-2,0,)","v":0}]
[null,null,"Test →",null,null," "]
[null,null,"Data Validation Name",{"$f":"\"L_\"&SUBSTITUTE(D295,\" \",\"\")","v":"L_WeightBar"}]
[]
[]
[]
[null,null,"INPUT DEPENDENCIES","SELECTION OPTIONS","CONFIGURATIONS"]
[null,null,"Ref Position →",{"$f":"COUNTA(D306:D317)","v":3},{"$f":"SUM(COUNTIF(E306:E318,$C$306:$C$318))","v":0},{"$f":"SUM(COUNTIF(F306:F318,$C$306:$C$318))","v":0},{"$f":"SUM(COUNTIF(G306:G318,$C$306:$C$318))","v":0},{"$f":"SUM(COUNTIF(H306:H318,$C$306:$C$318))","v":0},{"$f":"SUM(COUNTIF(I306:I318,$C$306:$C$318))","v":0},{"$f":"SUM(COUNTIF(J306:J318,$C$306:$C$318))","v":0},{"$f":"SUM(COUNTIF(K306:K318,$C$306:$C$318))","v":0},{"$f":"SUM(COUNTIF(L306:L318,$C$306:$C$318))","v":0},{"$f":"SUM(COUNTIF(M306:M318,$C$306:$C$318))","v":0},{"$f":"SUM(COUNTIF(N306:N318,$C$306:$C$318))","v":0}]
[null,"Input Selection 1 ->",{"$f":"INDIRECT(\"i_\"&SUBSTITUTE(D306,\" \",\"\"))","v":0},"Control Type","Easy Spring Wand (ESW)","Easy Spring Ultra (ESU)","Easy Spring Ultra (ESU)"]
[null,"Input Selection 2->"]
[null,"Input Selection 3->",{"$f":"i_Tube","v":0},"Tube","1.5\"","1.5\"","S45 LT"]
[null,null,{"$f":"IF(INDIRECT(\"i_\"&SUBSTITUTE(D309,\" \",\"\")),0,1)","v":{"$error":"#REF!"}},null,"S45 LT",null,"S45 STD"]
[null,null,{"$f":"IF(INDIRECT(\"i_\"&SUBSTITUTE(D310,\" \",\"\")),0,1)","v":{"$error":"#REF!"}},null,"S45 STD",null,"S45 HD"]
[null,null,{"$f":"IF(INDIRECT(\"i_\"&SUBSTITUTE(D311,\" \",\"\")),0,1)","v":{"$error":"#REF!"}},null,"S45 HD"]
[null,null,{"$f":"i_BracketOptions","v":0},"Bracket Options","Single Stop Limiter Std Bracket Set 1.5\"","Single Stop Limiter Std Bracket Set 1.5\"","Single Stop Limiter LX Bracket Set | 40p"]
[null,null,null,null,"Cassette 100/120 Limiter | 1.5\"p","Cassette 100/120 Limiter | 1.5\"p","Cassette 100/120 Limiter | 1.5\"p"]
[null,null,null,null,"Single Stop Limiter LX Bracket Set | 40p","Single Stop Limiter LX Bracket Set | 40p","Single Stop Limiter Std Bracket Set 1.5\""]
[]
[]
[]
[null,"Input Selection 4->"]
[]
[null,null,null,{"$f":"MAX(E320:N320)","v":0},{"$f":"IF(E305<>$D305,0,COUNTA(E321:E327))","v":0},0,0,0,0,0,0,0,0,0]
[null,"Dependent (Output List) 1 -> ",null,"Idler Options","Limiter - Single Stop","Limiter - Single Stop","Limiter - Single Stop"]
[]
[]
[]
[]
[]
[]
[null,null,null,"DO NOT FILL"]
[]
[null,null,null,{"$f":"D321","v":"Idler Options"}]
[null,null,"row",{"$f":"MATCH(D330,$D305:$D328,0)","v":17}]
[null,null,"column",{"$f":"MATCH(OFFSET($D305,MATCH(D330,$D305:$D328,0)-2,0),OFFSET($D305,MATCH(D330,$D305:$D328,0)-2,1,1,11),0)+1","v":2}]
[null,null,"Size",{"$f":"OFFSET($D305,MATCH(D330,$D305:$D328,0)-2,0,)","v":0}]
[null,null,"Test →"]
[null,null,"Data Validation Name",{"$f":"\"L_\"&SUBSTITUTE(D330,\" \",\"\")","v":"L_IdlerOptions"}]
[]
[]
[null,null,null,"=OFFSET($D$134,OFFSET(INDIRECT(ADDRESS(ROW(),COLUMN(),4)),-3,0)-1,OFFSET(INDIRECT(ADDRESS(ROW(),COLUMN(),4)),-2,0)-1,OFFSET(INDIRECT(ADDRESS(ROW(),COLUMN(),4)),-1,0))"]
[]
[]
[]
[]
[]
[]
[null,null,"INPUT DEPENDENCIES","SELECTION OPTIONS","CONFIGURATIONS"]
[null,null,"Ref Position →",{"$f":"COUNTA(D347:D370)","v":4},{"$f":"SUM(COUNTIF(E347:E370,$C$347:$C$370))","v":0},{"$f":"SUM(COUNTIF(F347:F370,$C$347:$C$370))","v":0},{"$f":"SUM(COUNTIF(G347:G370,$C$347:$C$370))","v":0},{"$f":"SUM(COUNTIF(H347:H370,$C$347:$C$370))","v":0},{"$f":"SUM(COUNTIF(I347:I370,$C$347:$C$370))","v":0},{"$f":"SUM(COUNTIF(J347:J370,$C$347:$C$370))","v":0},{"$f":"SUM(COUNTIF(K347:K370,$C$347:$C$370))","v":0},{"$f":"SUM(COUNTIF(L347:L370,$C$347:$C$370))","v":0},{"$f":"SUM(COUNTIF(M347:M370,$C$347:$C$370))","v":0},{"$f":"SUM(COUNTIF(N347:N370,$C$347:$C$370))","v":0}]
[null,"Input Selection 3->",{"$f":"i_Location","v":0},"Location","EU","US","US","US","US","US"]
[null,null,null,null,"AU"]
[]
[]
[null,null,{"$f":"i_ControlType","v":0},"Control Type","Easy Spring Ultra (ESU)","Easy Spring Ultra (ESU)","Easy Spring Ultra (ESU)","Easy Spring Ultra (ESU)","Easy Spring Ultra - Skyline","Easy Spring Ultra - Skyline"]
[null,null,null,null,"Easy Spring Wand (ESW)","Easy Spring Wand (ESW)","Easy Spring Wand (ESW)","Easy Spring Wand (ESW)"]
[null,null,null,null,null,"Easy Spring Ultra - Skyline"]
[]
[]
[]
[]
[null,null,{"$f":"i_InstallationType","v":0},"Installation Type","CF90 Cassette","Cassette 100","CF90 Cassette","Open","Open","CF90 Cassette"]
[null,null,null,null,"CF90 Fascia","Cassette 120","CF90 Fascia",null,null,"CF90 Fascia"]
[null,null,null,null,"Mounting Rail","Skyline Fascia","Mounting Rail",null,null,"Cassette 110"]
[null,null,null,null,"P95 Semi Cassette",null,"P95 Semi Cassette",null,null,"Mounting Rail"]
[null,null,null,null,"FRS Valance 80",null,"FRS Valance 80",null,null,"P95 Semi Cassette"]
[null,null,null,null,"FRS Valance 100",null,"FRS Valance 100",null,null,"FRS Valance 80"]
[null,null,null,null,"Open",null,"Cassette 110",null,null,"FRS Valance 100"]
[null,null,{"$f":"i_BracketOptions","v":0},"Bracket Options","LX Limiter Bracket Set","Cassette 100/120 Limiter Bracket Set","Skyline Standard Brackets","Skyline Standard Brackets","Skyline Standard Brackets","LX Skyline Bracket | 40mm Pitch"]
[null,null,null,null,"LX Skyline Bracket | 40mm Pitch","Cassette 100/120 Brackets","LX Skyline Bracket | 40mm Pitch","LX Skyline Bracket | 40mm Pitch","LX Skyline Bracket | 40mm Pitch"]
[null,null,null,null,"LX Skyline Bracket | 55mm Pitch","Skyline Limiter Standard Bracket Set","LX Skyline Bracket | 55mm Pitch","LX Skyline Bracket | 55mm Pitch"]
[null,null,null,null,null,"Skyline 3\" Fascia Brackets"]
[null,null,null,null,null,"Skyline 4\" Fascia Brackets"]
[]
[]
[null,null,null,{"$f":"MAX(E372:N372)","v":0},{"$f":"IF(E346<>$D346,0,COUNTA(E373:E376))","v":0},0,0,0,0,0,0,0,0,0]
[null,"Dependent (Output List) 1 -> ",null,"LinkedScreens","No","No","No","No","No","No"]
[null,null,null,null,"Easy Link","Easy Link","Infinite Adjuster","Easy Link","Infinite Adjuster","Infinite Adjuster"]
[null,null,null,null,null,null,"Easy Link",null,"Easy Link","Easy Link"]
[]
[null,null,null,"DO NOT FILL"]
[]
[null,null,null,null,"Single Stop Limiter LX Bracket Set | 40p","Cassette 100/120 Limiter | 1.5\"p","Single Stop Limiter Std Bracket Set 1.5\"","Single Stop Limiter LX Bracket Set | 40p"]
[null,null,null,{"$f":"D373","v":"LinkedScreens"},"Single Stop Limiter Std Bracket Set 1.5\"",null,"Skyline Bracket [SLB660]"]
[null,null,"row",{"$f":"MATCH(D380,$D346:$D378,0)","v":28},"Skyline Bracket [SLB660]"]
[null,null,"column",{"$f":"MATCH(OFFSET($D346,MATCH(D380,$D346:$D378,0)-2,0),OFFSET($D346,MATCH(D380,$D346:$D378,0)-2,1,1,11),0)+1","v":2}]
[null,null,"Size",{"$f":"OFFSET($D346,MATCH(D380,$D346:$D378,0)-2,0,)","v":0},"No","No","No","No","=OFFSET($D$134,OFFSET(INDIRECT(ADDRESS(ROW(),COLUMN(),4)),-3,0)-1,OFFSET(INDIRECT(ADDRESS(ROW(),COLUMN(),4)),-2,0)-1,OFFSET(INDIRECT(ADDRESS(ROW(),COLUMN(),4)),-1,0))"]
[null,null,"Test →","-","Easy Link","Easy Link","Easy Link","Easy Link"]
[null,null,"Data Validation Name",{"$f":"\"L_\"&SUBSTITUTE(D380,\" \",\"\")","v":"L_LinkedScreens"},null,null,"Infinite Adjuster"]
[]
[]
[]
[]
[]
[null,null,"INPUT DEPENDENCIES","SELECTION OPTIONS","CONFIGURATIONS"]
[null,null,"Ref Position →",{"$f":"COUNTA(D393:D397)","v":1},{"$f":"SUM(COUNTIF(E393:E401,C393:C401))","v":0},{"$f":"SUM(COUNTIF(F393:F401,C393:C401))","v":0},{"$f":"SUM(COUNTIF(G393:G401,#REF!))","v":0},{"$f":"SUM(COUNTIF(H393:H401,#REF!))","v":0},{"$f":"SUM(COUNTIF(I393:I401,#REF!))","v":0},{"$f":"SUM(COUNTIF(J393:J401,#REF!))","v":0},{"$f":"SUM(COUNTIF(K393:K401,#REF!))","v":0},{"$f":"SUM(COUNTIF(L393:L401,#REF!))","v":0},{"$f":"SUM(COUNTIF(M393:M401,#REF!))","v":0},{"$f":"SUM(COUNTIF(N393:N401,#REF!))","v":0}]
[null,"Input Selection 1 ->",{"$f":"i_InstallationType","v":0},"Installation Type","Cassette 110","CF90 Cassette"]
[null,"Input Selection 2->",null,null,"P95 Semi Cassette","CF90 Fascia"]
[null,null,null,null,null,"Cassette 100"]
[null,null,null,null,null,"Cassette 120"]
[null,"Input Selection 3->",null,null,null,"Mounting Rail"]
[null,null,null,null,null,"FRS Valance 80"]
[null,null,null,null,null,"FRS Valance 100"]
[null,null,null,null,null,"Skyline Fascia"]
[null,"Input Selection 4->",null,null,null,"Open"]
[]
[null,null,null,{"$f":"MAX(E403:N403)","v":0},{"$f":"IF(E392<>$D392,0,COUNTA(E404:E408))","v":0},0,0,0,0,0,0,0,0,0]
[null,"Dependent (Output List) 1 -> ",null,"FabricWrap","Yes","-"]
[null,null,null,null,"No"]
[]
[]
[]
[null,null,null,"DO NOT FILL"]
[]
[null,null,null,{"$f":"D404","v":"FabricWrap"},null,null,null,{"$f":"IFERROR(INDEX(#REF!, MATCH(0, COUNTIF($D$221:G411,#REF!) + ( COUNTIF(#REF!,#REF!)<>1), 0)), \"\")","v":""},{"$f":"IFERROR(INDEX(#REF!, MATCH(0, COUNTIF($D$221:H411,#REF!) + ( COUNTIF(#REF!,#REF!)<>1), 0)), \"\")","v":""}]
[null,null,"row",{"$f":"MATCH(D411,$D392:$D410,0)","v":13}]
[null,null,"column",{"$f":"MATCH(OFFSET($D392,MATCH(D411,$D392:$D410,0)-2,0),OFFSET($D392,MATCH(D411,$D392:$D410,0)-2,1,1,11),0)+1","v":2}]
[null,null,"Size",{"$f":"OFFSET($D392,MATCH(D411,$D392:$D410,0)-2,0,)","v":0}]
[null,null,"Test →","-",{"$f":"OFFSET(Ctrl_Selections!$D$392,Ctrl_Selections!$D$412-1,Ctrl_Selections!$D$413-1,Ctrl_Selections!$D$414)","v":{"$error":"#REF!"}}]
[null,null,"Data Validation Name",{"$f":"\"L_\"&SUBSTITUTE(D411,\" \",\"\")","v":"L_FabricWrap"}]
[]
[]
[]
[]
[]
[null,null,"INPUT DEPENDENCIES","SELECTION OPTIONS","CONFIGURATIONS"]
[null,null,"Ref Position →",{"$f":"COUNTA(D424:D430)","v":2},{"$f":"SUM(COUNTIF(E424:E433,C424:C433))","v":0},{"$f":"SUM(COUNTIF(F424:F433,C424:C433))","v":0},{"$f":"SUM(COUNTIF(G424:G433,C424:C433))","v":0},{"$f":"SUM(COUNTIF(H424:H433,#REF!))","v":0},{"$f":"SUM(COUNTIF(I424:I433,#REF!))","v":0},{"$f":"SUM(COUNTIF(J424:J433,#REF!))","v":0},{"$f":"SUM(COUNTIF(K424:K433,#REF!))","v":0},{"$f":"SUM(COUNTIF(L424:L433,#REF!))","v":0},{"$f":"SUM(COUNTIF(M424:M433,#REF!))","v":0},{"$f":"SUM(COUNTIF(N424:N433,#REF!))","v":0}]
[null,"Input Selection 1 ->",{"$f":"i_Location","v":0},"Location","AU","EU","US"]
[null,"Input Selection 2->",null,null,"US"]
[null,null,{"$f":"i_WeightBar","v":0},"Weight Bar","D30","D30","Fabric Wrap"]
[null,null,null,null,"F4115","F4115"]
[null,null,null,null,"Flat","Flat"]
[null,null,null,null,"Oval","Oval"]
[null,"Input Selection 3->",null,null,"Round","Round"]
[]
[]
[null,"Input Selection 4->"]
[]
[null,null,null,{"$f":"MAX(E435:N435)","v":0},{"$f":"IF(E423<>$D423,0,COUNTA(E436:E440))","v":0},0,0,0,0,0,0,0,0,0]
[null,"Dependent (Output List) 1 -> ",null,"wbSplineTape","No Tape","No Tape","No Wrap (Flat Spline)"]
[null,null,null,null,"One Side","One Side","Half or Full Wrap (Round Spline)"]
[null,null,null,null,"Double Sided"]
[null,null,null,null,"Smooth Round Spline"]
[]
[null,null,null,"DO NOT FILL"]
[]
[null,null,null,{"$f":"D436","v":"wbSplineTape"},null,null,null,{"$f":"IFERROR(INDEX(#REF!, MATCH(0, COUNTIF($D$221:G443,#REF!) + ( COUNTIF(#REF!,#REF!)<>1), 0)), \"\")","v":""},{"$f":"IFERROR(INDEX(#REF!, MATCH(0, COUNTIF($D$221:H443,#REF!) + ( COUNTIF(#REF!,#REF!)<>1), 0)), \"\")","v":""}]
[null,null,"row",{"$f":"MATCH(D443,$D423:$D442,0)","v":14}]
[null,null,"column",{"$f":"MATCH(OFFSET($D423,MATCH(D443,$D423:$D442,0)-2,0),OFFSET($D423,MATCH(D443,$D423:$D442,0)-2,1,1,11),0)+1","v":2}]
[null,null,"Size",{"$f":"OFFSET($D423,MATCH(D443,$D423:$D442,0)-2,0,)","v":0}]
[null,null,"Test →","No Tape"]
[null,null,"Data Validation Name",{"$f":"\"L_\"&SUBSTITUTE(D443,\" \",\"\")","v":"L_wbSplineTape"}]
[null,null,null,null,"*EU doesn’t use bubble seal"]
[null,null,null,null,"*dim out doesn’t allow for a back seal"]
[]
[]
[null,null,"INPUT DEPENDENCIES","SELECTION OPTIONS","CONFIGURATIONS"]
[null,null,"Ref Position →",{"$f":"COUNTA(D455:D466)","v":3},{"$f":"SUM(COUNTIF(E455:E466,$C455:$C466))","v":1},{"$f":"SUM(COUNTIF(F455:F466,$C455:$C466))","v":1},{"$f":"SUM(COUNTIF(G455:G466,$C455:$C466))","v":1},{"$f":"SUM(COUNTIF(H455:H466,$C455:$C466))","v":1},{"$f":"SUM(COUNTIF(I455:I466,$C455:$C466))","v":0},{"$f":"SUM(COUNTIF(J455:J466,$C455:$C466))","v":0},{"$f":"SUM(COUNTIF(K455:K466,$C455:$C466))","v":1},{"$f":"SUM(COUNTIF(L455:L466,$C455:$C466))","v":0},{"$f":"SUM(COUNTIF(M455:M466,$C455:$C466))","v":0},{"$f":"SUM(COUNTIF(N455:N466,$C455:$C466))","v":0}]
[null,"Input Selection 1 ->",{"$f":"i_WeightBar","v":0},"Weight Bar","D30","F4115","Flat","D30","D30","D30","Fabric Wrap"]
[null,"Input Selection 2->",null,null,null,null,"Oval"]
[null,"Input Selection 3->",null,null,null,null,"Round"]
[]
[null,null,{"$f":"i_Location","v":0},"Location","AU","AU","AU","EU","AU","EU","US"]
[null,null,null,null,"US","US","US",null,"US"]
[null,null,null,null,null,"EU","EU"]
[null,null,{"$f":"IF(OR(i_DimOut=\"\",i_DimOut=\"No\"),\"No\",\"Yes\")","v":"No"},"DimOut","No","Yes","Yes","No","Yes","Yes","No"]
[null,null,null,null,null,"No","No"]
[]
[]
[null,"Input Selection 4->"]
[]
[null,null,null,{"$f":"MAX(E468:N468)","v":0},{"$f":"IF(E454<>$D454,0,COUNTA(E469:E477))","v":0},0,0,0,0,0,{"$f":"IF(K454<>$D454,0,COUNTA(K469:K477))","v":0},0,0,0]
[null,"Dependent (Output List) 1 -> ",null,"wb Accessories","No brush or bubble seal","No brush or bubble seal","N/A","No brush seal","No brush or bubble seal","No brush seal","No accessories"]
[null,null,null,null,"Yes; Seal; Bottom or Back (1x)","Yes; Seal (1x)",null,"Yes; Brush; Bottom or Back (1x)","Yes; Seal; Bottom  (1x)","Yes; Brush; Bottom (1x)","Hem Bar Handle"]
[null,null,null,null,"Yes; Seal; Bottom & Back (2x)","Yes; Brush (1x)",null,"Yes; Brush; Bottom & Back (2x)","Yes; Brush; Bottom (1x)",null,"Hem Bar Handle + Pull Hook"]
[null,null,null,null,"Yes; Brush; Bottom or Back (1x)",null,null,null,null,null,"Ballast"]
[null,null,null,null,"Yes; Brush; Bottom & Back (2x)",null,null,null,null,null,"Ballast + Handle"]
[null,null,null,null,"Yes; Brush & Seal (1x of each)",null,null,null,null,null,"Ballast + Handle + Pull Hook"]
[]
[]
[]
[null,null,null,"DO NOT FILL"]
[]
[null,null,null,{"$f":"D469","v":"wb Accessories"},null,null,null,{"$f":"IFERROR(INDEX(#REF!, MATCH(0, COUNTIF($D$221:G480,#REF!) + ( COUNTIF(#REF!,#REF!)<>1), 0)), \"\")","v":""},{"$f":"IFERROR(INDEX(#REF!, MATCH(0, COUNTIF($D$221:H480,#REF!) + ( COUNTIF(#REF!,#REF!)<>1), 0)), \"\")","v":""}]
[null,null,"row",{"$f":"MATCH(D480,$D454:$D479,0)","v":16}]
[null,null,"column",{"$f":"MATCH(OFFSET($D454,MATCH(D$480,$D454:$D479,0)-2,0),OFFSET($D454,MATCH(D480,$D454:$D479,0)-2,1,1,11),0)+1","v":2}]
[null,null,"Size",{"$f":"OFFSET($D454,MATCH(D480,$D454:$D479,0)-2,0,)","v":0}]
[null,null,"Test →","No brush or bubble seal"]
[null,null,"Data Validation Name",{"$f":"\"L_\"&SUBSTITUTE(D480,\" \",\"\")","v":"L_wbAccessories"}]
[]
[]
[]
[]
[null,null,"INPUT DEPENDENCIES","SELECTION OPTIONS","CONFIGURATIONS"]
[null,null,"Ref Position →",{"$f":"COUNTA(D492:D494)","v":1},{"$f":"SUM(COUNTIF(E492:E495,C492:C495))","v":0},{"$f":"SUM(COUNTIF(F492:F495,$C$492:$C$495))","v":0},{"$f":"SUM(COUNTIF(G492:G495,$C$492:$C$495))","v":0},{"$f":"SUM(COUNTIF(H492:H495,$C$492:$C$495))","v":0},{"$f":"SUM(COUNTIF(I492:I495,$C$492:$C$495))","v":0},{"$f":"SUM(COUNTIF(J492:J495,$C$492:$C$495))","v":0},{"$f":"SUM(COUNTIF(K492:K495,$C$492:$C$495))","v":0},{"$f":"SUM(COUNTIF(L492:L495,$C$492:$C$495))","v":0},{"$f":"SUM(COUNTIF(M492:M495,$C$492:$C$495))","v":0},{"$f":"SUM(COUNTIF(N492:N495,$C$492:$C$495))","v":0}]
[null,"Input Selection 1 ->",{"$f":"i_Location","v":0},"Location","AU","EU"]
[null,"Input Selection 2->",null,null,null,"US"]
[null,"Input Selection 3->"]
[null,"Input Selection 4->"]
[]
[null,null,null,{"$f":"MAX(E497:N497)","v":0},{"$f":"IF(E491<>$D491,0,COUNTA(E498:E502))","v":0},0,0,0,0,0,0,0,0,0]
[null,"Dependent (Output List) 1 -> ",null,"Colour","Powdercoat","Powdercoat"]
[null,null,null,null,"Mill","Anodised"]
[null,null,null,null,"Anodised"]
[]
[]
[null,null,null,"DO NOT FILL"]
[]
[null,null,null,{"$f":"D498","v":"Colour"},null,null,null,{"$f":"IFERROR(INDEX(#REF!, MATCH(0, COUNTIF($D$244:G505,#REF!) + ( COUNTIF(#REF!,#REF!)<>1), 0)), \"\")","v":""},{"$f":"IFERROR(INDEX(#REF!, MATCH(0, COUNTIF($D$244:H505,#REF!) + ( COUNTIF(#REF!,#REF!)<>1), 0)), \"\")","v":""}]
[null,null,"row",{"$f":"MATCH(D505,$D491:$D504,0)","v":8}]
[null,null,"column",{"$f":"MATCH(OFFSET($D491,MATCH(D505,$D491:$D504,0)-2,0),OFFSET($D491,MATCH(D505,$D491:$D504,0)-2,1,1,11),0)+1","v":2}]
[null,null,"Size",{"$f":"OFFSET($D491,MATCH(D505,$D491:$D504,0)-2,0,)","v":0}]
[null,null,"Test →","Powdercoat",{"$f":"OFFSET(Ctrl_Selections!$D$491,Ctrl_Selections!$D$506-1,Ctrl_Selections!$D$507-1,Ctrl_Selections!$D$508)","v":{"$error":"#REF!"}}]
[null,null,"Data Validation Name",{"$f":"\"L_\"&SUBSTITUTE(D505,\" \",\"\")","v":"L_Colour"}]
[]
[]
[]
[]
[null,null,"INPUT DEPENDENCIES","SELECTION OPTIONS","CONFIGURATIONS"]
[null,null,"Ref Position →",{"$f":"COUNTA(D517:D521)","v":3},{"$f":"SUM(COUNTIF(E517:E521,$C517:$C521))","v":0},{"$f":"SUM(COUNTIF(F517:F521,$C$517:$C$521))","v":0},{"$f":"SUM(COUNTIF(G517:G521,$C$517:$C$521))","v":0},{"$f":"SUM(COUNTIF(H517:H521,$C$198:$C$203))","v":0},{"$f":"SUM(COUNTIF(I517:I521,$C$198:$C$203))","v":0},{"$f":"SUM(COUNTIF(J517:J521,$C$198:$C$203))","v":0},{"$f":"SUM(COUNTIF(K517:K521,$C$198:$C$203))","v":0},{"$f":"SUM(COUNTIF(L517:L521,$C$198:$C$203))","v":0},{"$f":"SUM(COUNTIF(M517:M521,$C$198:$C$203))","v":0},{"$f":"SUM(COUNTIF(N517:N521,$C$198:$C$203))","v":0}]
[null,"Input Selection 1 ->",{"$f":"i_ControlType","v":0},"Control Type","Easy Spring Ultra - Skyline","Easy Spring Ultra (ESU)","Easy Spring Ultra (ESU)"]
[null,"Input Selection 2->",{"$f":"i_Tube","v":0},"Tube","1.5\"","S45 HD","S45 HD"]
[null,"Input Selection 3->",null,null,null,"S45 STD","S45 STD"]
[null,null,null,null,null,"S45 LT","S45 LT"]
[null,"Input Selection 4->",{"$f":"i_Location","v":0},"Location","US","AU","US"]
[]
[null,null,null,{"$f":"MAX(E523:N523)","v":0},{"$f":"IF(E516<>$D516,0,COUNTA(E524:E528))","v":0},0,0,0,0,0,0,0,0,0]
[null,"Dependent (Output List) 1 -> ",null,"Spring Control Type","Standard","Tension Adjust","Standard"]
[null,null,null,null,null,null,null,"ADD \"TENSION ADJUST\" TO US OPTIONS WHEN IT IS LAUNCHED IN US"]
[]
[]
[]
[null,null,null,"DO NOT FILL"]
[]
[null,null,null,{"$f":"D524","v":"Spring Control Type"},null,null,null,{"$f":"IFERROR(INDEX(#REF!, MATCH(0, COUNTIF($D$221:G531,#REF!) + ( COUNTIF(#REF!,#REF!)<>1), 0)), \"\")","v":""},{"$f":"IFERROR(INDEX(#REF!, MATCH(0, COUNTIF($D$221:H531,#REF!) + ( COUNTIF(#REF!,#REF!)<>1), 0)), \"\")","v":""}]
[null,null,"row",{"$f":"MATCH(D531,$D516:$D529,0)","v":9}]
[null,null,"column",{"$f":"MATCH(OFFSET($D516,MATCH(D531,$D516:$D529,0)-2,0),OFFSET($D516,MATCH(D531,$D516:$D529,0)-2,1,1,11),0)+1","v":2}]
[null,null,"Size",{"$f":"OFFSET($D516,MATCH(D531,$D516:$D529,0)-2,0,)","v":0}]
[null,null,"Test →","Tension Adjust"]
[null,null,"Data Validation Name",{"$f":"\"L_\"&SUBSTITUTE(D531,\" \",\"\")","v":"L_SpringControlType"},{"$f":"OFFSET(Ctrl_Selections!$D$516,Ctrl_Selections!$D$532-1,Ctrl_Selections!$D$533-1,Ctrl_Selections!$D$534)","v":{"$error":"#REF!"}}]

{"sheet":"Ctrl_Lists","index":4,"n_rows":57,"n_cols":27,"rows_kept":57,"cut":false,"hidden":true,"merged":[[20,25,20,26],[1,0,1,1],[5,9,5,10],[6,9,6,10],[19,13,19,15],[19,8,19,11],[20,8,20,11],[5,19,5,21],[6,19,6,21]]}
[]
["List Summary",null,null,null,null,null,null,null,null,null,null,null,null,null,null,null,null,null,null,"L_SelectUnitsSingle"]
[null,null,null,"i_Currency",null,null,null,null,null,null,null,null,null,null,"o_nScreens",null,null,null,null,{"$f":"IF(i_Units=\"Metric\",\"Imperial\",\"Metric\")","v":"Metric"}]
[null,null,null,{"$f":"INDEX(T_Currency[Currency],MATCH(i_Location,T_Location[Location],0))","v":{"$error":"#N/A"}},null,null,null,null,null,null,null,null,null,null,{"$f":"IF(OR(i_LinkedScreens=\"No\",i_LinkedScreens=\"\"),1,i_nScreens)","v":1},null,null,null,null,{"$f":"IF(i_Units=\"\",\"Imperial\",0)","v":"Imperial"}]
[null,"Activate List ->"]
[null,"Table/List Name (MUST MATCH) ->",{"$f":"\"T_\"&SUBSTITUTE((OFFSET(C6,2,0)),\" \",\"\")","v":"T_Installation"},{"$f":"\"T_\"&SUBSTITUTE((OFFSET(D6,2,0)),\" \",\"\")","v":"T_Currency"},{"$f":"\"T_\"&SUBSTITUTE((OFFSET(E6,2,0)),\" \",\"\")","v":"T_Location"},{"$f":"\"T_\"&SUBSTITUTE((OFFSET(F6,2,0)),\" \",\"\")","v":"T_BlindType"},"T_SystemType","T_InstallationType","T_ControlType","T_FixingOptions",null,"T_ControlSide","T_YesNo","T_BoxShape","T_nScreens",{"$f":"\"T_\"&SUBSTITUTE((OFFSET(P6,2,0)),\" \",\"\")","v":"T_CassetteBrush"},{"$f":"\"T_\"&SUBSTITUTE((OFFSET(Q6,2,0)),\" \",\"\")","v":"T_wbBallast"},{"$f":"\"T_\"&SUBSTITUTE((OFFSET(R6,2,0)),\" \",\"\")","v":"T_DimOut"},"T_Linked",{"$f":"\"T_\"&SUBSTITUTE((OFFSET(T6,2,0)),\" \",\"\")","v":"T_UnitSelection"},null,null,"T_FabricWrap","T_SheetStatus","T_FabricOrientation"]
[null,"List Test ->"]
[null,"Header Name ->","Installation","Currency","Location","Blind Type","System Type","Installation Type","Control Type","Fixing Options","Outcome","Control Side","YesNo","Box Shape","nScreens","CassetteBrush","wbBallast","Dim Out","Linked","UnitSelection","Units","Fabric","FabricWrap","Status","FabricOrientation"]
[null,null,"Internal","AUD","AU","Single",null,"Cassette 100","Easy Spring Wand","Top/Face Fix","No Clip","Left Hand","Yes","Round",2,"Yes","Yes","Yes","No","Metric","mm","gsm","Yes","Development","Standard / Back / Under Roll"]
[null,null,"External","USD","US","Dual",null,"Cassette 120","Easy Spring Ultra (ESU)","Top Fix w/Mounting Bracket","Top Fix","Right Hand","No","Square",3,"No","No","No","Easy Link","Imperial","in","oz/yd²","No","Release","Reverse / Front / Over Roll"]
[null,null,null,"EUR","EU",null,null,"CF90 Cassette","Easy Spring Ultra - Skyline","Face Fix w/Mounting Bracket","Face Fix",null,null,null,null,null,null,null,"Multi Infinite Link"]
[null,null,null,null,null,null,null,"CF90 Fascia"]
[null,null,null,null,null,null,null,"Mounting Rail"]
[null,null,null,null,null,null,null,"Open"]
[]
[]
[]
[]
[]
[null,null,{"$f":"\"T_\"&SUBSTITUTE((OFFSET(C20,2,0)),\" \",\"\")","v":"T_Tube"},{"$f":"\"T_\"&SUBSTITUTE((OFFSET(D20,2,0)),\" \",\"\")","v":"T_WeightBar"},{"$f":"\"T_\"&SUBSTITUTE((OFFSET(E20,2,0)),\" \",\"\")","v":"T_wbSpline"},"T_TubeExtras",{"$f":"\"T_\"&SUBSTITUTE((OFFSET(G20,2,0)),\" \",\"\")","v":"T_PelmetSplineOptions"},"T_Finish","T_FinishColour",null,null,null,null,"T_Fabric"]
[null,null,null,null,{"$f":"INDEX(T_wbSpline[],MATCH(i_WeightBar,T_WeightBar[],0))","v":{"$error":"#N/A"}},null,null,null,null,null,null,null,null,"gsm","oz/yd²","mm",null,null,null,null,null,null,null,null,null,"Translate"]
[null,null,"Tube","WeightBar","wbSpline","TubeExtras","Pelmet Spline Options","Finish","Finish / Colour","ColourCode-xxxAU","ColourCode-xxUS","ColourCode-xxxUS",null,"Metric","Imperial","Thickness",null,null,null,null,null,null,null,null,null,"US","AU"]
[null,null,"1.5\"","D30","15 mm Flat Spline","Spline","4.1mm Round Spline + Flat Spline No Tape","Mill",{"$f":"T_Finish[[#This Row],[Finish]]","v":"Mill"},"000","U",null,null,180,{"$f":"ROUND(T_Fabric[[#This Row],[Metric]]/33.9,2)","v":5.31},0.4,null,null,null,null,null,null,null,null,null,"Pin End","Idler End"]
[null,null,"S45 LT","Flat","10 mm Flat Spline","D/S Tape","4.1mm Round Spline + Flat Spline DBL Side Tape x1 Side","Anodised",{"$f":"T_Finish[[#This Row],[Finish]]","v":"Anodised"},"020","A",null,null,320,{"$f":"ROUND(T_Fabric[[#This Row],[Metric]]/33.9,2)","v":9.44},0.55000000000000004,null,null,null,null,null,null,null,null,null,"Edge","dim-OUT"]
[null,null,"S45 STD","F4115","15 mm Flat Spline",null,"4.1mm Round Spline + Flat Spline DBL Side Tape x2 Side","Power Coat","Black","050","BK","050",null,420,{"$f":"ROUND(T_Fabric[[#This Row],[Metric]]/33.9,2)","v":12.39},0.55000000000000004]
[null,null,"S45 HD","Oval","10 mm Flat Spline",null,"4.6mm Round Spline + Flat Spline No Tape",null,"White","069","W","075",null,500,{"$f":"ROUND(T_Fabric[[#This Row],[Metric]]/33.9,2)","v":14.75},0.9]
[null,null,null,"Round","15 mm Flat Spline",null,"4.6mm Round Spline + Flat Spline DBL Side Tape x1 Side",null,"Silver Grey","338"]
[null,null,null,"Inernal Hem Bar","No Spline",null,"4.6mm Round Spline + Flat Spline DBL Side Tape x2 Side",null,"Bronze","082","BR",472]
[null,null,null,"HB16","15 mm Flat Spline",null,null,null,"Vanilla",null,"V",414]
[null,null,null,null,null,null,null,null,"Cream",null,"CR"]
[null,null,null,null,null,null,null,null,"Sandstone","269"]
[null,null,null,null,null,null,null,null,"Barley","283"]
[null,null,null,null,null,null,null,null,"Gray",null,"G"]
[null,null,null,null,null,null,null,null,"Brown",null,"GR"]
[null,null,null,null,null,null,null,null,"Plated",null,null,"031"]
[null,null,null,null,null,null,null,null,"Zinc Plated","025",{"$f":"1/0","v":{"$error":"#DIV/0!"}},"025"]
[]
[]
[]
[]
[]
[]
[]
[]
[]
[null,null,null,null,null,null,"Bracket Options","Boosters_38mm","Boosters_S45","Limiter","Decelerator"]
[null,null,null,null,null,null,"Cassette 100/120 Limiter | 1.5\"p","Booster Universal | SHORT - 38 | 1.5'","Booster Universal | NARROW S45","Limiter – Single Stop | Universal 1.5” (38mm)","Soft Lift Decelerator S38/1.5\" LH"]
[null,null,null,null,null,null,"Single Stop Limiter LX Bracket Set | 40p","Booster Universal | LIGHT - 38 | 1.5'","Booster Universal | SHORT S45","Limiter – Single Stop | Universal S45","Soft Lift Decelerator | S45 LH  - Blue Tail",null,null,{"$f":"\"T_\"&SUBSTITUTE((OFFSET(N48,2,0)),\" \",\"\")","v":"T_wbBrush"},{"$f":"\"T_\"&SUBSTITUTE((OFFSET(O48,2,0)),\" \",\"\")","v":"T_wbBubbleSeal"},{"$f":"\"T_\"&SUBSTITUTE((OFFSET(P48,2,0)),\" \",\"\")","v":"T_ChainTensioner"},{"$f":"\"T_\"&SUBSTITUTE((OFFSET(Q48,2,0)),\" \",\"\")","v":"T_ChainLength"}]
[null,null,null,null,null,null,"Single Stop Limiter Std Bracket Set 1.5\"","Booster Universal | STD - 38 | 1.5'","Booster Universal | LIGHT S45",null,"Soft Lift Decelerator S38/1.5\" RH"]
[null,null,null,null,null,null,"Easy-Lock LX Installation Bracket | 40p",null,"Booster Universal | STD S45",null,"Soft Lift Decelerator | S45 RH  - Red Tail",null,null,"wbBrush","wbBubbleSeal","ChainTensioner","ChainLength"]
[null,null,null,null,null,null,null,null,"Booster Universal | HD S45",null,null,null,null,"Yes","No Bubble Seal","Face Fix",50]
[null,null,null,null,null,null,null,null,null,null,null,null,null,"No","Yes - Bottom/Back Seal (1x)","Recess Fix",75]
[null,null,null,null,null,null,null,null,null,null,null,null,null,null,"Yes - Bottom + Back Seal (2x)","Universal",100]
[null,null,null,null,null,null,null,null,null,null,null,null,null,null,null,"ChainHold",125]
[null,null,null,null,null,null,null,null,null,null,null,null,null,null,null,null,150]
[null,null,null,null,null,null,null,null,null,null,null,null,null,null,null,null,175]
[null,null,null,null,null,null,null,null,null,null,null,null,null,null,null,null,200]

{"sheet":"Ctrl_Deductions","index":5,"n_rows":89,"n_cols":50,"rows_kept":89,"cut":false,"hidden":true,"merged":[[2,20,2,49],[6,18,9,18],[10,18,12,18],[4,18,5,18],[6,19,9,19],[4,19,5,19],[10,19,12,19]]}
[]
[]
[null,null,null,null,null,null,null,null,null,null,null,null,null,null,null,null,null,null,"INPUT DEPENDENCIES","SELECTION OPTIONS","CONFIGURATIONS"]
[null,null,null,null,null,null,null,null,null,null,null,null,null,null,null,null,null,null,"Ref Position →",{"$f":"MAX(U4:AX4)","v":0},{"$f":"SUM(COUNTIF(U5:U15,$S$5:$S$15))","v":0},{"$f":"SUM(COUNTIF(V5:V15,$S$5:$S$15))","v":0},{"$f":"SUM(COUNTIF(W5:W15,$S$5:$S$15))","v":0},{"$f":"SUM(COUNTIF(X5:X15,$S$5:$S$15))","v":0},{"$f":"SUM(COUNTIF(Y5:Y15,$S$5:$S$15))","v":0},{"$f":"SUM(COUNTIF(Z5:Z15,$S$5:$S$15))","v":0},{"$f":"SUM(COUNTIF(AA5:AA15,$S$5:$S$15))","v":0},{"$f":"SUM(COUNTIF(AB5:AB15,$S$5:$S$15))","v":0},{"$f":"SUM(COUNTIF(AC5:AC15,$S$5:$S$15))","v":0},{"$f":"SUM(COUNTIF(AD5:AD15,$S$5:$S$15))","v":0},{"$f":"SUM(COUNTIF(AE5:AE15,$S$5:$S$15))","v":0},{"$f":"SUM(COUNTIF(AF5:AF15,$S$5:$S$15))","v":0},{"$f":"SUM(COUNTIF(AG5:AG15,$S$5:$S$15))","v":0},{"$f":"SUM(COUNTIF(AH5:AH15,$S$5:$S$15))","v":0},{"$f":"SUM(COUNTIF(AI5:AI15,$S$5:$S$15))","v":0},{"$f":"SUM(COUNTIF(AJ5:AJ15,$S$5:$S$15))","v":0},{"$f":"SUM(COUNTIF(AK5:AK15,$S$5:$S$15))","v":0},{"$f":"SUM(COUNTIF(AL5:AL15,$S$5:$S$15))","v":0},{"$f":"SUM(COUNTIF(AM5:AM15,$S$5:$S$15))","v":0},{"$f":"SUM(COUNTIF(AN5:AN15,$S$5:$S$15))","v":0},{"$f":"SUM(COUNTIF(AO5:AO15,$S$5:$S$15))","v":0},{"$f":"SUM(COUNTIF(AP5:AP15,$S$5:$S$15))","v":0},{"$f":"SUM(COUNTIF(AQ5:AQ15,$S$5:$S$15))","v":0},{"$f":"SUM(COUNTIF(AR5:AR15,$S$5:$S$15))","v":0},{"$f":"SUM(COUNTIF(AS5:AS15,$S$5:$S$15))","v":0},{"$f":"SUM(COUNTIF(AT5:AT15,$S$5:$S$15))","v":0},{"$f":"SUM(COUNTIF(AU5:AU15,$S$5:$S$15))","v":0},{"$f":"SUM(COUNTIF(AV5:AV15,$S$5:$S$15))","v":0},{"$f":"SUM(COUNTIF(AW5:AW15,$S$5:$S$15))","v":0},{"$f":"SUM(COUNTIF(AX5:AX15,$S$5:$S$15))","v":0}]
[null,null,null,null,null,null,null,null,null,null,null,null,null,null,null,null,null,null,{"$f":"i_ControlType","v":0},"Control Type","Easy Spring Wand","Easy Spring Wand","Easy Spring Wand","Easy Spring Wand","Easy Spring Wand","Easy Spring Wand","Easy Spring Ultra (ESU)","Easy Spring Ultra (ESU)","Easy Spring Ultra (ESU)","Easy Spring Ultra (ESU)","Easy Spring Ultra (ESU)","Easy Spring Ultra (ESU)","Easy Spring Ultra - Skyline","Easy Spring Ultra - Skyline","Easy Spring Ultra - Skyline","Easy Spring Ultra - Skyline","Easy Spring Ultra - Skyline","Easy Spring Ultra - Skyline","Easy Spring Ultra - Skyline","Easy Spring Ultra - Skyline"]
[]
[null,null,null,null,null,null,null,null,null,null,null,null,null,null,null,null,null,null,{"$f":"i_InstallationType","v":0},"Installation","Cassette 120","Cassette 110","CF90 Cassette","Open","Open","P95 Semi Cassette","Cassette 120","Cassette 110","CF90 Cassette","Open","Open","P95 Semi Cassette","Open","Open","Skyline Fascia","Skyline Fascia","Cassette 100","CF90 Cassette","P95 Semi Cassette","Cassette 110"]
[null,null,null,null,null,null,null,null,null,null,null,null,null,null,null,null,null,null,null,null,"Cassette 100",null,"CF90 Fascia","Mounting Rail",null,null,"Cassette 100",null,"CF90 Fascia","Mounting Rail",null,null,null,"Mounting Rail",null,null,"Cassette 120","CF90 Fascia"]
[]
[]
[null,null,null,null,null,null,null,null,null,null,null,null,null,null,null,null,null,null,{"$f":"i_BracketOptions","v":0},"Bracket Options","Cassette 100/120 Limiter Bracket Set","LX Limiter Bracket Set","LX Limiter Bracket Set","LX Limiter Bracket Set","Skyline Limiter Standard Bracket Set","LX Limiter Bracket Set","Cassette 100/120 Limiter Bracket Set","LX Limiter Bracket Set","LX Limiter Bracket Set","LX Limiter Bracket Set","Skyline Limiter Standard Bracket Set","LX Limiter Bracket Set","Skyline Standard Brackets","LX Skyline Brackets | 40mm Pitch","Skyline 3\" Fascia Brackets","Skyline 4\" Fascia Brackets","Cassette 100/120 Brackets","LX Skyline Brackets | 40mm Pitch","LX Skyline Brackets | 40mm Pitch","LX Skyline Brackets | 40mm Pitch"]
[null,null,null,null,null,null,null,null,null,null,null,null,null,null,null,null,null,null,null,null,null,null,null,null,null,null,null,null,null,null,null,null,null,"LX Skyline Brackets | 55mm Pitch"]
[]
[]
[]
[]
[]
[null,null,null,"=IFERROR(IF(FIND(\"CF90\",i_InstallationType)>0,0,1),1)"]
[null,null,null,null,null,null,null,null,null,null,"#screens"]
[null,null,null,null,null,null,null,null,null,null,{"$f":"o_nScreens","v":1},null,null,null,null,null,null,null,"Type","Deduction",{"$f":"IF(U4<>$T$4,0,1)","v":1},{"$f":"IF(V4<>$T$4,0,1)","v":1},1,1,1,{"$f":"IF(Z4<>$T$4,0,1)","v":1},1,{"$f":"IF(AB4<>$T$4,0,1)","v":1},1,1,1,{"$f":"IF(AF4<>$T$4,0,1)","v":1},1,{"$f":"IF(AH4<>$T$4,0,1)","v":1},1,{"$f":"IF(AJ4<>$T$4,0,1)","v":1},{"$f":"IF(AK4<>$T$4,0,1)","v":1},1,{"$f":"IF(AM4<>$T$4,0,1)","v":1},1,1,1,1,1,1,1,1,1,1,1]
[null,null,null,null,null,null,null,null,null,null,null,null,null,null,null,null,null,null,"Fabric",{"$f":"INDEX(U21:AX21,0,MATCH(1,$U$20:$AX$20,0))","v":42},42,41,42,34,36,40,40,40,40,32,34,39,35,35,41,42,40,45,41,40]
[null,null,null,"HAS FORMULAS",null,null,null,null,null,null,null,null,null,null,null,null,null,null,"Tube",42,42,41,42,{"$f":"X21","v":34},{"$f":"Y21","v":36},{"$f":"Z21","v":40},40,40,40,32,34,{"$f":"AF21","v":39},{"$f":"AG21","v":35},{"$f":"AH21","v":35},{"$f":"AI21","v":41},{"$f":"AJ21","v":42},40,45,41,{"$f":"AN21","v":40}]
[null,null,null,null,null,null,null,null,null,null,null,null,null,null,null,null,null,null,"wb",42,42,41,42,34,36,{"$f":"Z22","v":40},40,40,40,32,34,{"$f":"AF22","v":39},{"$f":"AG21","v":35},35,41,{"$f":"AJ21","v":42},40,45,41,{"$f":"AN22","v":40}]
[null,null,null,null,null,null,null,"Does",null,"Apply to ",null,null,null,null,null,null,null,null,"Mounting Rail",0,null,null,null,4,null,6,null,null,null,4,null,6,null,4,null,null,null,null,6,{"$f":"AN26","v":5}]
[null,null,null,null,null,null,null,null,null,null,null,null,null,null,null,null,null,null,"CF Cassette Extrusion",0,null,null,14,null,null,null,null,null,14,null,null,null,null,null,null,null,null,19]
[null,null,null,null,null,null,null,null,null,null,null,null,null,null,null,null,null,null,"Cassette 100/120",{"$f":"INDEX(U26:AX26,0,MATCH(1,$U$20:$AX$20,0))","v":5},5,5,null,null,null,null,5,5,null,null,null,null,null,null,4,5,5,null,null,5]
[null,null,null,null,null,null,null,null,null,null,null,null,null,null,null,null,null,null,"Fabric_drop",{"$f":"INDEX(U27:AX27,0,MATCH(1,$U$20:$AX$20,0))","v":-150},-150,-150,-150,-150,-150,-150,-150,-150,-150,-150,-150,-150,-150,-150,-150,-150,-150,-150,-150,-150]
[null,null,null,{"$f":"COUNTA(D31:D44)","v":10},null,null,null,null,null,null,null,null,"Lookup",null,null,null,null,null,null,null,null,null,null,null,null,null,null,null,null,null,null,null,null,null,null,null,null,null,null,"*for fabric wrap"]
[null,null,null,null,null,null,null,null,null,null,null,null,"Deduction"]
[null,null,null,"Fabric","Brackets","Tube","Fabric_Drop","wb","Mounting Rail","CF Cassette","Cassette",null,"Modifiers",null,"QTY","ON/OFF",null,null,null,null,{"$f":"IF(U4<>$T$4,0,1)","v":1},1,1,1,1,1,1,1,1,1,1,1,1,1,1,1,1,1,1,1,1,1,1,1,1,1,1,1,1,1]
[null,null,null,1,null,1,0,1,1,0,1,null,{"$f":"INDEX($U$31:$AX$41,0,MATCH(1,$U$30:$AX$30,0))","v":5},null,1,{"$f":"IF(INDIRECT(\"i_\"&S31)=T31,1,0)","v":0},null,null,"BracketCovers","Yes",5,"-","-",2,4,"-",5,"-","-",2,4,"-",4,2,"-","-",4,"-","-",5]
[null,null,null,{"$f":"IFERROR(IF(FIND(\"Yes\",i_DimOut)>0,0,1),1)","v":1},{"$f":"IFERROR(IF(FIND(\"LX\",i_BracketOptions)>0,1,0),0)","v":0},1,0,{"$f":"IFERROR(IF(FIND(\"Yes\",i_DimOut)>0,0,1),1)","v":1},0,0,0,null,17.010000000000002,null,{"$f":"o_nScreens-1","v":0},{"$f":"IF(INDIRECT(\"i_\"&S32)=T32,1*E32,0)","v":0},null,"LX","LinkedScreens","Easy Link",17.010000000000002,17.010000000000002,17.010000000000002,17.010000000000002,"-",17.010000000000002,17.010000000000002,17.010000000000002,17.010000000000002,17.010000000000002,"-",17.010000000000002,"-",17.010000000000002,"-","-",17.010000000000002,17.010000000000002,17.010000000000002,17.010000000000002]
[null,null,null,{"$f":"IFERROR(IF(FIND(\"Yes\",i_DimOut)>0,0,1),1)","v":1},null,1,0,{"$f":"IFERROR(IF(FIND(\"Yes\",i_DimOut)>0,0,1),1)","v":1},0,0,0,null,20.010000000000002,null,{"$f":"o_nScreens-1","v":0},{"$f":"IF(INDIRECT(\"i_\"&S33)=T33,1,0)","v":0},null,null,"LinkedScreens","Infinite Adjuster",20.010000000000002,20.010000000000002,20.010000000000002,20.010000000000002,20.010000000000002,20.010000000000002,20.010000000000002,20.010000000000002,20.010000000000002,20.010000000000002,20.010000000000002,20.010000000000002,20.010000000000002,20.010000000000002,20.010000000000002,20.010000000000002,20.010000000000002,20.010000000000002,20.010000000000002,20.010000000000002]
[null,null,null,{"$f":"IFERROR(IF(FIND(\"Yes\",i_DimOut)>0,0,1),1)","v":1},{"$f":"IF(AND(i_LinkedScreens=\"Easy Link\",E32=0),1,0)","v":0},1,0,{"$f":"IFERROR(IF(FIND(\"Yes\",i_DimOut)>0,0,1),1)","v":1},0,0,0,null,19.010000000000002,null,{"$f":"o_nScreens-1","v":0},{"$f":"IF(INDIRECT(\"i_\"&S34)=T34,1*E34,0)","v":0},null,"Skyline","LinkedScreens","Easy Link",19.010000000000002,"-","-","-",19.010000000000002,"-",19.010000000000002,"-","-","-",19.010000000000002,"-",19.010000000000002,"-",19.010000000000002,19.010000000000002,19.010000000000002,"-","-",19.010000000000002]
[null,null,null,1,null,0,0,1,0,0,0,null,"-",null,{"$f":"o_nScreens-1","v":0},{"$f":"IF(INDIRECT(\"i_\"&S35)=T35,1,0)","v":0},null,"Fabric","DimOut","Yes","-","-",40,"-","-","-","-","-",40,"-","-","-","-","-","-","-","-",40,"-","-"]
[null,null,null,0,null,0,0,0,0,0,0,null,"-",null,0,{"$f":"IF(INDIRECT(\"i_\"&S36)=T36,1,0)","v":0},null,"Height","DimOut","Yes","-","-",96,"-","-","-","-","-",96,"-","-","-","-","-","-","-","-",96,"-","-"]
[null,null,null,0,null,0,0,0,0,0,0,null,"-",null,0,{"$f":"IF(INDIRECT(\"i_\"&S37)=T37,1,0)","v":0},null,"w/ Top Fix","DimOut","Yes","-","-",98,"-","-","-","-","-",98,"-","-","-","-","-","-","-","-",98,"-","-"]
[null,null,null,0,null,null,1,null,null,null,null,null,-140,null,1,{"$f":"IF(INDIRECT(\"i_\"&S38)=T38,1,0)","v":0},null,null,"WeightBar","Fabric Wrap",-140,-140,-140,-140,-140,-140,-140,-140,-140,-140,-140,-140,-140,-140,-140,-140,-140,-140,-140,-140]
[null,null,null,0,null,0,0,0,0,0,0,null,"-",null,0,{"$f":"IF(INDIRECT(\"i_\"&S39)=T39,1,0)","v":0},null,"w/ Face Fix","DimOut","Yes","-","-",101,"-","-","-","-","-",101,"-","-","-","-","-","-","-","-",101,"-","-"]
[null,null,null,0,null,0,0,0,1,0,0,null,"-",null,{"$f":"o_nScreens-1","v":0},{"$f":"IF(S40>1,1,0)","v":1},null,"MR split",{"$f":"\"# Screens: \" &o_nScreens","v":"# Screens: 1"},"> 1","-","-","-",2.0099999999999998,"-","-","-","-","-",2.0099999999999998,"-","-","-",2.0099999999999998,"-","-","-","-","-","-"]
[]
[]
[]
[]
[null,null,null,null,null,null,null,null,null,null,null,null,null,null,null,null,null,null,"Type","Deduction",{"$f":"IF(U4<>$T$4,0,1)","v":1},1,1,1,1,1,1,1,1,1,1,1,1,1,1,1,1,1,1,1,1,1,1,1,1,1,1,1,1,1]
[null,null,null,null,null,null,null,null,null,null,null,null,null,null,null,null,null,null,"Fabric",{"$f":"IFERROR(CONVERT(INDEX(U46:AX46,0,MATCH(1,$U$20:$AX$20,0)),\"mm\",INDEX(T_UnitSelection[Units],MATCH(i_Units,T_UnitSelection[UnitSelection],0))),\"\")","v":""},{"$f":"IFERROR(IF(U$45=0,\"\",U21+SUMPRODUCT($P$31:$P$40,$O$31:$O$40,$M$31:$M$40,OFFSET($D$30,1,MATCH($S46,$D$30:$K$30,0)-1,$D$28,1))),\"\")","v":42},41,42,34,36,40,40,40,40,32,34,39,35,35,41,42,40,45,41,40,0,0,0,0,0,0,0,0,0,0]
[null,null,null,null,null,null,null,null,null,null,null,null,null,null,null,null,null,null,"Tube",{"$f":"IFERROR(CONVERT(INDEX(U47:AX47,0,MATCH(1,$U$20:$AX$20,0)),\"mm\",INDEX(T_UnitSelection[Units],MATCH(i_Units,T_UnitSelection[UnitSelection],0))),\"\")","v":""},{"$f":"IFERROR(IF(U$45=0,\"\",U22+SUMPRODUCT($P$31:$P$40,$O$31:$O$40,$M$31:$M$40,OFFSET($D$30,1,MATCH($S47,$D$30:$K$30,0)-1,$D$28,1))),\"\")","v":42},41,42,34,36,40,40,40,40,32,34,39,35,35,41,42,40,45,41,40,0,0,0,0,0,0,0,0,0,0]
[null,null,null,null,null,null,null,null,null,null,null,null,null,null,null,null,null,null,"wb",{"$f":"IFERROR(CONVERT(INDEX(U48:AX48,0,MATCH(1,$U$20:$AX$20,0)),\"mm\",INDEX(T_UnitSelection[Units],MATCH(i_Units,T_UnitSelection[UnitSelection],0))),\"\")","v":""},{"$f":"IFERROR(IF(U$45=0,\"\",U23+SUMPRODUCT($P$31:$P$40,$O$31:$O$40,$M$31:$M$40,OFFSET($D$30,1,MATCH($S48,$D$30:$K$30,0)-1,$D$28,1))),\"\")","v":42},41,42,34,36,40,40,40,40,32,34,39,35,35,41,42,40,45,41,40,0,0,0,0,0,0,0,0,0,0]
[null,null,null,null,null,null,null,null,null,null,null,null,null,null,null,null,null,null,"Mounting Rail",{"$f":"IFERROR(CONVERT(INDEX(U49:AX49,0,MATCH(1,$U$20:$AX$20,0)),\"mm\",INDEX(T_UnitSelection[Units],MATCH(i_Units,T_UnitSelection[UnitSelection],0))),\"\")","v":""},{"$f":"IFERROR(IF(U$45=0,\"\",U24+SUMPRODUCT($P$31:$P$40,$O$31:$O$40,$M$31:$M$40,OFFSET($D$30,1,MATCH($S49,$D$30:$K$30,0)-1,$D$28,1))),\"\")","v":0},0,0,4,0,6,0,0,0,4,0,6,0,4,0,0,0,0,6,5,0,0,0,0,0,0,0,0,0,0]
[null,null,null,null,null,null,null,null,null,null,null,null,null,null,null,null,null,null,"CF Cassette",{"$f":"IFERROR(CONVERT(INDEX(U50:AX50,0,MATCH(1,$U$20:$AX$20,0)),\"mm\",INDEX(T_UnitSelection[Units],MATCH(i_Units,T_UnitSelection[UnitSelection],0))),\"\")","v":""},{"$f":"IFERROR(IF(U$45=0,\"\",U25+SUMPRODUCT($P$31:$P$40,$O$31:$O$40,$M$31:$M$40,OFFSET($D$30,1,MATCH($S50,$D$30:$K$30,0)-1,$D$28,1))),\"\")","v":0},0,14,0,0,0,0,0,14,0,0,0,0,0,0,0,0,19,0,0,0,0,0,0,0,0,0,0,0,0]
[null,null,null,null,null,null,null,null,null,null,null,null,null,null,null,null,null,null,"Cassette",{"$f":"IFERROR(CONVERT(INDEX(U51:AX51,0,MATCH(1,$U$20:$AX$20,0)),\"mm\",INDEX(T_UnitSelection[Units],MATCH(i_Units,T_UnitSelection[UnitSelection],0))),\"\")","v":""},{"$f":"IFERROR(IF(U$45=0,\"\",U26+SUMPRODUCT($P$31:$P$40,$O$31:$O$40,$M$31:$M$40,OFFSET($D$30,1,MATCH($S51,$D$30:$K$30,0)-1,$D$28,1))),\"\")","v":5},5,0,0,0,0,5,5,0,0,0,0,0,0,4,5,5,0,0,5,0,0,0,0,0,0,0,0,0,0]
[null,null,null,null,null,null,null,null,null,null,null,null,null,null,null,null,null,null,"Fabric_Drop",{"$f":"IFERROR(CONVERT(INDEX(U52:AX52,0,MATCH(1,$U$20:$AX$20,0)),\"mm\",INDEX(T_UnitSelection[Units],MATCH(i_Units,T_UnitSelection[UnitSelection],0))),\"\")","v":""},{"$f":"IFERROR(IF(U$45=0,\"\",U27+SUMPRODUCT($P$31:$P$40,$O$31:$O$40,$M$31:$M$40,OFFSET($D$30,1,MATCH($S52,$D$30:$K$30,0)-1,$D$28,1))),\"\")","v":-150},{"$f":"IFERROR(IF(V$45=0,\"\",V27+SUMPRODUCT($P$31:$P$40,$O$31:$O$40,$M$31:$M$40,OFFSET($D$30,1,MATCH($S52,$D$30:$K$30,0)-1,$D$28,1))),\"\")","v":-150},{"$f":"IFERROR(IF(W$45=0,\"\",W27+SUMPRODUCT($P$31:$P$40,$O$31:$O$40,$M$31:$M$40,OFFSET($D$30,1,MATCH($S52,$D$30:$K$30,0)-1,$D$28,1))),\"\")","v":-150},-150,-150,-150,-150,-150,-150,-150,-150,-150,-150,-150,-150,-150,-150,-150,-150,{"$f":"IFERROR(IF(AN$45=0,\"\",AN27+SUMPRODUCT($P$31:$P$40,$O$31:$O$40,$M$31:$M$40,OFFSET($D$30,1,MATCH($S52,$D$30:$K$30,0)-1,$D$28,1))),\"\")","v":-150}]
[null,null,null,null,null,null,null,null,null,null,null,null,null,null,null,null,null,null,"DimOut Height (No Clip)",{"$f":"IFERROR(CONVERT(INDEX(U53:AX53,0,MATCH(1,$U$20:$AX$20,0)),\"mm\",INDEX(T_UnitSelection[Units],MATCH(i_Units,T_UnitSelection[UnitSelection],0))),\"\")","v":""},null,{"$f":"V36","v":"-"},{"$f":"W36","v":96},null,null,null,null,{"$f":"AB36","v":"-"},{"$f":"AC36","v":96},null,null,null,null,null,null,null,null,{"$f":"AL36","v":96}]
[null,null,null,null,null,null,null,null,null,null,null,null,null,null,null,null,null,null,"DimOut Height (Top Fix)",{"$f":"IFERROR(CONVERT(INDEX(U54:AX54,0,MATCH(1,$U$20:$AX$20,0)),\"mm\",INDEX(T_UnitSelection[Units],MATCH(i_Units,T_UnitSelection[UnitSelection],0))),\"\")","v":""},null,{"$f":"V37","v":"-"},{"$f":"W37","v":98},null,null,null,null,{"$f":"AB37","v":"-"},{"$f":"AC37","v":98},null,null,null,null,null,null,null,null,{"$f":"AL37","v":98}]
[null,null,null,null,null,null,null,null,null,null,null,null,null,null,null,null,null,null,"DimOut Height (Face Fix)",{"$f":"IFERROR(CONVERT(INDEX(U55:AX55,0,MATCH(1,$U$20:$AX$20,0)),\"mm\",INDEX(T_UnitSelection[Units],MATCH(i_Units,T_UnitSelection[UnitSelection],0))),\"\")","v":""},null,{"$f":"V39","v":"-"},101,null,null,null,null,{"$f":"AB39","v":"-"},101,null,null,null,null,null,null,null,null,{"$f":"AL39","v":101}]
[null,null,null,null,null,null,null,null,null,null,null,null,null,null,null,null,null,null,"Ballast",{"$f":"IFERROR(CONVERT(INDEX(U56:AX56,0,MATCH(1,$U$20:$AX$20,0)),\"mm\",INDEX(T_UnitSelection[Units],MATCH(i_Units,T_UnitSelection[UnitSelection],0))),\"\")","v":""},{"$f":"IFERROR((65*o_nScreens)+U47,\"\")","v":107},{"$f":"V40","v":"-"},107,99,101,{"$f":"IFERROR((65*o_nScreens)+Z47,\"\")","v":105},105,{"$f":"IFERROR((65*o_nScreens)+AB47,\"\")","v":105},105,97,99,{"$f":"IFERROR((65*o_nScreens)+AF47,\"\")","v":104},100,{"$f":"IFERROR((65*o_nScreens)+AH47,\"\")","v":100},106,{"$f":"IFERROR((65*o_nScreens)+AJ47,\"\")","v":107},{"$f":"IFERROR((65*o_nScreens)+AK47,\"\")","v":105},110,{"$f":"IFERROR((65*o_nScreens)+AM47,\"\")","v":106},105,65,65,65,65,65,65,65,65,65,65]
[null,null,null,null,null,null,null,null,null,null,null,null,null,null,null,null,null,null,"None",{"$f":"IFERROR(CONVERT(INDEX(U57:AX57,0,MATCH(1,$U$20:$AX$20,0)),\"mm\",INDEX(T_UnitSelection[Units],MATCH(i_Units,T_UnitSelection[UnitSelection],0))),\"\")","v":""}]
[]
[]
[]
[]
[]
[]
[]
[]
[]
[]
[null,null,null,null,null,null,null,null,null,null,null,null,null,null,null,null,null,null,"**need to find deductions for easy lock LX and check against each installation. "]
[]
[null,null,null,null,null,null,null,null,null,null,null,null,null,null,null,null,null,null,"=IFERROR(CONVERT(IF(AO22=\"Y\",i_Width-INDEX(INDIRECT(\"T_DeductionCovers\"&i_BracketCovers&\"[Deduction]\"),MATCH(AP22,INDIRECT(\"T_DeductionCovers\"&i_BracketCovers&\"[Type]\"),0)),\"\"),\"mm\",AM22),\"\")/(o_nScreens)"]
[]
[]
[]
[null,null,null,null,null,null,null,null,null,null,null,null,null,null,null,null,null,null,null,null,null,"S45 Easy Link","S45 Easy Link"]
[null,null,null,null,null,null,null,null,null,null,null,null,null,null,null,null,null,null,"skyline easy link - 1.5\"",19,null,"Infinite Adjuster","Infinite Adjuster"]
[null,null,null,null,null,null,null,null,null,null,null,null,null,null,null,null,null,null,"skyline easy link - 2.0\"",18,null,"Skyline Easy Link","Skyline Easy Link"]
[null,null,null,null,null,null,null,null,null,null,null,null,null,null,null,null,null,null,"skyline easylink S40/45",19]
[]
[null,null,null,null,null,null,null,null,null,null,null,null,null,null,null,null,null,null,"S45 easy link, 1.5\" + S45",17]
[null,null,null,null,null,null,null,null,null,null,null,null,null,null,null,null,null,null,"S45 easy link, 2\"",16]
[]
[null,null,null,null,null,null,null,null,null,null,null,null,null,null,null,null,null,null,"Infinite 1.5\"",20]
[null,null,null,null,null,null,null,null,null,null,null,null,null,null,null,null,null,null,"Infinite 2.0\"",19,null,"2\" tube = subtract 1mm from link deduction","2\" tube = subtract 1mm from link deduction"]
[]
[]
[]
[]
[]
[null,null,null,null,null,null,null,null,null,null,null,null,null,null,null,null,null,null,"*dim-out systems using F4115 weight bar, must use SB06-0210-xxx001 End Cap. Weight bar deduction is then 118 mm. "]

{"sheet":"Ctrl_Recommendations","index":6,"n_rows":112,"n_cols":129,"rows_kept":112,"cut":false,"hidden":true,"merged":[[3,39,3,59],[5,40,5,59],[3,62,3,82],[40,40,40,59],[2,39,2,128],[3,85,3,105],[3,108,3,128],[5,18,5,37],[40,63,40,82],[40,86,40,105],[40,109,40,128],[5,63,5,82],[5,86,5,105],[35,39,35,128],[36,39,36,59],[36,62,36,82],[36,85,36,105],[36,108,36,128],[5,109,5,128],[1,7,2,7],[42,1,42,2],[50,1,50,3],[1,2,1,3],[27,4,27,6],[34,4,34,6],[1,4,1,5],[1,6,2,6],[14,1,14,3],[67,1,67,2],[60,1,60,2],[9,1,10,1],[15,2,15,3],[16,2,16,3]]}
[]
[null,null,"Absolute Min",null,"Absolute Max",null,{"$f":"\"Current Value (\"&i_Units&\")\"","v":"Current Value ()"},"Outside Specs\n(0 = No, 1 = Yes)",null,"Warning Trigger","Warning ID","Warning Text"]
[null,null,"mm",{"$f":"\"Min (\"&i_Units&\")\"","v":"Min ()"},"mm",{"$f":"\"Max (\"&i_Units&\")\"","v":"Max ()"},null,null,null,null,"Warning1","Warning! Nominated blind size is outside allowable specifications based on Selections.               Refer Product Specifications for more details.",null,null,null,null,null,null,null,null,null,null,null,null,null,null,null,null,null,null,null,null,null,null,null,null,null,null,null,"Easy Spring Ultra"]
[null,"Width",{"$f":"IFERROR(VLOOKUP(i_ControlType,T_MinWidth,2,FALSE),0)","v":0},{"$f":"IF(i_Units=\"Metric\",C4,CONVERT(C4,\"mm\",\"in\"))","v":0},4101,{"$f":"IF(i_Units=\"Metric\",E4,CONVERT(E4,\"mm\",\"in\"))","v":161.45669291338584},{"$f":"i_Width","v":0},{"$f":"IF(AND(AND(i_Width<>\"\",i_Width>=0),OR(i_Width<MinWidth,i_Width>MaxWidth)),1,0)","v":0},null,null,"Warning2",{"$f":"\"Warning! Nominated blind size is outside system specifications. \"&\"                                                               Width Range: \"&INDIRECT(\"o_WidthRange\"&i_Units)&\"; \"&\"Maximum Drop: \"&INDIRECT(\"o_DropRange\"&i_Units)","v":{"$error":"#REF!"}},null,null,null,null,null,null,null,null,null,null,null,null,null,null,null,null,null,null,null,null,null,null,null,null,null,null,null,"RTEA4",null,null,null,null,null,null,null,null,null,null,null,null,null,null,null,null,null,null,null,null,null,null,"S45 LT",null,null,null,null,null,null,null,null,null,null,null,null,null,null,null,null,null,null,null,null,null,null,"S45 STD",null,null,null,null,null,null,null,null,null,null,null,null,null,null,null,null,null,null,null,null,null,null,"S45 HD"]
[null,"Drop",0,{"$f":"IF(i_Units=\"Metric\",C5,CONVERT(C5,\"mm\",\"in\"))","v":0},2501,{"$f":"IF(i_Units=\"Metric\",E5,CONVERT(E5,\"mm\",\"in\"))","v":98.464566929133852},{"$f":"i_Drop","v":0},{"$f":"IF(AND(AND(i_Drop<>\"\",i_Drop>=0),OR(i_Drop<MinDrop,i_Drop>MaxDrop)),1,0)","v":0},null,null,"o_LinkWarning","Warning! Link system must be selected, or reduce blind size.",null,null,null,null,null,null,null,null,null,null,null,null,null,null,null,null,null,null,null,null,null,null,null,null,null,null,null,null,null,{"$f":"IF(AND(o_BlindWidth/1000>AP7,o_BlindWidth/1000<=AQ7),1,0)","v":0},0,0,0,0,0,0,0,0,0,0,0,0,0,0,0,0,0]
[null,null,null,null,null,null,null,null,null,{"$f":"IF(o_BlindWidth>=o_MinWidthReqd,0,1)","v":{"$error":"#N/A"}},"o_BoosterWarning","Warning! Blind width too small for selected Booster.",null,null,1,"1.5\"",null,null,"Width (m)",null,null,null,null,null,null,null,null,null,null,null,null,null,null,null,null,null,null,null,null,null,"Width (m)",null,null,null,null,null,null,null,null,null,null,null,null,null,null,null,null,null,null,null,null,null,null,"Width (m)",null,null,null,null,null,null,null,null,null,null,null,null,null,null,null,null,null,null,null,null,null,null,"Width (m)",null,null,null,null,null,null,null,null,null,null,null,null,null,null,null,null,null,null,null,null,null,null,"Width (m)"]
[null,"Width Range",{"$f":"C4&\" mm - 4000 mm\"","v":"0 mm - 4000 mm"},{"$f":"ROUND(CONVERT(C4,\"mm\",\"in\"),2)&\" in - 157.50 in\"","v":"0 in - 157.50 in"},null,null,null,null,null,{"$f":"IF(AND(H4=0,I23<=o_BlindWidth),0,1)","v":{"$error":"#N/A"}},"o_BoosterTextRec",{"$f":"IF(J7=1,\"Warning! Blind width too small.\",\"*Recommended Booster Size: \"&o_BoosterRec&\", Estimated Pre-turns: \"&o_BoosterPreturnRec)","v":{"$error":"#N/A"}},null,null,2,"S45 LT",null,"Drop (m)",0.2,0.4,0.6,0.8,1,1.2,1.4,1.6,1.8,2,2.2000000000000002,2.4,2.6,2.8,3,3.2,3.4,3.6,3.8,4,null,"Drop (m)",0.2,0.4,0.6,0.8,1,1.2,1.4,1.6,1.8,2,2.2000000000000002,2.4,2.6,2.8,3,3.2,3.4,3.6,3.8,4,null,null,"Drop (m)",0.2,0.4,0.6,0.8,1,1.2,1.4,1.6,1.8,2,2.2000000000000002,2.4,2.6,2.8,3,3.2,3.4,3.6,3.8,4,null,null,"Drop (m)",0.2,0.4,0.6,0.8,1,1.2,1.4,1.6,1.8,2,2.2000000000000002,2.4,2.6,2.8,3,3.2,3.4,3.6,3.8,4,null,null,"Drop (m)",0.2,0.4,0.6,0.8,1,1.2,1.4,1.6,1.8,2,2.2000000000000002,2.4,2.6,2.8,3,3.2,3.4,3.6,3.8,4]
[null,"Drop Range","2400 mm","94.50 in",null,null,null,null,null,null,"Warning3","Warning! Selected Booster does not match recommendation - shade performance may not be optimal.",null,null,3,"S45 STD",null,0.1,0,1,1,1,1,1,1,1,1,1,1,1,2,3,4,4,0,0,0,0,null,0.1,0,"G.9",{"$f":"IF(AND(i_ControlType=\"Easy Spring Ultra (ESU)\",i_Tube=TEXT(1.5&CHAR(34),0)),\"A.11\",\"G.9\")","v":"G.9"},"A.11","B.14","B.15","B.16","B.17","B.18","B.18","B.19","C.11","E.12","E.12","E.13","E.13","E.14","E.14","E.15",0,null,null,0.1,0,"G.9","G.9","A.11","B.15","B.11","B.12","B.13","C.10","C.11","C.11","C.12","C.8","E.13","E.9","F.8","F.8","F.4","F.9","F.9",null,null,0.1,0,"G.9","G.9","A.11","B.15","B.16","B.17","B.13","C.10","C.11","C.7","C.12","C.8","C.13","E.14","F.8","F.8","F.9","F.9","F.9",null,null,0.1,0,"G.9","G.9","A.12","B.15","B.16","C.10","C.10","C.11","C.11","C.12","C.12","D.7","D.8","D.8","D.8","F.9","F.9","F.9","F.10"]
[null,null,null,null,null,null,null,null,null,null,null,null,null,null,4,"S45 HD",null,0.2,0,1,1,1,1,1,1,1,1,1,1,1,2,3,4,4,0,0,0,0,null,0.2,0,"G.9","G.9","A.11","B.14","B.15","B.16","B.17","B.18","B.18","B.19","C.11","E.12","E.12","E.13","E.13","E.14","E.14","E.15",0,null,null,0.2,0,"G.9","G.9","A.11","B.15","B.12","B.13","B.14","C.10","C.11","C.11","C.12","C.9","E.13","E.10","F.8","F.8","F.5","F.9","F.9",null,null,0.2,0,"G.9","G.9","A.11","B.15","B.16","B.17","B.14","C.10","C.11","C.8","C.12","C.9","C.13","E.14","F.8","F.8","F.9","F.9","F.9",null,null,0.2,0,"G.9","G.9","A.12","B.15","B.16","C.10","C.10","C.11","C.11","C.12","C.12","D.7","D.8","D.8","D.8","F.9","F.9","F.9","F.10"]
[null,"Blind Width","mm","in",null,null,null,null,null,null,null,null,null,null,null,null,null,0.3,0,1,1,1,1,1,1,1,1,1,1,1,2,3,4,4,0,0,0,0,null,0.3,0,"G.9","G.9","A.11","B.14","B.15","B.16","B.17","B.18","B.18","B.19","C.11","E.12","E.12","E.13","E.13","E.14","E.14","E.15",0,null,null,0.3,0,"G.9","G.9","A.11","B.15","B.12","B.13","B.14","C.10","C.11","C.11","C.12","C.9","E.13","E.10","F.8","F.8","F.5","F.9","F.9",null,null,0.3,0,"G.9","G.9","A.11","B.15","B.16","B.17","B.14","C.10","C.11","C.8","C.12","C.9","C.13","E.14","F.8","F.8","F.9","F.9","F.9",null,null,0.3,0,"G.9","G.9","A.12","B.15","B.16","C.10","C.10","C.11","C.11","C.12","C.12","D.7","D.8","D.8","D.8","F.9","F.9","F.9","F.10"]
[null,null,{"$f":"IF(i_Units=\"Metric\",i_Width,CONVERT(i_Width,\"in\",\"mm\"))","v":0},{"$f":"IF(i_Units=\"Imperial\",i_Width,CONVERT(i_Width,\"mm\",\"in\"))","v":0},null,{"$f":"INDEX(T_ConvertControlType[Output],MATCH(i_ControlType,T_ConvertControlType[Input],0))","v":{"$error":"#N/A"}},null,null,null,null,null,null,null,null,null,null,null,0.4,0,1,1,1,1,1,1,1,1,1,1,1,2,3,4,4,0,0,0,0,null,0.4,0,"G.9","G.9","A.11","B.14","B.15","B.16","B.17","B.18","B.18","B.19","C.11","E.12","E.12","E.13","E.13","E.14","E.14","E.15",0,null,null,0.4,0,"G.9","G.9","A.11","B.15","B.13","B.14","B.15","C.10","C.11","C.11","C.12","C.10","E.13","E.11","F.8","F.8","F.6","F.9","F.9",null,null,0.4,0,"G.9","G.9","A.11","B.15","B.16","B.17","B.15","C.10","C.11","C.9","C.12","C.10","C.13","E.14","F.8","F.8","F.9","F.9","F.9",null,null,0.4,0,"G.9","G.9","A.12","B.15","B.16","C.10","C.10","C.11","C.11","C.12","C.12","D.7","D.8","D.8","D.8","F.9","F.9","F.9","F.10"]
[null,null,null,null,null,null,null,null,null,null,null,null,null,null,null,null,null,0.5,0,1,1,1,1,1,1,1,1,1,1,1,2,3,4,4,0,0,0,0,null,0.5,0,"G.9","G.9","A.11","B.14","B.15","B.16","B.17","B.18","B.18","B.19","C.11","E.12","E.12","E.13","E.13","E.14","E.14","E.15",0,null,null,0.5,0,"G.9","G.9","A.11","B.15","B.14","B.15","B.16","C.10","C.11","C.11","C.12","C.11","E.13","E.12","F.8","F.8","F.7","F.9","F.9",null,null,0.5,0,"G.9","G.9","A.11","B.15","B.16","B.17","B.16","C.10","C.11","C.10","C.12","C.11","C.13","E.14","F.8","F.8","F.9","F.9","F.9",null,null,0.5,0,"G.9","G.9","A.12","B.15","B.16","C.10","C.10","C.11","C.11","C.12","C.12","D.7","D.8","D.8","D.8","F.9","F.9","F.9","F.10"]
[null,"Min Width Required",{"$f":"INDEX(INDIRECT(\"T\"&F11&\"MinWidth[\"&o_Linked&\"]\"),MATCH(1,INDIRECT(\"T\"&F11&\"MinWidth[Booster_In]\",0),0))","v":{"$error":"#N/A"}},"mm","for the i_booster",null,null,"C13 changed",null,null,null,null,null,null,null,null,null,0.6,0,1,1,1,1,1,1,1,1,1,1,1,2,3,4,4,0,0,0,0,null,0.6,0,"G.9","G.9","A.11","B.14","B.15","B.16","B.17","B.18","B.18","B.19","C.11","E.12","E.12","E.13","E.13","E.14","E.14","E.15",0,null,null,0.6,0,"G.9","G.9","A.11","B.15","B.15","B.16","B.17","C.10","C.11","C.11","C.12","C.12","E.13","E.13","F.8","F.8","F.8","F.9","F.9",null,null,0.6,0,"G.9","G.9","A.11","B.15","B.16","B.17","B.17","C.10","C.11","C.11","C.12","C.12","C.13","E.14","F.8","F.8","F.9","F.9","F.9",null,null,0.6,0,"G.9","G.9","A.12","B.15","B.16","C.10","C.10","C.11","C.11","C.12","C.12","D.7","D.8","D.8","D.8","F.9","F.9","F.9","F.10"]
[null,null,null,null,null,null,null,"I23 added - check if needed",null,null,null,null,null,null,null,null,null,0.7,0,1,1,1,1,1,1,1,1,1,1,1,2,3,4,4,0,0,0,0,null,0.7,0,"G.9","G.9","A.11","B.14","B.15","B.16","B.17","B.18","B.19","B.20","C.11","E.12","E.12","E.13","E.13","E.14","E.14","E.15",0,null,null,0.7,0,"G.9","G.9","A.11","B.15","B.16","B.17","B.18","C.10","C.11","C.11","C.12","C.13","E.13","E.14","F.8","F.8","F.9","F.9","F.9",null,null,0.7,0,"G.9","G.9","A.11","B.15","B.16","B.17","B.18","C.10","C.11","C.12","C.12","C.13","C.13","E.14","F.8","F.8","F.9","F.9","F.9",null,null,0.7,0,"G.9","G.9","A.12","B.15","B.16","C.10","C.10","C.11","C.11","C.12","C.13","D.7","D.8","D.8","D.9","F.9","F.9","F.10","F.11"]
[null,"FOR RECOMMENDATIONS",null,null,null,null,null,"F11 added",null,null,null,null,null,null,null,null,null,0.8,0,1,1,1,1,1,1,1,1,1,1,1,2,3,4,4,0,0,0,0,null,0.8,0,"G.9","G.9","A.11","B.14","B.15","B.16","B.17","B.18","B.19","B.20","C.11","E.12","E.13","E.13","E.14","E.14","E.15","E.15",0,null,null,0.8,0,"G.9","G.9","A.11","B.15","B.16","B.17","B.18","C.10","C.11","C.12","C.12","C.13","E.13","E.14","F.8","F.8","F.9","F.9","F.9",null,null,0.8,0,"G.9","G.9","A.11","B.15","B.16","B.17","B.18","C.10","C.11","C.12","C.12","C.13","C.13","F.8","F.8","F.8","F.9","F.9","F.10",null,null,0.8,0,"G.9","G.9","A.12","B.15","B.16","C.10","C.10","C.11","C.12","C.12","D.7","D.8","D.8","D.8","D.9","F.9","F.9","F.10","F.11"]
[null,"Control Selection",{"$f":"i_ControlType","v":0},null,null,null,null,null,null,null,null,null,null,null,null,null,null,0.9,0,1,1,1,1,1,1,1,1,1,1,1,2,3,4,4,0,0,0,0,null,0.9,0,"G.9","G.9","A.11","B.14","B.15","B.16","B.17","B.18","B.19","B.20","C.11","E.12","E.13","E.13","E.14","E.14","E.15","E.15",0,null,null,0.9,0,"G.9","G.9","A.12","B.15","B.16","B.17","B.18","C.10","C.11","C.12","C.12","C.13","E.13","E.14","F.8","F.8","F.9","F.9","F.10",null,null,0.9,0,"G.9","G.9","A.12","B.15","B.16","B.17","B.18","C.10","C.11","C.12","C.12","C.13","C.14","F.8","F.8","F.8","F.9","F.9","F.10",null,null,0.9,0,"G.9","G.9","A.12","B.15","B.17","C.10","C.10","C.11","C.12","C.12","D.7","D.8","D.8","D.8","D.9","F.9","F.9","F.11","F.11"]
[null,"Tube Selection",{"$f":"i_Tube","v":0},null,null,null,null,"E21 added",null,{"$f":"IF(AND(SUM(o_SizeWarningTrigger)>0,i_ControlType<>\"\"), Warning2, IF(AND(o_BlindOutOfSpec=\"Yes\",i_Tube<>\"\",i_Width<>\"\",i_Drop<>\"\"),Warning1,\"\"))","v":""},null,null,null,null,null,null,null,1,0,1,1,1,1,1,1,1,1,1,1,2,3,4,4,4,0,0,0,0,null,1,0,"G.10",{"$f":"IF(AND(i_ControlType=\"Easy Spring Ultra (ESU)\",i_Tube=TEXT(1.5&CHAR(34),0)),\"A.11\",\"G.10\")","v":"G.10"},"A.11","B.14","B.15","B.17","B.18","B.19","B.20","C.11","E.12","E.13","E.13","E.14","E.14","E.15","E.15",0,0,null,null,1,0,"G.10","G.10","A.12","B.15","B.16","B.17","B.18","C.10","C.11","C.12","C.12","E.13","E.14","E.14","F.8","F.8","F.9","F.9","F.10",null,null,1,0,"G.10","G.10","A.12","B.15","B.16","B.17","B.18","C.11","C.11","C.12","C.13","C.13","E.14","F.8","F.8","F.9","F.9","F.10","F.10",null,null,1,0,"G.10","G.10","A.12","B.16","B.17","C.10","C.11","C.11","C.12","C.12","D.7","D.8","D.8","D.9","D.9","F.9","F.10","F.11","F.11"]
[null,"Width Input",{"$f":"ROUND((IF(i_Units=\"Metric\",i_Width,CONVERT(i_Width,\"in\",\"mm\"))/1000/2),1)*2","v":0},"m",null,null,null,null,null,null,null,null,null,null,null,null,null,1.1000000000000001,0,1,1,1,1,1,1,1,1,1,1,2,3,4,4,0,0,0,0,0,null,1.1000000000000001,0,"G.10","G.10","A.11","B.14","B.15","B.17","B.18","B.19","B.20","C.11","E.12","E.13","E.13","E.14","E.14","E.15","E.16",0,0,null,null,1.1000000000000001,0,"G.10","G.10","A.12","B.15","B.16","B.17","B.18","C.11","C.12","C.12","C.13","E.13","E.14","E.14","F.8","F.9","F.9","F.10","F.10",null,null,1.1000000000000001,0,"G.10","G.10","A.12","B.15","B.16","B.17","B.18","C.11","C.12","C.12","C.13","C.13","E.14","F.8","F.8","F.9","F.9","F.10","F.10",null,null,1.1000000000000001,0,"G.10","G.10","A.12","B.16","B.17","C.10","C.11","C.11","C.12","C.13","D.7","D.8","D.8","D.9","F.9","F.9","F.10","F.11","F.12"]
[null,"Drop Input",{"$f":"ROUND((IF(i_Units=\"Metric\",i_Drop,CONVERT(i_Drop,\"in\",\"mm\"))/1000/2),1)*2","v":0},"m",null,null,null,"NEED TO REMOVE SPRING RECOMMENDATION IF SOMEONE IS ADDING LINKS TO SMALLER SHADES (BELOW SPEC)",null,null,null,null,null,null,null,null,null,1.2,0,1,1,1,1,1,1,1,1,1,1,2,3,4,4,0,0,0,0,0,null,1.2,0,"G.10","G.10","A.11","B.15","B.15","B.17","B.18","B.19","B.20","C.11","E.12","E.13","E.14","E.14","E.15","E.15","E.16",0,0,null,null,1.2,0,"G.10","G.10","A.12","B.15","B.16","B.18","B.19","C.11","C.12","C.12","C.13","E.13","E.14","E.15","F.8","F.9","F.9","F.10","F.10",null,null,1.2,0,"G.10","G.10","A.12","B.15","B.17","B.18","B.19","C.11","C.12","C.12","C.13","C.14","E.14","F.8","F.8","F.9","F.10","F.10","F.10",null,null,1.2,0,"G.10","G.10","A.12","B.16","B.17","C.10","C.11","C.11","C.12","C.13","D.7","D.8","D.8","D.9","F.9","F.10","F.10","F.11","F.12"]
[null,null,null,"o_BoosterSize",null,null,null,null,null,null,null,null,null,null,null,null,null,1.3,0,1,1,1,1,1,1,1,1,1,1,2,3,4,4,0,0,0,0,0,null,1.3,0,"G.10","G.10","A.11","B.15","B.16","B.17","B.18","B.19","B.20","C.11","E.13","E.13","E.14","E.14","E.15","E.16","E.16",0,0,null,null,1.3,0,"G.10","G.10","A.12","B.16","B.17","B.18","B.19","C.11","C.12","C.12","C.13","E.14","E.14","F.8","F.8","F.9","F.10","F.10","F.10",null,null,1.3,0,"G.10","G.10","A.12","B.16","B.17","B.18","C.10","C.12","C.12","C.13","C.13","C.14","E.14","F.8","F.8","F.9","F.10","F.10","F.10",null,null,1.3,0,"G.10","G.10","A.12","B.16","B.17","C.10","C.11","C.12","C.12","C.13","D.7","D.8","D.9","D.9","F.9","F.10","F.10","F.11",0]
[null,"Rec. Booster",{"$f":"INDEX(T_ConvertBooster[D_Show],MATCH(LEFT(INDEX(INDIRECT(\"Chart\"&INDEX(T_ConvertControlType[Output],MATCH(i_ControlType,T_ConvertControlType[Input],0))&INDEX(T_ConvertTube[Output],MATCH(i_Tube,T_ConvertTube[Input],0))),MATCH(C19,AN8:AN31,0),MATCH(C18,AO7:BH7,0)),1),T_ConvertBooster[ID],0))","v":{"$error":"#N/A"}},{"$f":"INDEX(T_ConvertBooster[D_Booster],MATCH(o_BoosterRec,T_ConvertBooster[D_Show],0))","v":{"$error":"#N/A"}},{"$f":"IFERROR(IF(FIND(\"with Link\",o_BoosterRec)>1,\"LINK\",\"NO LINK\"),\"NO LINK\")","v":"NO LINK"},null,null,null,null,null,null,null,null,null,null,null,null,1.4,0,1,1,1,1,1,1,1,1,1,1,2,3,4,4,0,0,0,0,0,null,1.4,0,"G.10","G.10","A.11","B.15","B.16","B.18","B.19","B.20","B.21","C.11","E.13","E.13","E.14","E.15","E.15","E.16","E.17",0,0,null,null,1.4,0,"G.10","G.10","A.12","B.16","B.17","B.18","B.19","C.11","C.12","C.13","C.13","E.14","E.15","F.8","F.8","F.9","F.10","F.10","F.11",null,null,1.4,0,"G.10","G.10","A.12","B.16","B.17","B.18","C.10","C.11","C.12","C.13","C.13","C.14","E.15","F.8","F.9","F.9","F.10","F.10","F.11",null,null,1.4,0,"G.10","G.10","A.12","B.16","B.17","C.10","C.11","C.12","C.12","C.13","D.7","D.8","D.9","D.9","F.9","F.10","F.10",0,0]
[null,"Rec. preturns",{"$f":"MID(INDEX(INDIRECT(\"Chart\"&INDEX(T_ConvertControlType[Output],MATCH(i_ControlType,T_ConvertControlType[Input],0))&INDEX(T_ConvertTube[Output],MATCH(i_Tube,T_ConvertTube[Input],0))),MATCH(C19,AN8:AN31,0),MATCH(C18,AO7:BH7,0)),3,2)","v":{"$error":"#N/A"}},null,null,null,null,null,"BOOSTER MIN WIDTH (recommended booster)",null,null,null,null,null,null,null,null,1.5,0,1,1,1,1,1,1,1,1,1,1,2,3,4,4,0,0,0,0,0,null,1.5,0,"G.10","G.10","A.11","B.15","B.17","B.18","B.19","B.20","B.21","C.13","E.13","E.14","E.14","E.15","E.16","E.16",0,0,0,null,null,1.5,0,"G.10","G.10","A.12","B.16","B.17","B.18","B.19","C.12","C.12","C.13","C.14","E.14","E.15","F.8","F.8","F.10","F.10","F.10","F.11",null,null,1.5,0,"G.10","G.10","A.12","B.16","B.17","B.18","C.10","C.12","C.12","C.13","C.14","C.14","E.15","F.8","F.9","F.10","F.10","F.10","F.11",null,null,1.5,0,"G.10","G.10","A.12","B.16","B.17","C.11","C.11","C.12","C.13","C.13","D.7","D.8","D.9","D.9","F.10","F.10","F.10",0,0]
[null,null,null,null,null,null,null,null,{"$f":"INDEX(INDIRECT(\"T\"&F11&\"MinWidth[\"&o_Linked&\"]\"),MATCH(o_BoosterSize,INDIRECT(\"T\"&F11&\"MinWidth[Description]\",0),0))","v":{"$error":"#N/A"}},"mm",null,null,null,null,null,null,null,1.6,0,1,1,1,1,1,1,1,1,1,1,2,3,4,4,0,0,0,0,0,null,1.6,0,"G.10","G.10","A.11","B.15","B.17","B.18","B.19","B.20","B.22","C.13","E.13","E.14","E.15","E.15","E.16","E.17",0,0,0,null,null,1.6,0,"G.10","G.10","A.12","B.16","B.17","B.18","B.20","C.12","C.12","C.13","C.14","E.14","E.15","F.8","F.9","F.10","F.10","F.11","F.11",null,null,1.6,0,"G.10","G.10","A.12","B.16","B.17","B.19","C.10","C.12","C.12","C.13","C.14","C.14","F.8","F.8","F.9","F.10","F.10","F.11","F.11",null,null,1.6,0,"G.10","G.10","A.12","B.16","B.18","C.11","C.11","C.12","C.13","C.14","D.8","D.9","D.9","D.9","F.10","F.10",0,0,0]
[null,"Link Required?",{"$f":"IFERROR(IF(FIND(\"Link\",o_BoosterRec)>0,\"Yes\",\"\"),\"No\")","v":"No"},"=IFERROR(IF(FIND(\"Link\",o_BoosterRec)>0,\"Yes\",\"\"),\"No\")",null,null,null,null,null,null,null,null,null,null,null,null,null,1.7,0,1,1,1,1,1,1,1,1,1,2,3,3,4,4,0,0,0,0,0,null,1.7,0,"G.10",{"$f":"IF(AND(i_ControlType=\"Easy Spring Ultra (ESU)\",i_Tube=TEXT(1.5&CHAR(34),0)),\"A.12\",\"G.10\")","v":"G.10"},"A.12","B.16","B.17","B.18","B.19","B.21","B.22","E.13","E.14","E.14","E.15","E.16","E.16","E.17",0,0,0,null,null,1.7,0,"G.10","G.10","A.12","B.16","B.17","B.19","B.20","C.12","C.13","C.13","E.14","E.15","E.15","F.8","F.10","F.10","F.10","F.11","F.11",null,null,1.7,0,"G.10","G.10","A.12","B.16","B.17","B.19","C.10","C.12","C.13","C.13","C.14","C.15","F.8","F.8","F.10","F.10","F.10","F.11","F.11",null,null,1.7,0,"G.10","G.10","A.12","B.17","B.18","C.11","C.11","C.12","C.13","C.14","D.8","D.9","D.9","D.10","F.10","F.10",0,0,0]
[null,"BlindOutOfSpec",{"$f":"IF(IFERROR(o_BoosterRec,\"Yes\")<>\"Yes\",\"No\",\"Yes\")","v":"Yes"},"=IF(IFERROR(o_BoosterRec,\"Yes\")<>\"Yes\",\"No\",\"Yes\")",null,null,null,null,null,null,null,null,null,null,null,null,null,1.8,0,1,1,1,1,1,1,1,1,1,2,3,4,4,0,0,0,0,0,0,null,1.8,0,"G.10",{"$f":"IF(AND(i_ControlType=\"Easy Spring Ultra (ESU)\",i_Tube=TEXT(1.5&CHAR(34),0)),\"A.12\",\"G.10\")","v":"G.10"},"A.12","B.16","B.17","B.19","B.20","B.21","B.22","E.13","E.14","E.15","E.15","E.16","E.17","E.17",0,0,0,null,null,1.8,0,"G.10","G.10","A.12","B.16","B.18","B.19","B.20","C.12","C.13","C.13","E.14","E.15","E.16","F.8","F.10","F.10","F.11","F.11","F.11",null,null,1.8,0,"G.10","G.10","A.12","B.16","B.18","B.19","C.11","C.12","C.13","C.14","C.14","E.15","F.8","F.9","F.10","F.10","F.11","F.11","F.11",null,null,1.8,0,"G.10","G.10","A.12","B.17","B.18","C.11","C.12","C.12","C.13","C.14","D.8","D.9","D.9","D.10","F.10",0,0,0,0]
[null,"Linked?",{"$f":"IF(i_LinkedScreens=\"No\",\"No\",IF(i_nScreens=0,\"No\",i_nScreens))","v":"No"},"=IF(i_LinkedScreens=\"No\",\"No\",IF(i_nScreens=0,\"No\",i_nScreens))",null,null,null,null,"10-May-22; Easy Spring Ultra (ESU) + 1.5\" CANNOT recommend COMPACT. ESU RTEA4 table custom formulas to push into SHORT instead of compact. ",null,null,null,null,null,null,null,null,1.9,0,1,1,1,1,1,1,1,1,1,2,3,4,4,0,0,0,0,0,0,null,1.9,0,"G.10",{"$f":"IF(AND(i_ControlType=\"Easy Spring Ultra (ESU)\",i_Tube=TEXT(1.5&CHAR(34),0)),\"A.12\",\"G.10\")","v":"G.10"},"A.12","B.16","B.18","B.19","B.20","B.21","B.23","E.13","E.14","E.15","E.16","E.16","E.17","E.18",0,0,0,null,null,1.9,0,"G.10","G.10","A.12","B.17","B.18","B.19","C.12","C.12","C.13","C.14","E.14","E.15","E.16","F.10","F.10","F.10","F.11","F.11","F.12",null,null,1.9,0,"G.10","G.10","A.12","B.17","B.18","B.19","C.12","C.12","C.13","C.14","C.15","E.15","F.8","F.10","F.10","F.10","F.11","F.11","F.12",null,null,1.9,0,"G.10","G.10","A.13","B.17","B.18","C.11","C.12","C.13","C.13","C.14","D.8","D.9","D.9","F.10","F.10",0,0,0,0]
[null,null,null,null,null,null,null,null,null,"ESU-SL + 1.5\" is OK.",null,null,null,null,null,null,null,2,0,1,1,1,1,1,1,1,1,1,2,3,4,4,0,0,0,0,0,0,null,2,0,"G.10",{"$f":"IF(AND(i_ControlType=\"Easy Spring Ultra (ESU)\",i_Tube=TEXT(1.5&CHAR(34),0)),\"A.12\",\"G.10\")","v":"G.10"},"A.12","B.17","B.18","B.19","B.20","B.22","C.13","E.14","E.14","E.15","E.16","E.17","E.17","E.18",0,0,0,null,null,2,0,"G.10","G.10","A.12","B.17","B.18","B.19","C.12","C.12","C.13","C.14","E.15","E.15","E.16","F.10","F.10","F.11","F.11","F.11","F.12",null,null,2,0,"G.10","G.10","A.12","B.17","B.18","B.19","C.12","C.12","C.13","C.14","C.15","E.16","F.8","F.10","F.10","F.11","F.11","F.11","F.12",null,null,2,0,"G.10","G.10","A.13","B.17","B.18","C.11","C.12","C.13","C.14","C.14","D.9","D.9","D.10","F.10",0,0,0,0,0]
[null,"T_ESW_MinWidth",null,null,"Linked",null,null,null,"18-May-22;","ESU (S45), ESU-SL (1.5\")  - ONLY, some of the other formula's no longer required but had not removed.",null,null,null,null,null,null,null,2.1,0,1,1,1,1,1,1,1,1,1,2,3,4,0,0,0,0,0,0,0,null,2.1,0,"G.10",{"$f":"IF(AND(i_ControlType=\"Easy Spring Ultra (ESU)\",i_Tube=TEXT(1.5&CHAR(34),0)),\"A.12\",\"G.10\")","v":"G.10"},"A.12","B.17","B.18","B.19","B.21","B.22","C.13","E.14","E.15","E.15","E.16","E.17","E.18",0,0,0,0,null,null,2.1,0,"G.10","G.10","A.12","B.17","B.18","B.20","C.12","C.13","C.13","C.14","E.15","E.16","E.17","F.10","F.10","F.11","F.11","F.12","F.12",null,null,2.1,0,"G.10","G.10","A.12","B.17","B.18","B.20","C.12","C.13","C.13","C.14","C.15","E.16","F.9","F.10","F.10","F.11","F.11","F.12","F.12",null,null,2.1,0,"G.10","G.10","A.13","B.17","B.19","C.11","C.12","C.13","C.14","C.15","D.9","D.9","D.10","F.10",0,0,0,0,0]
[null,"Description","Booster_In","BoosterID","No","2","3",null,null,null,null,null,null,null,null,null,null,2.2000000000000002,0,1,1,1,1,1,1,1,1,1,2,3,4,0,0,0,0,0,0,0,null,2.2000000000000002,0,"G.10",0,0,"B.17","B.18","B.20","B.21","B.23","C.13","E.14","E.15","E.16","E.17","E.17","E.18",0,0,0,0,null,null,2.2000000000000002,0,"G.10","G.10","A.12","B.17","B.19","B.20","C.12","C.13","C.14","C.14","E.15","E.16","F.8","F.10","F.11","F.11","F.11","F.12","F.12",null,null,2.2000000000000002,0,"G.10","G.10","A.12","B.17","B.19","B.20","C.12","C.13","C.14","C.14","C.15","E.16","F.10","F.10","F.11","F.11","F.11","F.12",0,null,null,2.2000000000000002,0,"G.10","G.10","A.13","B.17","B.19","C.11","C.12","C.13","C.14","D.7","D.9","D.9","D.10",0,0,0,0,0,0]
[null,"SHORT",{"$f":"IFERROR(IF(FIND(T_ESW_MinWidth[[#This Row],[Description]],i_Booster)>0,1,\"\"),\"\")","v":""},{"$f":"IF(ISNUMBER(FIND(B30,i_Booster)),\"A\",0)","v":0},{"$f":"IF(i_Location=\"AU\",K104,K104)","v":692.66000000000008},{"$f":"E30*2","v":1385.3200000000002},{"$f":"E30*3","v":2077.9800000000005},null,"Compact Exists in L_Booster?",null,null,null,null,null,null,null,null,2.2999999999999998,0,1,1,1,1,1,1,1,1,1,2,3,4,0,0,0,0,0,0,0,null,2.2999999999999998,0,"G.10",0,0,"B.17","B.19","B.20","B.21","B.23","C.14","E.14","E.15","E.16","E.17","E.18","E.18",0,0,0,0,null,null,2.2999999999999998,0,"G.10","G.10","A.12","B.17","B.19","B.20","C.12","C.13","C.14","C.15","E.16","E.16","F.10","F.10","F.11","F.11","F.12","F.12","F.13",null,null,2.2999999999999998,0,"G.10","G.10","A.12","B.17","B.19","B.20","C.12","C.13","C.14","C.15","C.16","E.16","F.10","F.10","F.11","F.11","F.12",0,0,null,null,2.2999999999999998,0,"G.10",0,0,"B.18","B.19","C.12","C.12","C.13","C.14","D.7","D.9","D.10","D.10",0,0,0,0,0,0]
[null,"LIGHT",{"$f":"IFERROR(IF(FIND(T_ESW_MinWidth[[#This Row],[Description]],i_Booster)>0,1,\"\"),\"\")","v":""},{"$f":"IF(ISNUMBER(FIND(B31,i_Booster)),\"B\",0)","v":0},{"$f":"IF(i_Location=\"AU\",K105,K105)","v":874.67000000000007},{"$f":"E31*2","v":1749.3400000000001},{"$f":"E31*3","v":2624.01},null,{"$f":"IFERROR(IF(AND(F11=\"_ESU_\",COUNTIF(L_Booster,\"Booster | COMPACT\")>0),\"Yes\",\"No\"),\"No\")","v":"No"},null,null,null,null,null,null,null,null,2.4,0,1,1,1,1,1,1,1,1,1,2,3,4,0,0,0,0,0,0,0,null,2.4,0,"G.10",0,0,"B.17","B.19","B.20","B.22","B.23","C.14","E.15","E.16","E.16","E.17","E.18","E.19",0,0,0,0,null,null,2.4,0,"G.10",0,0,"B.18","B.19","B.21","C.12","C.13","C.14","C.15","E.16","E.17","F.10","F.10","F.11","F.11","F.12","F.12","F.13",null,null,2.4,0,"G.10",0,0,"B.18","B.19","B.21","C.12","C.13","C.14","C.15","C.16","E.17","F.10","F.11","F.11","F.11","F.12",0,0,null,null,2.4,0,"G.10",0,0,"B.18","B.19","C.12","C.13","C.13","C.14","D.7","D.9","D.10",0,0,0,0,0,0,0]
[null,"STD",{"$f":"IFERROR(IF(FIND(T_ESW_MinWidth[[#This Row],[Description]],i_Booster)>0,1,\"\"),\"\")","v":""},{"$f":"IF(ISNUMBER(FIND(B32,i_Booster)),\"C\",0)","v":0},{"$f":"IF(i_Location=\"AU\",K106,K106)","v":1027.5},2055,3082.5]
[null,"HD",{"$f":"IFERROR(IF(FIND(T_ESW_MinWidth[[#This Row],[Description]],i_Booster)>0,1,\"\"),\"\")","v":""},{"$f":"IF(ISNUMBER(FIND(B33,i_Booster)),\"D\",0)","v":0},{"$f":"IF(i_Location=\"AU\",K107,K107)","v":1154.48},2308.96,3463.44]
[]
[null,"T_ESU_MinWidth",null,null,"Linked"]
[null,"Description","Booster_In","BoosterID","No","2","3",null,null,null,null,null,null,null,null,null,null,null,null,null,null,null,null,null,null,null,null,null,null,null,null,null,null,null,null,null,null,null,null,"Easy Spring Wand"]
[null,"COMPACT",{"$f":"IFERROR(IF(FIND(T_ESU_MinWidth[[#This Row],[Description]],i_Booster)>0,1,\"\"),\"\")","v":""},{"$f":"IF(ISNUMBER(FIND(B37,i_Booster)),\"G\",0)","v":0},{"$f":"K63","v":459.28},{"$f":"E37*2","v":918.56},{"$f":"E37*3","v":1377.84},null,null,null,null,null,"v1.42","v1.39",null,null,null,null,null,null,null,null,null,null,null,null,null,null,null,null,null,null,null,null,null,null,null,null,null,"RTEA4",null,null,null,null,null,null,null,null,null,null,null,null,null,null,null,null,null,null,null,null,null,null,"S45 LT",null,null,null,null,null,null,null,null,null,null,null,null,null,null,null,null,null,null,null,null,null,null,"S45 STD",null,null,null,null,null,null,null,null,null,null,null,null,null,null,null,null,null,null,null,null,null,null,"S45 HD"]
[null,"SHORT",{"$f":"IFERROR(IF(FIND(T_ESU_MinWidth[[#This Row],[Description]],i_Booster)>0,1,\"\"),\"\")","v":""},{"$f":"IF(ISNUMBER(FIND(B38,i_Booster)),\"A\",0)","v":0},{"$f":"IF(i_Location=\"AU\",K72,K72)","v":598.04999999999995},{"$f":"E38*2","v":1196.0999999999999},{"$f":"E38*3","v":1794.1499999999999},null,null,null,null,"old decelerator min width",656,659]
[null,"LIGHT",{"$f":"IFERROR(IF(FIND(T_ESU_MinWidth[[#This Row],[Description]],i_Booster)>0,1,\"\"),\"\")","v":""},{"$f":"IF(ISNUMBER(FIND(B39,i_Booster)),\"B\",0)","v":0},{"$f":"IF(i_Location=\"AU\",K73,K73)","v":780.05},{"$f":"E39*2","v":1560.1},{"$f":"E39*3","v":2340.1499999999996},null,null,null,null,"old decelerator min width",839,839]
[null,"STD",{"$f":"IFERROR(IF(FIND(T_ESU_MinWidth[[#This Row],[Description]],i_Booster)>0,1,\"\"),\"\")","v":""},{"$f":"IF(ISNUMBER(FIND(B40,i_Booster)),\"C\",0)","v":0},{"$f":"IF(i_Location=\"AU\",K74,K74)","v":932.8900000000001},{"$f":"E40*2","v":1865.7800000000002},2798.67,null,null,null,null,"old decelerator min width",992,992]
[null,"HD",{"$f":"IFERROR(IF(FIND(T_ESU_MinWidth[[#This Row],[Description]],i_Booster)>0,1,\"\"),\"\")","v":""},{"$f":"IF(ISNUMBER(FIND(B41,i_Booster)),\"D\",0)","v":0},{"$f":"IF(i_Location=\"AU\",K75,K75)","v":1059.8799999999999},2119.7599999999998,3179.6399999999994,null,null,null,null,"old decelerator min width",1119,1119,null,null,null,null,null,null,null,null,null,null,null,null,null,null,null,null,null,null,null,null,null,null,null,null,null,null,"Width (m)",null,null,null,null,null,null,null,null,null,null,null,null,null,null,null,null,null,null,null,null,null,null,"Width (m)",null,null,null,null,null,null,null,null,null,null,null,null,null,null,null,null,null,null,null,null,null,null,"Width (m)",null,null,null,null,null,null,null,null,null,null,null,null,null,null,null,null,null,null,null,null,null,null,"Width (m)"]
[null,null,null,null,null,null,null,null,null,null,null,null,null,null,null,null,null,null,null,null,null,null,null,null,null,null,null,null,null,null,null,null,null,null,null,null,null,null,null,"Drop (m)",0.2,0.4,0.6,0.8,1,1.2,1.4,1.6,1.8,2,2.2000000000000002,2.4,2.6,2.8,3,3.2,3.4,3.6,3.8,4,null,null,"Drop (m)",0.2,0.4,0.6,0.8,1,1.2,1.4,1.6,1.8,2,2.2000000000000002,2.4,2.6,2.8,3,3.2,3.4,3.6,3.8,4,null,null,"Drop (m)",0.2,0.4,0.6,0.8,1,1.2,1.4,1.6,1.8,2,2.2000000000000002,2.4,2.6,2.8,3,3.2,3.4,3.6,3.8,4,null,null,"Drop (m)",0.2,0.4,0.6,0.8,1,1.2,1.4,1.6,1.8,2,2.2000000000000002,2.4,2.6,2.8,3,3.2,3.4,3.6,3.8,4]
[null,"T_ConvertTube",null,null,"ESU","OLD DEC.",null,"UNIVERSAL LIMITER","GAP","TOTAL",null,null,null,null,null,null,null,null,null,null,null,null,null,null,null,null,null,null,null,null,null,null,null,null,null,null,null,null,null,0.1,0,"G.9","A.11","A.11","B.14","B.15","B.16","B.17","B.18","B.18","B.19","C.7","E.12","E.12","E.13","E.13","E.14","E.14","E.15",0,null,null,0.1,0,"G.9","A.11","A.11","B.15","B.15","B.16","B.17","C.10","C.11","C.11","C.12","C.12","E.13","E.13","F.8","F.8","F.8","F.9","F.9",null,null,0.1,0,"G.9","A.11","A.11","B.15","B.16","B.17","B.17","C.10","C.11","C.11","C.12","C.12","C.13","E.14","F.8","F.8","F.9","F.9","F.9",null,null,0.1,0,"G.9","A.12","A.12","B.15","B.16","C.10","C.10","C.11","C.11","C.12","C.12","D.7","D.8","D.8","D.8","F.9","F.9","F.9","F.10"]
[null,"Input","Output",null,null,"COMPACT",324.32,147.69999999999999,5,{"$f":"G44+H44+I44","v":477.02},{"$f":"J44","v":477.02},"AU",null,null,null,null,null,null,null,null,null,null,null,null,null,null,null,null,null,null,null,null,null,null,null,null,null,null,null,0.2,0,"G.9","A.11","A.11","B.14","B.15","B.16","B.17","B.18","B.18","B.19","C.8","E.12","E.12","E.13","E.13","E.14","E.14","E.15",0,null,null,0.2,0,"G.9","A.11","A.11","B.15","B.15","B.16","B.17","C.10","C.11","C.11","C.12","C.12","E.13","E.13","F.8","F.8","F.8","F.9","F.9",null,null,0.2,0,"G.9","A.11","A.11","B.15","B.16","B.17","B.17","C.10","C.11","C.11","C.12","C.12","C.13","E.14","F.8","F.8","F.9","F.9","F.9",null,null,0.2,0,"G.9","A.12","A.12","B.15","B.16","C.10","C.10","C.11","C.11","C.12","C.12","D.7","D.8","D.8","D.8","F.9","F.9","F.9","F.10"]
[null,"1.5\"","RTEA4",null,null,"SHORT",481.46,147.69999999999999,5,{"$f":"G45+H45+I45","v":634.16},{"$f":"J45","v":634.16},"AU",null,null,null,null,null,null,null,null,null,null,null,null,null,null,null,null,null,null,null,null,null,null,null,null,null,null,null,0.3,0,"G.9","A.11","A.11","B.14","B.15","B.16","B.17","B.18","B.18","B.19","C.9","E.12","E.12","E.13","E.13","E.14","E.14","E.15",0,null,null,0.3,0,"G.9","A.11","A.11","B.15","B.15","B.16","B.17","C.10","C.11","C.11","C.12","C.12","E.13","E.13","F.8","F.8","F.8","F.9","F.9",null,null,0.3,0,"G.9","A.11","A.11","B.15","B.16","B.17","B.17","C.10","C.11","C.11","C.12","C.12","C.13","E.14","F.8","F.8","F.9","F.9","F.9",null,null,0.3,0,"G.9","A.12","A.12","B.15","B.16","C.10","C.10","C.11","C.11","C.12","C.12","D.7","D.8","D.8","D.8","F.9","F.9","F.9","F.10"]
[null,"S45 LT","S45_LT",null,null,"LIGHT",663.45,147.69999999999999,5,{"$f":"G46+H46+I46","v":816.15000000000009},816.15000000000009,"AU",null,null,null,null,null,null,null,null,null,null,null,null,null,null,null,null,null,null,null,null,null,null,null,null,null,null,null,0.4,0,"G.9","A.11","A.11","B.14","B.15","B.16","B.17","B.18","B.18","B.19","C.10","E.12","E.12","E.13","E.13","E.14","E.14","E.15",0,null,null,0.4,0,"G.9","A.11","A.11","B.15","B.15","B.16","B.17","C.10","C.11","C.11","C.12","C.12","E.13","E.13","F.8","F.8","F.8","F.9","F.9",null,null,0.4,0,"G.9","A.11","A.11","B.15","B.16","B.17","B.17","C.10","C.11","C.11","C.12","C.12","C.13","E.14","F.8","F.8","F.9","F.9","F.9",null,null,0.4,0,"G.9","A.12","A.12","B.15","B.16","C.10","C.10","C.11","C.11","C.12","C.12","D.7","D.8","D.8","D.8","F.9","F.9","F.9","F.10"]
[null,"S45 STD","S45_STD",null,null,"STD",818.79,147.69999999999999,5,{"$f":"G47+H47+I47","v":971.49},971.49,"AU",null,null,null,null,null,null,null,null,null,null,null,null,null,null,null,null,null,null,null,null,null,null,null,null,null,null,null,0.5,0,"G.9","A.11","A.11","B.14","B.15","B.16","B.17","B.18","B.18","B.19","C.11","E.12","E.12","E.13","E.13","E.14","E.14","E.15",0,null,null,0.5,0,"G.9","A.11","A.11","B.15","B.15","B.16","B.17","C.10","C.11","C.11","C.12","C.12","E.13","E.13","F.8","F.8","F.8","F.9","F.9",null,null,0.5,0,"G.9","A.11","A.11","B.15","B.16","B.17","B.17","C.10","C.11","C.11","C.12","C.12","C.13","E.14","F.8","F.8","F.9","F.9","F.9",null,null,0.5,0,"G.9","A.12","A.12","B.15","B.16","C.10","C.10","C.11","C.11","C.12","C.12","D.7","D.8","D.8","D.8","F.9","F.9","F.9","F.10"]
[null,"S45 HD","S45_HD",null,null,"HD",943.28,147.69999999999999,5,{"$f":"G48+H48+I48","v":1095.98},1095.98,"AU",null,null,null,null,null,null,null,null,null,null,null,null,null,null,null,null,null,null,null,null,null,null,null,null,null,null,null,0.6,0,"G.9","A.11","A.11","B.14","B.15","B.16","B.17","B.18","B.19","B.20","C.11","E.12","E.12","E.13","E.13","E.14","E.14","E.15",0,null,null,0.6,0,"G.9","A.11","A.11","B.15","B.16","B.17","B.18","C.10","C.11","C.11","C.12","C.13","E.13","E.14","F.8","F.8","F.9","F.9","F.9",null,null,0.6,0,"G.9","A.11","A.11","B.15","B.16","B.17","B.18","C.10","C.11","C.12","C.12","C.13","C.13","E.14","F.8","F.8","F.9","F.9","F.9",null,null,0.6,0,"G.9","A.12","A.12","B.15","B.16","C.10","C.10","C.11","C.11","C.12","C.13","D.7","D.8","D.8","D.9","F.9","F.9","F.10","F.11"]
[null,null,null,null,null,null,null,"SHORT LIMITER",null,null,null,null,null,null,null,null,null,null,null,null,null,null,null,null,null,null,null,null,null,null,null,null,null,null,null,null,null,null,null,0.7,0,"G.9","A.11","A.11","B.14","B.15","B.16","B.17","B.18","B.19","B.20","C.11","E.12","E.13","E.13","E.14","E.14","E.15","E.15",0,null,null,0.7,0,"G.9","A.11","A.11","B.15","B.16","B.17","B.18","C.10","C.11","C.12","C.12","C.13","E.13","E.14","F.8","F.8","F.9","F.9","F.9",null,null,0.7,0,"G.9","A.11","A.11","B.15","B.16","B.17","B.18","C.10","C.11","C.12","C.12","C.13","C.13","F.8","F.8","F.8","F.9","F.9","F.10",null,null,0.7,0,"G.9","A.12","A.12","B.15","B.16","C.10","C.10","C.11","C.12","C.12","D.7","D.8","D.8","D.8","D.9","F.9","F.9","F.10","F.11"]
[null,null,null,null,null,"COMPACT",{"$f":"G44","v":324.32},129.96,5,459.28,458,"Marketing override GL",null,null,null,null,null,null,null,null,null,null,null,null,null,null,null,null,null,null,null,null,null,null,null,null,null,null,null,0.8,0,"G.9","A.11","A.11","B.14","B.15","B.16","B.17","B.18","B.19","B.20","C.11","E.12","E.13","E.13","E.14","E.14","E.15","E.15",0,null,null,0.8,0,"G.9","A.12","A.12","B.15","B.16","B.17","B.18","C.10","C.11","C.12","C.12","C.13","E.13","E.14","F.8","F.8","F.9","F.9","F.10",null,null,0.8,0,"G.9","A.12","A.12","B.15","B.16","B.17","B.18","C.10","C.11","C.12","C.12","C.13","C.14","F.8","F.8","F.8","F.9","F.9","F.10",null,null,0.8,0,"G.9","A.12","A.12","B.15","B.17","C.10","C.10","C.11","C.12","C.12","D.7","D.8","D.8","D.8","D.9","F.9","F.9","F.11","F.11"]
[null,"T_ConvertBooster",null,null,null,"SHORT",{"$f":"G45","v":481.46},129.96,5,616.41999999999996,{"$f":"J51","v":616.41999999999996},"AU",null,null,null,null,null,null,null,null,null,null,null,null,null,null,null,null,null,null,null,null,null,null,null,null,null,null,null,0.9,0,"G.10","A.11","A.11","B.14","B.15","B.17","B.18","B.19","B.20","C.11","E.12","E.13","E.13","E.14","E.14","E.15","E.15",0,0,null,null,0.9,0,"G.10","A.12","A.12","B.15","B.16","B.17","B.18","C.10","C.11","C.12","C.12","E.13","E.14","E.14","F.8","F.8","F.9","F.9","F.10",null,null,0.9,0,"G.10","A.12","A.12","B.15","B.16","B.17","B.18","C.11","C.11","C.12","C.13","C.13","E.14","F.8","F.8","F.9","F.9","F.10","F.10",null,null,0.9,0,"G.10","A.12","A.12","B.16","B.17","C.10","C.11","C.11","C.12","C.12","D.7","D.8","D.8","D.9","D.9","F.9","F.10","F.11","F.11"]
[null,"ID","D_Show","D_Booster",null,"LIGHT",663.45,129.96,5,798.41000000000008,{"$f":"J52","v":798.41000000000008},"AU",null,null,null,null,null,null,null,null,null,null,null,null,null,null,null,null,null,null,null,null,null,null,null,null,null,null,null,1,0,"G.10","A.11","A.11","B.14","B.15","B.17","B.18","B.19","B.20","C.11","E.12","E.13","E.13","E.14","E.14","E.15","E.16",0,0,null,null,1,0,"G.10","A.12","A.12","B.15","B.16","B.17","B.18","C.11","C.12","C.12","C.13","E.13","E.14","E.14","F.8","F.9","F.9","F.10","F.10",null,null,1,0,"G.10","A.12","A.12","B.15","B.16","B.17","B.18","C.11","C.12","C.12","C.13","C.13","E.14","F.8","F.8","F.9","F.9","F.10","F.10",null,null,1,0,"G.10","A.12","A.12","B.16","B.17","C.10","C.11","C.11","C.12","C.13","D.7","D.8","D.8","D.9","F.9","F.9","F.10","F.11","F.12"]
[null,"A","SHORT","SHORT",null,"STD",818.79,129.96,5,953.75,953.75,"AU",null,null,null,null,null,null,null,null,null,null,null,null,null,null,null,null,null,null,null,null,null,null,null,null,null,null,null,1.1000000000000001,0,"G.10","A.11","A.11","B.15","B.15","B.17","B.18","B.19","B.20","C.11","E.12","E.13","E.14","E.14","E.15","E.15","E.16",0,0,null,null,1.1000000000000001,0,"G.10","A.12","A.12","B.15","B.16","B.18","B.19","C.11","C.12","C.12","C.13","E.13","E.14","E.15","F.8","F.9","F.9","F.10","F.10",null,null,1.1000000000000001,0,"G.10","A.12","A.12","B.15","B.17","B.18","B.19","C.11","C.12","C.12","C.13","C.14","E.14","F.8","F.8","F.9","F.10","F.10","F.10",null,null,1.1000000000000001,0,"G.10","A.12","A.12","B.16","B.17","C.10","C.11","C.11","C.12","C.13","D.7","D.8","D.8","D.9","F.9","F.10","F.10","F.11",0]
[null,"B","LIGHT","LIGHT",null,"HD",943.28,129.96,5,1078.24,1078.24,"AU",null,null,null,null,null,null,null,null,null,null,null,null,null,null,null,null,null,null,null,null,null,null,null,null,null,null,null,1.2,0,"G.10","A.11","A.11","B.15","B.16","B.17","B.18","B.19","B.20","C.11","E.13","E.13","E.14","E.14","E.15","E.16","E.16",0,0,null,null,1.2,0,"G.10","A.12","A.12","B.16","B.17","B.18","B.19","C.11","C.12","C.12","C.13","E.14","E.14","F.8","F.8","F.9","F.10","F.10","F.10",null,null,1.2,0,"G.10","A.12","A.12","B.16","B.17","B.18","C.10","C.12","C.12","C.13","C.13","C.14","E.14","F.8","F.8","F.9","F.10","F.10","F.10",null,null,1.2,0,"G.10","A.12","A.12","B.16","B.17","C.10","C.11","C.12","C.12","C.13","D.7","D.8","D.9","D.9","F.9","F.10","F.10",0,0]
[null,"C","STD","STD",null,null,null,null,null,null,null,null,null,null,null,null,null,null,null,null,null,null,null,null,null,null,null,null,null,null,null,null,null,null,null,null,null,null,null,1.3,0,"G.10","A.11","A.11","B.15","B.16","B.18","B.19","B.20","B.21","C.11","E.13","E.13","E.14","E.15","E.15","E.16","E.17",0,0,null,null,1.3,0,"G.10","A.12","A.12","B.16","B.17","B.18","B.19","C.11","C.12","C.13","C.13","E.14","E.15","F.8","F.8","F.9","F.10","F.10",0,null,null,1.3,0,"G.10","A.12","A.12","B.16","B.17","B.18","C.10","C.11","C.12","C.13","C.13","C.14","E.15","F.8","F.9","F.9","F.10","F.10",0,null,null,1.3,0,"G.10","A.12","A.12","B.16","B.17","C.10","C.11","C.12","C.12","C.13","D.7","D.8","D.9","D.9","F.9","F.10",0,0,0]
[null,"D","HD","HD",null,"NEW DEC.",null,"UNIVERSAL LIMITER",null,null,null,null,null,null,null,null,null,null,null,null,null,null,null,null,null,null,null,null,null,null,null,null,null,null,null,null,null,null,null,1.4,0,"G.10","A.11","A.11","B.15","B.17","B.18","B.19","B.20","B.21","C.13","E.13","E.14","E.14","E.15","E.16","E.16",0,0,0,null,null,1.4,0,"G.10","A.12","A.12","B.16","B.17","B.18","B.19","C.12","C.12","C.13","C.14","E.14","E.15","F.8","F.8","F.10","F.10",0,0,null,null,1.4,0,"G.10","A.12","A.12","B.16","B.17","B.18","C.10","C.12","C.12","C.13","C.14","C.14","E.15","F.8","F.9","F.10","F.10",0,0,null,null,1.4,0,"G.10","A.12","A.12","B.16","B.17","C.11","C.11","C.12","C.13","C.13","D.7","D.8","D.9","D.9","F.10",0,0,0,0]
[null,"G","COMPACT","COMPACT",null,"COMPACT",{"$f":"G44","v":324.32},{"$f":"H44","v":147.69999999999999},5,{"$f":"G57+H57+I57","v":477.02},{"$f":"J57","v":477.02},"US",null,null,null,null,null,null,null,null,null,null,null,null,null,null,null,null,null,null,null,null,null,null,null,null,null,null,null,1.5,0,"G.10","A.11","A.11","B.15","B.17","B.18","B.19","B.20","B.22","C.13","E.13","E.14","E.15","E.15","E.16","E.17",0,0,0,null,null,1.5,0,"G.10","A.12","A.12","B.16","B.17","B.18","B.20","C.12","C.12","C.13","C.14","E.14","E.15","F.8","F.9","F.10","F.10",0,0,null,null,1.5,0,"G.10","A.12","A.12","B.16","B.17","B.19","C.10","C.12","C.12","C.13","C.14","C.14","F.8","F.8","F.9","F.10","F.10",0,0,null,null,1.5,0,"G.10","A.12","A.12","B.16","B.18","C.11","C.11","C.12","C.13","C.14","D.8","D.9","D.9","D.9",0,0,0,0,0]
[null,"E","STD with Link","STD",null,"SHORT",442.85,{"$f":"H44","v":147.69999999999999},5,{"$f":"G58+H58+I58","v":595.54999999999995},{"$f":"J58","v":595.54999999999995},"US",null,null,null,null,null,null,null,null,null,null,null,null,null,null,null,null,null,null,null,null,null,null,null,null,null,null,null,1.6,0,"G.10","A.12","A.12","B.16","B.17","B.18","B.19","B.21","B.22","E.13","E.14","E.14","E.15","E.16","E.16","E.17",0,0,0,null,null,1.6,0,"G.10","A.12","A.12","B.16","B.17","B.19","B.20","C.12","C.13","C.13","E.14","E.15","E.15","F.8","F.10","F.10",0,0,0,null,null,1.6,0,"G.10","A.12","A.12","B.16","B.17","B.19","C.10","C.12","C.13","C.13","C.14","C.15","F.8","F.8","F.10","F.10",0,0,0,null,null,1.6,0,"G.10","A.12","A.12","B.17","B.18","C.11","C.11","C.12","C.13","C.14","D.8","D.9","D.9","D.10",0,0,0,0,0]
[null,"F","HD with Link","HD",null,"LIGHT",624.85,{"$f":"H44","v":147.69999999999999},5,{"$f":"G59+H59+I59","v":777.55},777.55,"US",null,null,null,null,null,null,null,null,null,null,null,null,null,null,null,null,null,null,null,null,null,null,null,null,null,null,null,1.7,0,"G.10","A.12","A.12","B.16","B.17","B.19","B.20","B.21","B.22","E.13","E.14","E.15","E.15","E.16","E.17","E.17",0,0,0,null,null,1.7,0,"G.10","A.12","A.12","B.16","B.18","B.19","B.20","C.12","C.13","C.13","E.14","E.15","E.16","F.8","F.10",0,0,0,0,null,null,1.7,0,"G.10","A.12","A.12","B.16","B.18","B.19","C.11","C.12","C.13","C.14","C.14","E.15","F.8","F.9","F.10",0,0,0,0,null,null,1.7,0,"G.10","A.12","A.12","B.17","B.18","C.11","C.12","C.12","C.13","C.14","D.8","D.9","D.9",0,0,0,0,0,0]
[null,null,null,null,null,"STD",777.69,{"$f":"H44","v":147.69999999999999},5,{"$f":"G60+H60+I60","v":930.3900000000001},930.3900000000001,"US",null,null,null,null,null,null,null,null,null,null,null,null,null,null,null,null,null,null,null,null,null,null,null,null,null,null,null,1.8,0,"G.10","A.12","A.12","B.16","B.18","B.19","B.20","B.21","B.23","E.13","E.14","E.15","E.16","E.16","E.17","E.18",0,0,0,null,null,1.8,0,"G.10","A.12","A.12","B.17","B.18","B.19","C.12","C.12","C.13","C.14","E.14","E.15","E.16","F.10",0,0,0,0,0,null,null,1.8,0,"G.10","A.12","A.12","B.17","B.18","B.19","C.12","C.12","C.13","C.14","C.15","E.15","F.8","F.10",0,0,0,0,0,null,null,1.8,0,"G.10","A.13","A.13","B.17","B.18","C.11","C.12","C.13","C.13","C.14","D.8","D.9","D.9",0,0,0,0,0,0]
[null,"T_ConvertControlType",null,null,null,"HD",904.68,{"$f":"H44","v":147.69999999999999},5,{"$f":"G61+H61+I61","v":1057.3799999999999},1057.3799999999999,"US",null,null,null,null,null,null,null,null,null,null,null,null,null,null,null,null,null,null,null,null,null,null,null,null,null,null,null,1.9,0,"G.10","A.12","A.12","B.17","B.18","B.19","B.20","B.22","C.13","E.14","E.14","E.15","E.16","E.17","E.17","E.18",0,0,0,null,null,1.9,0,"G.10","A.12","A.12","B.17","B.18","B.19","C.12","C.12","C.13","C.14","E.15","E.15","E.16",0,0,0,0,0,0,null,null,1.9,0,"G.10","A.12","A.12","B.17","B.18","B.19","C.12","C.12","C.13","C.14","C.15","E.16","F.8","F.10",0,0,0,0,0,null,null,1.9,0,"G.10","A.13","A.13","B.17","B.18","C.11","C.12","C.13","C.14","C.14","D.9","D.9",0,0,0,0,0,0,0]
[null,"Input","Output",null,null,null,null,"SHORT LIMITER",null,null,null,null,null,null,null,null,null,null,null,null,null,null,null,null,null,null,null,null,null,null,null,null,null,null,null,null,null,null,null,2,0,"G.10","A.12","A.12","B.17","B.18","B.19","B.21","B.22","C.13","E.14","E.15","E.15","E.16","E.17","E.18",0,0,0,0,null,null,2,0,"G.10","A.12","A.12","B.17","B.18","B.20","C.12","C.13","C.13","C.14","E.15","E.16","E.17",0,0,0,0,0,0,null,null,2,0,"G.10","A.12","A.12","B.17","B.18","B.20","C.12","C.13","C.13","C.14","C.15","E.16","F.9",0,0,0,0,0,0,null,null,2,0,"G.10","A.13","A.13","B.17","B.19","C.11","C.12","C.13","C.14","C.15","D.9","D.9",0,0,0,0,0,0,0]
[null,"Easy Spring Ultra (ESU)","_ESU_",null,null,"COMPACT",{"$f":"G57","v":324.32},{"$f":"H50","v":129.96},5,{"$f":"G63+H63+I63","v":459.28},{"$f":"J63","v":459.28},null,null,null,null,null,null,null,null,null,null,null,null,null,null,null,null,null,null,null,null,null,null,null,null,null,null,null,null,2.1,0,"G.10",0,0,"B.17","B.18","B.20","B.21","B.23","C.13","E.14","E.15","E.16","E.17","E.17","E.18",0,0,0,0,null,null,2.1,0,"G.10","A.12","A.12","B.17","B.19","B.20","C.12","C.13","C.14","C.14","E.15","E.16","F.8",0,0,0,0,0,0,null,null,2.1,0,"G.10","A.12","A.12","B.17","B.19","B.20","C.12","C.13","C.14","C.14","C.15","E.16","F.10",0,0,0,0,0,0,null,null,2.1,0,"G.10","A.13","A.13","B.17","B.19","C.11","C.12","C.13","C.14","D.7","D.9",0,0,0,0,0,0,0,0]
[null,"Easy Spring Ultra - Skyline","_ESU_",null,null,"SHORT",{"$f":"G58","v":442.85},{"$f":"H50","v":129.96},5,{"$f":"G64+H64+I64","v":577.81000000000006},{"$f":"J64","v":577.81000000000006},"US",null,null,null,null,null,null,null,null,null,null,null,null,null,null,null,null,null,null,null,null,null,null,null,null,null,null,null,2.2000000000000002,0,"G.10",0,0,"B.17","B.19","B.20","B.21","B.23","C.14","E.14","E.15","E.16","E.17","E.18",0,0,0,0,0,null,null,2.2000000000000002,0,"G.10","A.12","A.12","B.17","B.19","B.20","C.12","C.13","C.14","C.15","E.16","E.16",0,0,0,0,0,0,0,null,null,2.2000000000000002,0,"G.10","A.12","A.12","B.17","B.19","B.20","C.12","C.13","C.14","C.15","C.16","E.16",0,0,0,0,0,0,0,null,null,2.2000000000000002,0,"G.10",0,0,"B.18","B.19","C.12","C.12","C.13","C.14","D.7","D.9",0,0,0,0,0,0,0,0]
[null,"Easy Spring Wand (ESW)","_ESW_",null,null,"LIGHT",624.85,{"$f":"H50","v":129.96},5,{"$f":"G65+H65+I65","v":759.81000000000006},{"$f":"J65","v":759.81000000000006},"US",null,null,null,null,null,null,null,null,null,null,null,null,null,null,null,null,null,null,null,null,null,null,null,null,null,null,null,2.2999999999999998,0,"G.10",0,0,"B.17","B.19","B.20","B.22","B.23","C.14","E.15","E.16","E.16","E.17","E.18",0,0,0,0,0,null,null,2.2999999999999998,0,"G.10",0,0,"B.18","B.19","B.21","C.12","C.13","C.14","C.15","E.16","E.17",0,0,0,0,0,0,0,null,null,2.2999999999999998,0,"G.10",0,0,"B.18","B.19","B.21","C.12","C.13","C.14","C.15","C.16","E.17",0,0,0,0,0,0,0,null,null,2.2999999999999998,0,"G.10",0,0,"B.18","B.19","C.12","C.13","C.13","C.14","D.7",0,0,0,0,0,0,0,0,0]
[null,null,null,null,null,"STD",777.69,{"$f":"H50","v":129.96},5,{"$f":"G66+H66+I66","v":912.65000000000009},912.65000000000009,"US",null,null,null,null,null,null,null,null,null,null,null,null,null,null,null,null,null,null,null,null,null,null,null,null,null,null,null,2.4,0,0,0,0,"B.18","B.19","B.21","B.22","B.24","C.14","E.15","E.16","E.17","E.18",0,0,0,0,0,0,null,null,2.4,0,0,0,0,"B.18","B.19","B.21","C.13","C.13","C.14","C.15","E.16","E.17",0,0,0,0,0,0,0,null,null,2.4,0,0,0,0,"B.18","B.19","B.21","C.13","C.13","C.14","C.15","C.16",0,0,0,0,0,0,0,0,null,null,2.4,0,0,0,0,"B.18","C.11","C.12","C.13","C.14","C.15","D.9",0,0,0,0,0,0,0,0,0]
[null,null,null,null,null,"HD",904.68,{"$f":"H50","v":129.96},5,{"$f":"G67+H67+I67","v":1039.6399999999999},1039.6399999999999,"US"]
[null,"T_MinWidth"]
[null,"Control Type","Min Width"]
[null,{"$f":"IFERROR(INDEX(T_ControlType[],ROW()-ROW($B$70)+1),\"\")","v":"Easy Spring Wand"},{"$f":"IF(i_Location=\"AU\",Ctrl_Recommendations!K104,Ctrl_Recommendations!K109)","v":675},null,null,"NEW DEC  W SKYLINE",null,"UNIVERSAL LIMITER"]
[null,{"$f":"IFERROR(INDEX(T_ControlType[],ROW()-ROW($B$70)+1),\"\")","v":"Easy Spring Ultra (ESU)"},{"$f":"IFERROR(IF(i_Tube=TEXT(1.5&CHAR(34),0),660,459),459)","v":459},null,"goes to 660mm for 1.5\" tubes","COMPACT",{"$f":"G63+2.5","v":326.82},{"$f":"H58","v":147.69999999999999},5,{"$f":"G71+H71+I71","v":479.52},{"$f":"J71","v":479.52}]
[null,{"$f":"IFERROR(INDEX(T_ControlType[],ROW()-ROW($B$70)+1),\"\")","v":"Easy Spring Ultra - Skyline"},{"$f":"K77","v":461.78},null,null,"SHORT",{"$f":"G64+2.5","v":445.35},{"$f":"H58","v":147.69999999999999},5,{"$f":"G72+H72+I72","v":598.04999999999995},{"$f":"J72","v":598.04999999999995}]
[null,{"$f":"IFERROR(INDEX(T_ControlType[],ROW()-ROW($B$70)+1),\"\")","v":""},null,null,null,"LIGHT",627.35,{"$f":"H58","v":147.69999999999999},5,{"$f":"G73+H73+I73","v":780.05},{"$f":"J73","v":780.05}]
[null,{"$f":"IFERROR(INDEX(T_ControlType[],ROW()-ROW($B$70)+1),\"\")","v":""},null,null,null,"STD",780.19,{"$f":"H58","v":147.69999999999999},5,{"$f":"G74+H74+I74","v":932.8900000000001},{"$f":"J74","v":932.8900000000001}]
[null,{"$f":"IFERROR(INDEX(T_ControlType[],ROW()-ROW($B$70)+1),\"\")","v":""},null,null,null,"HD",907.18,{"$f":"H58","v":147.69999999999999},5,{"$f":"G75+H75+I75","v":1059.8799999999999},{"$f":"J75","v":1059.8799999999999}]
[null,null,null,null,null,null,null,"SHORT LIMITER"]
[null,null,null,null,null,"COMPACT",{"$f":"G71","v":326.82},{"$f":"H64","v":129.96},5,{"$f":"G77+H77+I77","v":461.78},{"$f":"J77","v":461.78}]
[null,"=Indirect(\"Chart\"&INDEX(T_ConvertControlType[Output],MATCH(i_ControlType,T_ConvertControlType[Input],0))&INDEX(T_ConvertTube[Output],MATCH(i_Tube,T_ConvertTube[Input],0)))",null,null,null,"SHORT",{"$f":"G72","v":445.35},{"$f":"H64","v":129.96},5,{"$f":"G78+H78+I78","v":580.31000000000006},{"$f":"J78","v":580.31000000000006}]
[null,{"$f":"\"Chart\"&INDEX(T_ConvertControlType[Output],MATCH(i_ControlType,T_ConvertControlType[Input],0))&INDEX(T_ConvertTube[Output],MATCH(i_Tube,T_ConvertTube[Input],0))","v":{"$error":"#N/A"}},null,null,null,"LIGHT",{"$f":"G73","v":627.35},{"$f":"H64","v":129.96},5,{"$f":"G79+H79+I79","v":762.31000000000006},{"$f":"J79","v":762.31000000000006}]
[null,null,null,null,null,"STD",{"$f":"G74","v":780.19},{"$f":"H64","v":129.96},5,{"$f":"G80+H80+I80","v":915.15000000000009},{"$f":"J80","v":915.15000000000009}]
[null,"=IF(i_Units=\"\",\"Blind Width\",\"Blind Width (\"&IFERROR(INDIRECT(\"o_WidthRange\"&i_Units)&\")\",\"\"))",null,null,null,"HD",{"$f":"G75","v":907.18},{"$f":"H64","v":129.96},5,{"$f":"G81+H81+I81","v":1042.1399999999999},{"$f":"J81","v":1042.1399999999999}]
[]
[null,"Fabric roll diameter"]
[null,"=((-Tube_OD+SQRT(Tube_OD^2-4*Fabric_Thickness*-Z6*1000/PI()))/(2*Fabric_Thickness)+IF(pwa=\"Yes\",1,0))*Fabric_Thickness*2+Tube_OD"]
[]
[]
[]
[]
[]
[]
[]
[null,null,null,null,"ESW","OLD DEC.",null,"UNIVERSAL LIMITER","GAP","TOTAL"]
[null,null,null,null,null,"SHORT",578.55999999999995,{"$f":"H44","v":147.69999999999999},5,{"$f":"G93+H93+I93","v":731.26},731,"AU"]
[null,null,null,null,null,"LIGHT",760.57,{"$f":"H44","v":147.69999999999999},5,913.27,{"$f":"J94","v":913.27},"AU"]
[null,null,null,null,null,"STD",913.4,{"$f":"H44","v":147.69999999999999},5,{"$f":"G95+H95+I95","v":1066.0999999999999},1066.0999999999999,"AU"]
[null,null,null,null,null,"HD",1040.3800000000001,{"$f":"H44","v":147.69999999999999},5,1193.0800000000002,1193.0800000000002,"AU"]
[null,null,null,null,null,null,null,"SHORT LIMITER"]
[null,null,null,null,null,"SHORT",{"$f":"G93","v":578.55999999999995},{"$f":"H50","v":129.96},5,{"$f":"G98+H98+I98","v":713.52},713.52,"AU"]
[null,null,null,null,null,"LIGHT",{"$f":"G94","v":760.57},{"$f":"H50","v":129.96},5,{"$f":"G99+H99+I99","v":895.53000000000009},895.53000000000009,"AU"]
[null,null,null,null,null,"STD",{"$f":"G95","v":913.4},{"$f":"H50","v":129.96},5,{"$f":"G100+H100+I100","v":1048.3599999999999},1048.3599999999999,"AU"]
[null,null,null,null,null,"HD",{"$f":"G96","v":1040.3800000000001},{"$f":"H50","v":129.96},5,{"$f":"G101+H101+I101","v":1175.3400000000001},1175.3400000000001,"AU"]
[]
[null,null,null,null,null,"NEW DEC.",null,"UNIVERSAL LIMITER"]
[null,null,null,null,null,"SHORT",539.96,{"$f":"H93","v":147.69999999999999},5,{"$f":"G104+H104+I104","v":692.66000000000008},692.66000000000008,"US"]
[null,null,null,null,null,"LIGHT",721.97,{"$f":"H94","v":147.69999999999999},5,{"$f":"G105+H105+I105","v":874.67000000000007},874.67000000000007,"US"]
[null,null,null,null,null,"STD",874.8,{"$f":"H95","v":147.69999999999999},5,{"$f":"G106+H106+I106","v":1027.5},1027.5,"US"]
[null,null,null,null,null,"HD",1001.78,{"$f":"H96","v":147.69999999999999},5,{"$f":"G107+H107+I107","v":1154.48},1154.48,"US"]
[null,null,null,null,null,null,null,"SHORT LIMITER"]
[null,null,null,null,null,"SHORT",{"$f":"G104","v":539.96},{"$f":"H98","v":129.96},5,{"$f":"G109+H109+I109","v":674.92000000000007},675,"US"]
[null,null,null,null,null,"LIGHT",{"$f":"G105","v":721.97},{"$f":"H99","v":129.96},5,{"$f":"G110+H110+I110","v":856.93000000000006},856.93000000000006,"US"]
[null,null,null,null,null,"STD",{"$f":"G106","v":874.8},{"$f":"H100","v":129.96},5,{"$f":"G111+H111+I111","v":1009.76},1009.76,"US"]
[null,null,null,null,null,"HD",{"$f":"G107","v":1001.78},{"$f":"H101","v":129.96},5,{"$f":"G112+H112+I112","v":1136.74},1136.74,"US"]

{"sheet":"Item List","index":7,"n_rows":159,"n_cols":8,"rows_kept":159,"cut":false,"hidden":true,"merged":[]}
["No.","Description","Colour Code","Colour Description","Base Unit of Measure","AU"]
["AW91-1501-050000","Fabric Brush T Slot Fit - 7 x 4.8mm ∙ 350 Lm roll","050","Black, Satin","METRE",1.59,null,"=INDEX('eBOM_ESUltra_ESWand-PriceList-02AUG22.xlsx'!Table1[Unit Price],MATCH(A2,'eBOM_ESUltra_ESWand-PriceList-02AUG22.xlsx'!Table1[No.],0))"]
["CREC100W","End Cap Cassette 100 White","075","White - US","PIECE",0]
["CRUSLB660",{"$error":"#N/A"},{"$error":"#N/A"},{"$error":"#N/A"},{"$error":"#N/A"},{"$error":"#N/A"},null,"CTRL+SHIFT+DOWN"]
["CRV100A",{"$error":"#N/A"},{"$error":"#N/A"},{"$error":"#N/A"},{"$error":"#N/A"},{"$error":"#N/A"}]
["CRV100W","Cassette 100 16' (4.87m) White","000","Mill Finish","LENGTH",0,null,"CTRL+D"]
["HB16A",{"$error":"#N/A"},{"$error":"#N/A"},{"$error":"#N/A"},{"$error":"#N/A"},{"$error":"#N/A"}]
["HB16U",{"$error":"#N/A"},{"$error":"#N/A"},{"$error":"#N/A"},{"$error":"#N/A"},{"$error":"#N/A"},null,"Remove formulas"]
["HB16W",{"$error":"#N/A"},{"$error":"#N/A"},{"$error":"#N/A"},{"$error":"#N/A"},{"$error":"#N/A"}]
["HBECW",{"$error":"#N/A"},{"$error":"#N/A"},{"$error":"#N/A"},{"$error":"#N/A"},{"$error":"#N/A"}]
["HBIS",{"$error":"#N/A"},{"$error":"#N/A"},{"$error":"#N/A"},{"$error":"#N/A"},{"$error":"#N/A"}]
["HD82-1904-025010","Screw, Self Tapping, Philips C/Sunk Head, #4 x 3/8","025","Silver ZINC Plated","PIECE",0.09]
["LSADJKITW","Link Infinite Adjuster Kit | Adaptor Drive & Shaft","075","White - US","KIT",{"$error":"#N/A"}]
["RB08-4151-069040","LX/VX Bracket Cover Caps - 40mm Proj. ∙ S40/S45","069","Pure White","PAIR",0.85]
["RB08-4151-069055","LX/VX Bracket Cover Caps - 55mm Proj. ∙ S40/S45","069","Pure White","PAIR",1]
["RB09-0245-069001","RB09 Easy-Lock Extended Idler ∙ S45","069","Pure White","PIECE",4.9000000000000004]
["RB09-0352-069040","RB09 Easy-Lock LX Bkts - 12/40mm | S45","069","Pure White","PAIR",2.8]
["RB12-2501-069138","Skyline ESS Limiter Bracket Set | 1.5”","069","Pure White","SET",0]
["RB12-2502-025138","Skyline Cassette Bracket Set 100/120 | 1.5”","025","Silver ZINC Plated","SET",0]
["RB12-2503-069140","LX Skyline & RB12 Control bracket set | 40mm","069","Pure White","SET",3.81]
["RB12-3200-069038","Single Chainfree Control | S38 - 1-1/2\" tube","069","Pure White","PIECE",1.48]
["RB12-3200-069045","Single Chainfree Control | S45 Wht","069","Pure White","PIECE",1.55]
["RB12-3240-069038","ESU Chain Free Control with Skyline Adapter","","","",{"$error":"#N/A"}]
["RB12-3241-069038","ESU 1.5\" SPRING CONTROL","069","Pure White","PIECE",0]
["RB12-3301-069138","Easy Spring Wand Control | LH (Blue Collar) Wht","069","Pure White","PIECE",22.25]
["RB12-3301-069238","Easy Spring Wand Control | RH (Red Collar)Wht","069","Pure White","PIECE",22.25]
["RB12-3800-269038","Booster Universal | SHORT - 38 | 1.5'","269","Sandstone","PIECE",12.5]
["RB12-3801-069038","Booster Universal | LIGHT - 38 | 1.5'","069","Pure White","PIECE",13.7]
["RB12-3802-338038","Booster Universal | STD - 38 | 1.5'","338","Silver Grey","PIECE",16.66]
["RB12-3805-069038","Booster+Control+Decel | LH | Compact SL 1.5\" Wht","069","Pure White","PIECE",0]
["RB12-3810-069038","Booster Connector | 1.5” (38mm)","069","Pure White","PIECE",2.2200000000000002]
["RB12-3812-503038","ESU Pre-Tension Retaining Clip 38mm",{"$error":"#REF!"},"Orange","PIECE",0]
["RB12-4500-269045","Booster Universal | SHORT S45","269","Sandstone","PIECE",14.28]
["RB12-4501-069045","Booster Universal | LIGHT S45","069","Pure White","PIECE",15.48]
["RB12-4502-338045","Booster Universal | STD S45","338","Silver Grey","PIECE",20.83]
["RB12-4503-050045","Booster Universal | HD S45","050","Black, Satin","PIECE",23.21]
["RB12-4504-050045","Booster Universal + Decel | LH | COMPACT S45","050","Black, Satin","PIECE",54.41]
["RB12-4505-069045","Booster+Control+Decelerator | LH |Compact  S45 Wht","069","Pure White","PIECE",34.67]
["RB12-4510-069045","Connector - Chain Winder/Booster | S45","069","Pure White","PIECE",2.2200000000000002]
["RB12-4512-503045","ESU Pre-Tension Retaining Clip 45mm",{"$error":"#REF!"},"Orange","PIECE",1]
["RB12-6101-069038","Limiter – Single Stop | Universal 1.5\" (38mm) V2","069","Pure White","PIECE",8.33]
["RB12-6101-069045","Limiter – Single Stop | Universal S45 V2","069","Pure White","PIECE",8.33]
["RB12-6102-069038","Limiter – Single Stop | Universal SHORT 38mm V2","069","Pure White","PIECE",0]
["RB12-6102-069045","Limiter – Single Stop | Universal SHORT S45 V2","069","Pure White","PIECE",8.2200000000000006]
["RB12-7101-393145","Soft Lift Decelerator | S45 LH - Blue Tail\t","393","Blue Sky","Piece",17.38]
["RB12-7102-190245","Soft Lift Decelerator | S45 RH - Red Tail\t","190","Red","Piece",17.38]
["RB12-7111-393038","Decelerator | Universal S38/1.5\" LH","393","Blue Sky","PIECE",0]
["RB12-7111-393045","Decelerator | Universal S45\" LH","393","Blue Sky","PIECE",17.38]
["RB12-7112-190038","Decelerator | Universal S38/1.5\" RH","190","RED","PIECE",0]
["RB12-7112-190045","Decelerator | Universal S45 RH","190","RED","PIECE",17.38]
["RB12-9001-069090","Easy Spring Wand | Universal - 36\" (90cm) Wht","069","Pure White","PIECE",2.38]
["RB41-0321-075050","Medium Link Skyline Bracket | Narrow | 50mm","075","White - US","PIECE",6.55]
["RB41-0321-075138","Medium Link Skyline Bracket | Narrow | 38mm V2","075","White - US","PIECE",5.95]
["RB41-0331-075075","Medium Link Fascia Bracket | 75mm","075","White - US","PIECE",11.91]
["RB41-0353-069040","Easy-Link LX Inter. Bearing Brkt - 40mm | S40/45","069","Pure White","PIECE",14.63]
["RB41-0353-069055","Easy-Link LX Inter. Bearing Brkt - 55mm | S40/45","069","Pure White","PIECE",15.38]
["RB41-0453-069040","Easy-Link AX Inter. Brkt - 40mm + G/Screw | S40/45","069","Pure White","SET",20.88]
["RB41-0501-069000","Medium Multi-Link Bracket Disk + Bearing","069","Pure White","PIECE",5.95]
["RB41-0502-069000","Medium Easy-Link Bracket Disk + Bearing","069","Pure White","PIECE",5.95]
["RB41-1001-075038","Medium Easy-Link Intermediate FEMALE Drive | 38mm","075","White - US","PIECE",13.88]
["RB41-1001-069045","Easy-Link Inter FEMALE Drive & Idle Adapter | S45","069","Pure White","SET",14.63]
["RB41-1002-075038","Medium Easy-Link Intermediate MALE Drive | 38mm","075","White - US","PIECE",13.88]
["RB41-1002-069045","Easy-Link Intermediate MALE Drive | S45","069","Pure White","PIECE",14.63]
["RB88-0101-069001","PELMET 95 - End Cap Set + Fixing Screws","069","Pure White","SET",4.34]
["RB88-0121-025001","PELMET 95 - Spring Loaded Bracket -Top/CeilingFix","025","Silver ZINC Plated","PIECE",3.49]
["RB88-0122-025001","PELMET 95 - Spring Loaded Bracket - Universal Fix","025","Silver ZINC Plated","PIECE",3.49]
["RB88-0150-000580","PELMET 95 - Base 50 LX/VX ∙ 5.8 metre Length","000","Mill Finish","LENGTH",150.68]
["RB88-0150-020580","PELMET 95 - Base 50 LX/VX ∙ 5.8 metre Length","020","Anodised 15","LENGTH",155.19]
["RB88-0150-069580","PELMET 95 - Base 50 LX/VX ∙ 5.8 metre Length","069","Pure White","LENGTH",165.74]
["RB88-2051-069580","MKII Mounting Rail - MKII Base 50 ∙ 5.8 metre","069","Pure White","LENGTH",63.72]
["RB88-2092-069001","Mounting Rail - Slimline Spring Clip Bracket Uni.","069","Pure White","PIECE",0.92]
["RB88-2106-025002",{"$error":"#N/A"},{"$error":"#N/A"},{"$error":"#N/A"},{"$error":"#N/A"},{"$error":"#N/A"}]
["RB88-4151-069040","VX/LX Bracket Cover Caps M/Rail Base 50 | 40mm","069","Pure White","PAIR",0.85]
["RB88-4151-069055","VX/LX Bracket Cover Caps M/Rail Base 50 | 55mm","069","Pure White","PAIR",0]
["RB91-1203-020580","ROUND Aluminium Bottom Rail 22.0mm x 5.8mt Length","020","Anodised 15","LENGTH",37.53]
["RB91-1205-020480","FLAT Aluminium Bottom Rail 11.0 x 22.0mm x 4.8 Lm","020","Anodised 15","LENGTH",35.159999999999997]
["RB91-1215-000430",{"$error":"#N/A"},{"$error":"#N/A"},{"$error":"#N/A"},{"$error":"#N/A"},{"$error":"#N/A"}]
["RB91-1215-020430","MINI Aluminium Closed Bottom Rail 15.0mm 4.3 Lm","020","Anodised 15","LENGTH",{"$error":"#N/A"}]
["RB91-1226-020480","OVAL Aluminium Bottom Rail 15 x 26mm x 4.8m length","020","Anodised 15","LENGTH",36.159999999999997]
["RB91-1232-020580","D30 SILENT Aluminiun Bottom Rail 14 x 31mm x 5.8Lm","020","Anodised 15","LENGTH",38.909999999999997]
["RB91-2104-069022","ROUND SLIMLINE Bottom Rail End Cap | Universal","069","Pure White","PIECE",0.2]
["RB91-2105-069001","FLAT Bottom Rail End Cap | Universal","069","Pure White","PIECE",0.19]
["RB91-2115-283002",{"$error":"#N/A"},{"$error":"#N/A"},{"$error":"#N/A"},{"$error":"#N/A"},{"$error":"#N/A"}]
["RB91-2126-338001","OVAL Bottom Rail End Cap | Universal","338","Silver Grey","PIECE",0.28999999999999998]
["RB91-2131-069002","D30 Medium Bottom Rail End Caps | LH & RH set","069","Pure White","PAIR",0.57999999999999996]
["RB92-0404-311215","T-Spline - SLIDE-ON ∙ 18mm Tail x 200 Lm roll","311","Light Grey","ROLL",129.74]
["RB92-0901-001100","9mm ACM Flat Spline ∙ 100 Lm Roll","001","Clear","ROLL",117.84]
["RB92-0902-001075","9mm ACM Flat Spline - D/S MP-HR TAPE ∙ 75 Lm Roll","001","Clear","ROLL",113.08]
["RB92-0903-001075","9mm ACM Flat Spline D/S MP-HR TAPE B/S 75 Lm Roll","001","Clear","ROLL",169.02]
["RB92-1001-001100","10mm ACM Flat Spline ∙ 100 Lm Roll","001","Clear","ROLL",122.6]
["RB92-1002-001075","10mm ACM Flat Spline - D/S MP-HR TAPE | 75 Lm Roll","001","Clear","ROLL",115.46]
["RB92-1003-001075","10mm ACM Flat Spline D/S MP-HR TAPE B/S 75Lm Roll","001","Clear","ROLL",171.4]
["RB92-1501-001100","15mm ACM Flat Spline | 100 Lm Roll","001","Clear","ROLL",167.82]
["RB92-1502-001075","15mm ACM Flat Spline - D/S MP-HR TAPE ∙ 75 Lm Roll","001","Clear","ROLL",159.49]
["RB92-1503-001075","15mm ACM Flat Spline D/S MP-HR TAPE B/S 75 Lm Roll","001","Clear","ROLL",234.49]
["RB93-0443-000580","S45 / LIGHT T-SPLINE Alum. Tube ∙ O.D 43mm x 5.8Lm","000","Mill Finish","LENGTH",48.63]
["RB93-0444-000580","S45 / STD T-SPLINE Alum. Tube ∙ O.D 44mm x 5.8 Lm","000","Mill Finish","LENGTH",64.84]
["RB93-0449-000580","S45 / HD T-SPLINE Alum. Tube ∙ O.D 49mm x 5.8 Lm","000","Mill Finish","LENGTH",112.23]
["RB93-6443-000580","S45 / LGT T-SPLINE Tube ∙ O.D 43mm x 5.8 Lm M/TAPE","000","Mill Finish","LENGTH",57.61]
["RB93-6444-000580","S45 / STD T-SPLINE Tube ∙ O.D 44mm x 5.8 Lm M/TAPE","000","Mill Finish","LENGTH",74.819999999999993]
["RB93-6449-000580","S45 / HD T-SPLINE Tube ∙ O.D 49mm x 5.8 Lm M/TAPE","000","Mill Finish","LENGTH",123.45]
["RC01-0101-000480","CF Cassette 90 Back - 4.8m length","000","Mill Finish","LENGTH",124.7]
["RC01-0102-069480","CF Cassette 90 Round Cover - 4.8m length","069","Pure White","LENGTH",87.29]
["RC01-0103-069480","CF Cassette 90 Square Cover - 4.8m length","069","Pure White","LENGTH",93.53]
["RC02-0101-338090","CF Cassette 90 End Plate Set + Screws","338","Silver Grey","SET",2.98]
["RC02-0102-069090","CF Cassette 90 Round Cover Set","069","Pure White","SET",4.5199999999999996]
["RC02-0103-069090","CF Cassette 90 Square Cover Set","069","Pure White","SET",4.5199999999999996]
["RC02-0203-001090","Easy Spring Wand Guide CF90 | RH & LH","001","Clear","PIECE",7.74]
["RC03-0101-069040","CF Fascia 90 Bracket - 40mm","069","Pure White","PIECE",1.79]
["RC03-1001-025090","CF Cassette 90 Mounting Bracket","025","Silver ZINC Plated","PIECE",3.45]
["RC03-1002-025090","CF Cassette 90 Face Fix Mounting Bracket","025","Silver ZINC Plated","PIECE",3.45]
["RC91-0101-069580","CF dim-OUT Side Guide – 2 Piece Set - 5.8m length","069","Pure White","SET",130.94]
["RC91-0201-050000","CF dim-OUT Side Guide Side Guide Lock","050","Black, Satin","PIECE",0.3]
["RC91-0302-338000","CF Cassette Side Guide Ear","338","Silver Grey","PIECE",0.3]
["RC91-1001-069000","CF dim-OUT Side Guide Bottom Cap + screws","069","Pure White","SET",1.9]
["RC91-1002-069000","CF dim-OUT Side Guide Funnel & Screw Set","069","Pure White","SET",1.79]
["RCBIHB16",{"$error":"#N/A"},{"$error":"#N/A"},{"$error":"#N/A"},{"$error":"#N/A"},{"$error":"#N/A"}]
["RTEA-4T05-000580","Rollease Tube + M/P Tape | 38mm (1 1/2\") x 5.8m","000","Mill Finish","LENGTH",38.520000000000003]
["RTEA4T16","Tube Aluminum 1-1/2\" x 16' Taped","000","Mill Finish","LENGTH",48.8]
["S45",{"$error":"#N/A"},{"$error":"#N/A"},{"$error":"#N/A"},{"$error":"#N/A"},{"$error":"#N/A"}]
["SB06-0201-020580","F4115 FLAT Heavy Duty Weight Bar 41 x 15mm x 5.8Lm","020","Anodised 15","LENGTH",77.31]
["SB06-0210-069000","F4115 FLAT Weight Bar - End Cap","069","Pure White","PIECE",0.32]
["SB20-0202-075100","Cassette 100 Mounting Bracket White","075","White - US","PIECE",4.13]
["SB20-0303-075120","End Cap Cassette 120","075","White - US","PIECE",0]
["SB20-0304-0490",{"$error":"#N/A"},{"$error":"#N/A"},{"$error":"#N/A"},{"$error":"#N/A"},{"$error":"#N/A"}]
["SB20-0304-075490",{"$error":"#N/A"},{"$error":"#N/A"},{"$error":"#N/A"},{"$error":"#N/A"},{"$error":"#N/A"}]
["SB20-0503-025000",{"$error":"#N/A"},{"$error":"#N/A"},{"$error":"#N/A"},{"$error":"#N/A"},{"$error":"#N/A"}]
["SB20-0504-025490",{"$error":"#N/A"},{"$error":"#N/A"},{"$error":"#N/A"},{"$error":"#N/A"},{"$error":"#N/A"}]
["SB91-0005-001100","Bubble Seal SMALL - 5mm x 100 metre roll","001","Clear","METRE",0.48]
["SB91-0011-050500","Fabric Brush T Slot Fit 5mm x 4.8mm | 500 Lm Roll","050","Black, Satin","METRE",0.93]
["SL01-0306-069040","LX Skyline Bracket | 40mm projection","069","Pure White","PIECE",1.92]
["SL01-0306-069055","LX Skyline Bracket | 55mm projection","069","Pure White","PIECE",0]
["SLB660W","Skyline Bracket | Standard | 38mm","075","White - US","PIECE",1.27]
["SLBCW","Skyline Bracket Cover | Standard | 38mm","075","White - US","EACH",0.66]
["SLFBKT3W","Skyline Fascia Bracket 75mm","075","White - US","PAIR",0]
["SLFBKT4W","Skyline Fascia Bracket 100mm (4\")","075","White - US","PIECE",7.31]
["SlFBKTCLP4","Skyline Bracket Clip","025","Silver ZINC Plated","PIECE",1.58]
["SLFCVR4W","Skyline Bracket Cover 100mm (4\")","075","White - US","PIECE",2.39]
["SLNB660W","Skyline Bracket | Narrow | 38mm","075","White - US","EACH",1.27]
["SLNBC660W","Skyline Bracket Cover | Narrow | 38mm (1-1/2\")","075","White - US","PIECE",0.54]
["SLPEHD53W","Skyline Pin End | Heavy Duty | 38mm (1-1/2\")","075","White - US","PIECE",4.34]
["SLPEV653W","Skyline Pin End | 38mm (1-1/2\")","075","White - US","PIECE",1.97]
["SLSECW","Fascia 76mm Bracket Cover | Square","075","White - US","PIECE",0]
["SLSF4A16",{"$error":"#N/A"},{"$error":"#N/A"},{"$error":"#N/A"},{"$error":"#N/A"},{"$error":"#N/A"}]
["SLSF4W16","Fascia 100mm (4\") Panel | Square","075","White - US","LENGTH",68.56]
["SLSFA16","Fascia 76mm Panel | Square","020","Anodised 15","LENGTH",0]
["SLSFW16","Fascia 76mm Panel | Square","075","White - US","LENGTH",0]
["SS31-5991-050944","M4 x 4mm Grub Screw","050","Black, Satin","PIECE",0.17]
["SS91-5241-050500","RIBBED Round Spline | 4.1mm x 500mt Roll","050","Black, Satin","METRE",0]
["SS91-5246-050300","RIBBED Round Spline | 4.6mm x 300mt Roll","050","Black, Satin","METRE",0.27]
["SS91-5246-050500",{"$error":"#N/A"},{"$error":"#N/A"},{"$error":"#N/A"},{"$error":"#N/A"},{"$error":"#N/A"}]
["TAPE36",{"$error":"#N/A"},{"$error":"#N/A"},{"$error":"#N/A"},{"$error":"#N/A"},{"$error":"#N/A"}]
["V2BKT","\"2\"\" Traversing Lift Set 2\"\"Mounting Bracket Zinc","","","PIECE",0]
["VB05-0301-025300","VB05 OVAL Steel Tiltrod 5.00 x 7.5mm x 3mt Length","025","Silver ZINC Plated","LENGTH",7.92]
["RB12-4550-069045","Spring Control Tension Adjust S45","069","Pure White","PIECE",100]
["RB12-3870-069038","Skyline Spring Control with Tension Adjust 38mm","069","Pure White","PIECE",100]
["RB12-4570-069045","Skyline Spring Control with Tension Adjust 45mm","069","Pure White","PIECE",3.6]
["RB12-3241-069038","Spring Control | 1.5\"","069","Pure White","PIECE",100]
["RB12-4515-069045","Booster Universal | COMPACT S45 | Skyline","069","Pure White","PIECE",100]

{"sheet":"Sheet1","index":8,"n_rows":150,"n_cols":9,"rows_kept":150,"cut":false,"hidden":true,"merged":[]}
["No.","Description",null,null,"LEFT,4",null,null,"TEXTJOIN",{"$f":"_xlfn.TEXTJOIN(\"*|\",TRUE,F2:F41)","v":"AW91*|CREC*|CRUS*|CRV1*|HB16*|HBEC*|HBIS*|HD82*|LSAD*|RB08*|RB09*|RB12*|RB41*|RB88*|RB91*|RB92*|RB93*|RC01*|RC02*|RC03*|RC91*|RCBI*|RTEA*|SB06*|SB20*|SB91*|SL01*|SLB6*|SLBC*|SLFB*|SLFC*|SLNB*|SLPE*|SLSE*|SLSF*|SS31*|SS91*|TAPE*|V2BK*|VB05"}]
["AW91-1501-050000","Fabric Brush T Slot Fit - 7 x 4.8mm ∙ 350 Lm roll",null,null,{"$f":"LEFT(A2,4)","v":"AW91"},"AW91",null,"NAV","AW91*|CREC*|CRUS*|CRV1*|HB16*|HBEC*|HBIS*|HD82*|LSAD*|RB08*|RB09*|RB12*|RB41*|RB88*|RB91*|RB92*|RB93*|RC01*|RC02*|RC03*|RC91*|RCBI*|RTEA*|SB06*|SB20*|SB91*|SL01*|SLB6*|SLBC*|SLFB*|SLFC*|SLNB*|SLPE*|SLSE*|SLSF*|SS31*|SS91*|TAPE*|V2BK*|VB05*"]
["CREC100W","End Cap Cassette 100 White",null,null,"CREC","CREC"]
["CRUSLB660",{"$error":"#N/A"},null,null,"CRUS","CRUS"]
["CRV100A",{"$error":"#N/A"},null,null,{"$f":"LEFT(A5,4)","v":"CRV1"},"CRV1"]
["CRV100W","Cassette 100 16' (4.87m) White",null,null,"CRV1","HB16"]
["HB16A",{"$error":"#N/A"},null,null,"HB16","HBEC"]
["HB16U",{"$error":"#N/A"},null,null,"HB16","HBIS"]
["HB16W",{"$error":"#N/A"},null,null,"HB16","HD82"]
["HBECW",{"$error":"#N/A"},null,null,"HBEC","LSAD"]
["HBIS",{"$error":"#N/A"},null,null,"HBIS","RB08"]
["HD82-1904-025010","Screw, Self Tapping, Philips C/Sunk Head, #4 x 3/8",null,null,"HD82","RB09"]
["LSADJKITW","Link Infinite Adjuster Kit | Adaptor Drive & Shaft",null,null,"LSAD","RB12"]
["RB08-4151-069040","LX/VX Bracket Cover Caps - 40mm Proj. ∙ S40/S45",null,null,"RB08","RB41"]
["RB08-4151-069055","LX/VX Bracket Cover Caps - 55mm Proj. ∙ S40/S45",null,null,"RB08","RB88"]
["RB09-0245-069001","RB09 Easy-Lock Extended Idler ∙ S45",null,null,"RB09","RB91"]
["RB09-0352-069040","RB09 Easy-Lock LX Bkts - 12/40mm | S45",null,null,"RB09","RB92"]
["RB12-2501-069138","Skyline ESS Limiter Bracket Set | 1.5”",null,null,"RB12","RB93"]
["RB12-2502-025138","Skyline Cassette Bracket Set 100/120 | 1.5”",null,null,"RB12","RC01"]
["RB12-2503-069140","LX Skyline & RB12 Control bracket set | 40mm",null,null,"RB12","RC02"]
["RB12-3200-069038","Single Chainfree Control | S38 - 1-1/2\" tube",null,null,"RB12","RC03"]
["RB12-3200-069045","Single Chainfree Control | S45 Wht",null,null,"RB12","RC91"]
["RB12-3240-069038","ESU Chain Free Control with Skyline Adapter",null,null,"RB12","RCBI"]
["RB12-3241-069038","ESU 1.5\" SPRING CONTROL",null,null,"RB12","RTEA"]
["RB12-3301-069138","Easy Spring Wand Control | LH (Blue Collar) Wht",null,null,"RB12","SB06"]
["RB12-3301-069238","Easy Spring Wand Control | RH (Red Collar)Wht",null,null,"RB12","SB20"]
["RB12-3800-269038","Booster Universal | SHORT - 38 | 1.5'",null,null,"RB12","SB91"]
["RB12-3801-069038","Booster Universal | LIGHT - 38 | 1.5'",null,null,"RB12","SL01"]
["RB12-3802-338038","Booster Universal | STD - 38 | 1.5'",null,null,"RB12","SLB6"]
["RB12-3805-069038","Booster+Control+Decel | LH | Compact SL 1.5\" Wht",null,null,"RB12","SLBC"]
["RB12-3810-069038","Booster Connector | 1.5” (38mm)",null,null,"RB12","SLFB"]
["RB12-4500-269045","Booster Universal | SHORT S45",null,null,"RB12","SLFC"]
["RB12-4501-069045","Booster Universal | LIGHT S45",null,null,"RB12","SLNB"]
["RB12-4502-338045","Booster Universal | STD S45",null,null,"RB12","SLPE"]
["RB12-4503-050045","Booster Universal | HD S45",null,null,"RB12","SLSE"]
["RB12-4504-050045","Booster Universal + Decel | LH | COMPACT S45",null,null,"RB12","SLSF"]
["RB12-4505-069045","Booster+Control+Decelerator | LH |Compact  S45 Wht",null,null,"RB12","SS31"]
["RB12-4510-069045","Connector - Chain Winder/Booster | S45",null,null,"RB12","SS91"]
["RB12-6101-069038","Limiter – Single Stop | Universal 1.5\" (38mm) V2",null,null,"RB12","TAPE"]
["RB12-6101-069045","Limiter – Single Stop | Universal S45 V2",null,null,"RB12","V2BK"]
["RB12-6102-069038","Limiter – Single Stop | Universal SHORT 38mm V2",null,null,"RB12","VB05"]
["RB12-6102-069045","Limiter – Single Stop | Universal SHORT S45 V2",null,null,"RB12"]
["RB12-7101-393138","Soft Lift Decelerator S38/1.5\" LH",null,null,"RB12","SS91-5246-050500"]
["RB12-7101-393145","Soft Lift Decelerator | S45 LH  - Blue Tail",null,null,"RB12","RB12-3812-503038"]
["RB12-7102-190238","Soft Lift Decelerator S38/1.5\" RH",null,null,"RB12","RB12-4512-503045"]
["RB12-7102-190245","Soft Lift Decelerator | S45 RH  - Red Tail",null,null,"RB12"]
["RB12-9001-069090","Easy Spring Wand | Universal - 36\" (90cm) Wht",null,null,"RB12"]
["RB41-0321-075050","Medium Link Skyline Bracket | Narrow | 50mm",null,null,"RB41"]
["RB41-0321-075138","Medium Link Skyline Bracket | Narrow | 38mm V2",null,null,"RB41"]
["RB41-0331-075075","Medium Link Fascia Bracket | 75mm",null,null,"RB41"]
["RB41-0353-069040","Easy-Link LX Inter. Bearing Brkt - 40mm | S40/45",null,null,"RB41"]
["RB41-0353-069055","Easy-Link LX Inter. Bearing Brkt - 55mm | S40/45",null,null,"RB41"]
["RB41-0453-069040","Easy-Link AX Inter. Brkt - 40mm + G/Screw | S40/45",null,null,"RB41"]
["RB41-0501-069000","Medium Multi-Link Bracket Disk + Bearing",null,null,"RB41"]
["RB41-0502-069000","Medium Easy-Link Bracket Disk + Bearing",null,null,"RB41"]
["RB41-1001-075038","Medium Easy-Link Intermediate FEMALE Drive | 38mm",null,null,"RB41"]
["RB41-1001-069045","Easy-Link Inter FEMALE Drive & Idle Adapter | S45",null,null,"RB41"]
["RB41-1002-075038","Medium Easy-Link Intermediate MALE Drive | 38mm",null,null,"RB41"]
["RB41-1002-069045","Easy-Link Intermediate MALE Drive | S45",null,null,"RB41"]
["RB88-0101-069001","PELMET 95 - End Cap Set + Fixing Screws",null,null,"RB88"]
["RB88-0121-025001","PELMET 95 - Spring Loaded Bracket -Top/CeilingFix",null,null,"RB88"]
["RB88-0122-025001","PELMET 95 - Spring Loaded Bracket - Universal Fix",null,null,"RB88"]
["RB88-0150-000580","PELMET 95 - Base 50 LX/VX ∙ 5.8 metre Length",null,null,"RB88"]
["RB88-0150-020580","PELMET 95 - Base 50 LX/VX ∙ 5.8 metre Length",null,null,"RB88"]
["RB88-0150-069580","PELMET 95 - Base 50 LX/VX ∙ 5.8 metre Length",null,null,"RB88"]
["RB88-2051-069580","MKII Mounting Rail - MKII Base 50 ∙ 5.8 metre",null,null,{"$f":"LEFT(A66,4)","v":"RB88"}]
["RB88-2092-069001","Mounting Rail - Slimline Spring Clip Bracket Uni.",null,null,"RB88"]
["RB88-2106-025002",{"$error":"#N/A"},null,null,"RB88"]
["RB88-4151-069040","VX/LX Bracket Cover Caps M/Rail Base 50 | 40mm",null,null,"RB88"]
["RB88-4151-069055","VX/LX Bracket Cover Caps M/Rail Base 50 | 55mm",null,null,"RB88"]
["RB91-1203-020580","ROUND Aluminium Bottom Rail 22.0mm x 5.8mt Length",null,null,"RB91"]
["RB91-1205-020480","FLAT Aluminium Bottom Rail 11.0 x 22.0mm x 4.8 Lm",null,null,"RB91"]
["RB91-1215-000430",{"$error":"#N/A"},null,null,"RB91"]
["RB91-1215-020430","MINI Aluminium Closed Bottom Rail 15.0mm 4.3 Lm",null,null,"RB91"]
["RB91-1226-020480","OVAL Aluminium Bottom Rail 15 x 26mm x 4.8m length",null,null,"RB91"]
["RB91-1232-020580","D30 SILENT Aluminiun Bottom Rail 14 x 31mm x 5.8Lm",null,null,"RB91"]
["RB91-2104-069022","ROUND SLIMLINE Bottom Rail End Cap | Universal",null,null,"RB91"]
["RB91-2105-069001","FLAT Bottom Rail End Cap | Universal",null,null,"RB91"]
["RB91-2115-283002",{"$error":"#N/A"},null,null,"RB91"]
["RB91-2126-338001","OVAL Bottom Rail End Cap | Universal",null,null,"RB91"]
["RB91-2131-069002","D30 Medium Bottom Rail End Caps | LH & RH set",null,null,"RB91"]
["RB92-0404-311215","T-Spline - SLIDE-ON ∙ 18mm Tail x 200 Lm roll",null,null,"RB92"]
["RB92-0901-001100","9mm ACM Flat Spline ∙ 100 Lm Roll",null,null,"RB92"]
["RB92-0902-001075","9mm ACM Flat Spline - D/S MP-HR TAPE ∙ 75 Lm Roll",null,null,"RB92"]
["RB92-0903-001075","9mm ACM Flat Spline D/S MP-HR TAPE B/S 75 Lm Roll",null,null,"RB92"]
["RB92-1001-001100","10mm ACM Flat Spline ∙ 100 Lm Roll",null,null,"RB92"]
["RB92-1002-001075","10mm ACM Flat Spline - D/S MP-HR TAPE | 75 Lm Roll",null,null,"RB92"]
["RB92-1003-001075","10mm ACM Flat Spline D/S MP-HR TAPE B/S 75Lm Roll",null,null,"RB92"]
["RB92-1501-001100","15mm ACM Flat Spline | 100 Lm Roll",null,null,"RB92"]
["RB92-1502-001075","15mm ACM Flat Spline - D/S MP-HR TAPE ∙ 75 Lm Roll",null,null,"RB92"]
["RB92-1503-001075","15mm ACM Flat Spline D/S MP-HR TAPE B/S 75 Lm Roll",null,null,"RB92"]
["RB93-0443-000580","S45 / LIGHT T-SPLINE Alum. Tube ∙ O.D 43mm x 5.8Lm",null,null,"RB93"]
["RB93-0444-000580","S45 / STD T-SPLINE Alum. Tube ∙ O.D 44mm x 5.8 Lm",null,null,"RB93"]
["RB93-0449-000580","S45 / HD T-SPLINE Alum. Tube ∙ O.D 49mm x 5.8 Lm",null,null,"RB93"]
["RB93-6443-000580","S45 / LGT T-SPLINE Tube ∙ O.D 43mm x 5.8 Lm M/TAPE",null,null,"RB93"]
["RB93-6444-000580","S45 / STD T-SPLINE Tube ∙ O.D 44mm x 5.8 Lm M/TAPE",null,null,"RB93"]
["RB93-6449-000580","S45 / HD T-SPLINE Tube ∙ O.D 49mm x 5.8 Lm M/TAPE",null,null,"RB93"]
["RC01-0101-000480","CF Cassette 90 Back - 4.8m length",null,null,"RC01"]
["RC01-0102-069480","CF Cassette 90 Round Cover - 4.8m length",null,null,"RC01"]
["RC01-0103-069480","CF Cassette 90 Square Cover - 4.8m length",null,null,"RC01"]
["RC02-0101-338090","CF Cassette 90 End Plate Set + Screws",null,null,"RC02"]
["RC02-0102-069090","CF Cassette 90 Round Cover Set",null,null,"RC02"]
["RC02-0103-069090","CF Cassette 90 Square Cover Set",null,null,"RC02"]
["RC02-0203-001090","Easy Spring Wand Guide CF90 | RH & LH",null,null,"RC02"]
["RC03-0101-069040","CF Fascia 90 Bracket - 40mm",null,null,"RC03"]
["RC03-1001-025090","CF Cassette 90 Mounting Bracket",null,null,"RC03"]
["RC03-1002-025090","CF Cassette 90 Face Fix Mounting Bracket",null,null,"RC03"]
["RC91-0101-069580","CF dim-OUT Side Guide – 2 Piece Set - 5.8m length",null,null,"RC91"]
["RC91-0201-050000","CF dim-OUT Side Guide Side Guide Lock",null,null,"RC91"]
["RC91-0302-338000","CF Cassette Side Guide Ear",null,null,"RC91"]
["RC91-1001-069000","CF dim-OUT Side Guide Bottom Cap + screws",null,null,"RC91"]
["RC91-1002-069000","CF dim-OUT Side Guide Funnel & Screw Set",null,null,"RC91"]
["RCBIHB16",{"$error":"#N/A"},null,null,"RCBI"]
["RTEA-4T05-000580","Rollease Tube + M/P Tape | 38mm (1 1/2\") x 5.8m",null,null,"RTEA"]
["RTEA4T16","Tube Aluminum 1-1/2\" x 16' Taped",null,null,"RTEA"]
["S45",{"$error":"#N/A"},null,null,"S45"]
["SB06-0201-020580","F4115 FLAT Heavy Duty Weight Bar 41 x 15mm x 5.8Lm",null,null,"SB06"]
["SB06-0210-069000","F4115 FLAT Weight Bar - End Cap",null,null,"SB06"]
["SB20-0202-075100","Cassette 100 Mounting Bracket White",null,null,"SB20"]
["SB20-0303-075120","End Cap Cassette 120",null,null,"SB20"]
["SB20-0304-0490",{"$error":"#N/A"},null,null,"SB20"]
["SB20-0304-075490",{"$error":"#N/A"},null,null,"SB20"]
["SB20-0503-025000",{"$error":"#N/A"},null,null,"SB20"]
["SB20-0504-025490",{"$error":"#N/A"},null,null,"SB20"]
["SB91-0005-001100","Bubble Seal SMALL - 5mm x 100 metre roll",null,null,"SB91"]
["SB91-0011-050500","Fabric Brush T Slot Fit 5mm x 4.8mm | 500 Lm Roll",null,null,"SB91"]
["SL01-0306-069040","LX Skyline Bracket | 40mm projection",null,null,"SL01"]
["SL01-0306-069055","LX Skyline Bracket | 55mm projection",null,null,"SL01"]
["SLB660W","Skyline Bracket | Standard | 38mm",null,null,"SLB6"]
["SLBCW","Skyline Bracket Cover | Standard | 38mm",null,null,{"$f":"LEFT(A130,4)","v":"SLBC"}]
["SLFBKT3W","Skyline Fascia Bracket 75mm",null,null,"SLFB"]
["SLFBKT4W","Skyline Fascia Bracket 100mm (4\")",null,null,"SLFB"]
["SlFBKTCLP4","Skyline Bracket Clip",null,null,"SlFB"]
["SLFCVR4W","Skyline Bracket Cover 100mm (4\")",null,null,"SLFC"]
["SLNB660W","Skyline Bracket | Narrow | 38mm",null,null,"SLNB"]
["SLNBC660W","Skyline Bracket Cover | Narrow | 38mm (1-1/2\")",null,null,"SLNB"]
["SLPEHD53W","Skyline Pin End | Heavy Duty | 38mm (1-1/2\")",null,null,"SLPE"]
["SLPEV653W","Skyline Pin End | 38mm (1-1/2\")",null,null,"SLPE"]
["SLSECW","Fascia 76mm Bracket Cover | Square",null,null,"SLSE"]
["SLSF4A16",{"$error":"#N/A"},null,null,"SLSF"]
["SLSF4W16","Fascia 100mm (4\") Panel | Square",null,null,"SLSF"]
["SLSFA16","Fascia 76mm Panel | Square",null,null,"SLSF"]
["SLSFW16","Fascia 76mm Panel | Square",null,null,"SLSF"]
["SS31-5991-050944","M4 x 4mm Grub Screw",null,null,"SS31"]
["SS91-5241-050500","RIBBED Round Spline | 4.1mm x 500mt Roll",null,null,"SS91"]
["SS91-5246-050300","RIBBED Round Spline | 4.6mm x 300mt Roll",null,null,"SS91"]
["SS91-5246-050500",{"$error":"#N/A"},null,null,"SS91"]
["TAPE36",{"$error":"#N/A"},null,null,"TAPE"]
["V2BKT","\"2\"\" Traversing Lift Set 2\"\"Mounting Bracket Zinc",null,null,"V2BK"]
["VB05-0301-025300","VB05 OVAL Steel Tiltrod 5.00 x 7.5mm x 3mt Length",null,null,"VB05"]