{"text_format":"1","workbook":"xlsx","n_sheets":9,"sheets":["0. Intro","Inputs","BoM","Ctrl_Selections","Ctrl_Lists","Ctrl_Deductions","Ctrl_Recommendations","Item List","Sheet1"],"not_rendered":{"charts":0,"images":4,"macros":1,"external_links":0,"defined_names":134,"comments":4,"pivot_tables":0},"unopened":[],"bounds":{"document_bytes":16777216,"sheet_cells":100000,"rows_first":2000,"rows_last":500,"rows_between":2000,"halvings":0,"cell_chars":16384,"cell_head_chars":4096},"cells_cut":0,"cells_raw":0,"read":"whole","date_system":"1900"}

{"sheet":"0. Intro","index":0,"n_rows":27,"n_cols":5,"rows_kept":27,"cut":false,"hidden":false,"merged":[[3,1,5,16]]}
[]
[null,"If you are seeing this page, it means Excel Macro's have not been enabled. "]
[]
[null,"Excel Macros provide improved functionality for this file, and it will not work properly unless they are enabled. "]
[]
[]
[]
[null,"This may be caused by one of the following warnings:"]
[null,null,"Follow the steps below each warning to enable Macros."]
[]
{"$rows_left_out":18}
{"sheet":"Inputs","index":1,"n_rows":57,"n_cols":17,"rows_kept":57,"cut":false,"hidden":false,"merged":[[47,11,47,15],[45,11,45,15],[46,11,46,15],[11,15,12,15]]}
[1,1,"1",1,1,1,1,1,1,1]
["macro disabled",false]
["Row # of First Flag",null,{"$f":"ROW(INDEX(A7:OFFSET(A7,options_count-1,0),MATCH(FALSE,ISBLANK(A7:OFFSET(A7,options_count-1,0)),0)))","v":9}]
["Number of Options",null,{"$f":"COUNTA(L7:L40)","v":33},null,null,null,null,null,null,null,null,null,null,null,"Release"]
[{"$f":"SUM(A7:OFFSET(A7,options_count-1,0))","v":15},{"$f":"COUNTIF(B7:OFFSET(B7,options_count-1,0),1)","v":0},{"$f":"SUM(C7:OFFSET(C7,options_count-1,0))","v":1},null,null,null,null,null,{"$f":"\"Col: \" &COLUMN(I6)","v":"Col: 9"},{"$f":"\"Col: \" &COLUMN(J6)","v":"Col: 10"},null,null,null,null,null,"Last Updated: 30-August-2023"]
["Must Fill Flag","Check error Flag","Check Fill Flag","Input Precedent (SHOW)","Check For_1","Check For_2","Check For_3","Row Outcome",null,null,null,"OPTIONS","INPUT",null,"INSTRUCTIONS","COMMENTS ","RECOMMENDATIONS"]
[null,null,null,null,null,null,null,null,null,null,null,"Customer's Name",null,null,"← Enter Customer's Name (Optional)"]
[null,null,null,null,null,null,null,null,null,null,null,"Customer's Job Number",null,null,"← Enter Job Number (Optional)"]
[1,null,{"$f":"IF(AND(LEN(M9)>0,H9<>\"HIDE\"),1,0)","v":0},null,null,null,null,null,null,null,null,"Region",null,{"$f":"HYPERLINK(\"#\"&ADDRESS(ROW(),COLUMN()-1),CHAR(128))","v":"€"},"← Select Region (AU/US)"]
[1,null,0,null,null,null,null,null,null,null,null,"Units",null,{"$f":"HYPERLINK(\"#\"&ADDRESS(ROW(),COLUMN()-1),CHAR(128))","v":"€"},"← Select Units (Metric/Imperial)"]
{"$rows_left_out":48}
{"sheet":"BoM","index":2,"n_rows":256,"n_cols":69,"rows_kept":256,"cut":false,"hidden":true,"merged":[[2,2,6,2],[2,24,6,24],[2,32,6,32],[8,25,8,30],[9,13,9,14],[9,15,9,16],[8,3,8,21],[9,3,9,4],[9,5,9,6],[9,7,9,8],[9,9,9,10],[9,11,9,12],[237,53,238,53],[8,33,8,47],[8,57,9,57],[8,56,9,56],[8,55,9,55],[8,53,9,53],[9,44,10,44],[235,53,236,53],[235,55,236,55],[237,55,238,55],[13,33,13,41],[242,53,242,62],[241,53,241,62],[8,68,9,68],[8,62,9,62],[8,58,9,58],[8,67,9,67],[8,59,9,59],[8,66,9,66],[8,65,9,65],[8,60,9,60],[8,63,9,63],[8,61,9,61],[235,65,236,65],[235,66,236,66],[237,65,238,65],[237,66,238,66]]}
[1,1,1,1,1,1,1,1,1,"1",1,1,1,1,1,1,1,1,1,1,1,1,1,1,1,1,1,1,1,1,1,1,1,1,1,1,1,1,1,1,1,1,1,1,1,1,1,1,1,1,1,1,null,null,"1","1",null,1,1,1,1,1,null,null,1,1,null,1,{"$f":"IF(i_Location=\"AU\",\"\",1)","v":1}]
[null,null,null,null,null,null,null,null,null,null,null,null,null,null,null,null,null,null,null,null,null,null,null,null,null,null,null,null,null,null,null,null,null,null,null,null,null,null,null,null,null,null,null,null,null,null,null,null,null,"SHOW"]
[null,null,"CONDITIONS",null,null,null,null,null,null,null,null,null,null,null,null,null,null,null,null,null,null,null,null,null,"QTY",null,null,null,null,null,null,null,"COLOURS",null,null,null,null,null,null,null,null,null,null,null,null,null,null,null,null,"SHOW",null,null,null,null,null,null,"Customers Name:",null,null,null,null,null,{"$f":"IF(i_CustName=0,\"\",i_CustName)","v":""}]
[null,null,null,null,null,null,null,null,null,null,null,null,null,null,null,null,null,null,null,null,null,null,null,null,null,null,null,null,null,null,null,null,null,null,null,null,null,null,null,null,null,null,null,null,null,null,null,null,null,"SHOW",null,null,null,null,null,null,"Job Number:",null,null,null,null,null,{"$f":"IF(i_JobNumber=0,\"\",i_JobNumber)","v":""}]
[null,null,null,null,null,null,null,null,null,null,null,null,null,null,null,null,null,null,null,null,null,null,null,null,null,null,null,null,null,null,null,null,null,null,null,null,null,null,null,null,null,null,null,null,null,null,null,null,null,"SHOW",null,null,null,null,null,null,"Blind Width:",null,null,null,null,null,{"$f":"i_Width","v":0},{"$f":"INDEX(T_UnitSelection[Units],MATCH(i_Units,T_UnitSelection[UnitSelection],0))","v":{"$error":"#N/A"}}]
[null,null,null,null,null,null,null,null,null,null,null,null,null,null,null,null,null,null,null,null,null,null,null,null,null,null,null,null,null,null,null,null,null,null,null,null,null,null,null,null,null,null,null,null,null,null,null,null,null,"SHOW",null,null,null,null,null,null,"Blind Drop:",null,null,null,null,null,{"$f":"i_Drop","v":0},{"$f":"INDEX(T_UnitSelection[Units],MATCH(i_Units,T_UnitSelection[UnitSelection],0))","v":{"$error":"#N/A"}}]
[null,null,null,null,null,null,null,null,null,null,null,null,null,null,null,null,null,null,null,null,null,null,null,null,null,null,null,null,null,null,null,null,null,null,null,null,null,null,null,null,null,null,null,null,null,null,null,null,null,"SHOW",null,null,null,{"$f":"i_ControlType&\", \"&IF(i_BoxShape<>\"\",i_BoxShape&\" \"&i_InstallationType,i_InstallationType)&\", \"&_xlfn.SINGLE(IF(i_DimOut=\"Yes\",\"Dim Out, \"&_xlfn.SINGLE(i_ControlSide),i_ControlSide))","v":", , "}]
[null,null,null,null,null,null,null,null,null,null,null,null,null,null,null,null,null,null,null,null,null,null,null,null,null,null,null,null,null,null,null,null,null,null,null,null,null,null,null,null,null,null,null,null,null,null,null,null,null,"SHOW"]
[null,null,null,"ROW HIDE/SHOW CONDITIONS",null,null,null,null,null,null,null,null,null,null,null,null,null,null,null,null,null,null,null,null,null,"QTY Modifiers",null,null,null,null,null,null,null,"Colour Selection",null,null,null,null,null,null,null,null,null,null,null,null,null,null,null,"SHOW",null,null,null,"PART NUMBER",null,"PART NUMBER (HIDDEN INPUT)","DESCRIPTION","Std Lengths (meters) NAV","CutList?","Deduction Type",{"$f":"\"Deduction Lookup (\"&INDEX(T_UnitSelection[Units],MATCH(i_Units,T_UnitSelection[UnitSelection],0))&\")\"","v":{"$error":"#N/A"}},"Deduc Type","CUT LENGTH","U.O.M","NAV","QTY (Base)","QTY","/m or /in Cost (Lookup)",{"$f":"\"Cost (\"&i_Currency&\")\"","v":{"$error":"#N/A"}}]
[null,null,"RowCtrl","Condition_1",null,"Condition_2",null,"Condition_3",null,"Condition_4",null,"Condition_5",null,"Condition_6",null,"Condition_7",null,null,null,null,null,null,null,null,null,"Links","Distance","Other Rules_1","Other Rules_x","QTY Factor.","Comments",null,null,null,null,null,null,null,null,null,null,null,null,"System Default",null,null,null,null,null,"SHOW",null,null,null,null,null,null,null,null,null,null,null,null,null,null,"UoM",null,null,"COST $$$"]
{"$rows_left_out":247}
{"sheet":"Ctrl_Selections","index":3,"n_rows":536,"n_cols":14,"rows_kept":536,"cut":false,"hidden":true,"merged":[[392,2,393,2],[392,3,393,3],[517,3,519,3],[517,2,519,2],[489,4,489,13],[491,2,492,2],[491,3,492,3],[502,3,502,13],[514,4,514,13],[423,3,424,3],[458,3,460,3],[461,3,462,3],[425,3,429,3],[425,2,429,2],[440,3,440,13],[364,2,369,2],[364,3,369,3],[290,3,290,13],[307,2,310,2],[303,4,303,13],[350,2,356,2],[350,3,356,3],[346,3,349,3],[357,3,363,3],[69,2,70,2],[69,3,70,3],[82,3,82,13],[121,4,121,13],[94,4,94,13],[96,2,98,2],[96,3,98,3],[109,3,109,13],[99,2,100,2],[99,3,100,3],[2,0,2,1],[33,4,33,13],[37,3,39,3],[275,3,277,3],[251,3,251,13],[200,3,202,3],[200,2,202,2],[272,4,272,13],[233,4,233,13],[235,2,239,2],[235,3,239,3],[123,2,126,2],[143,3,143,13],[158,2,161,2],[156,4,156,13],[158,3,161,3],[275,2,277,2],[162,2,165,2],[162,3,165,3],[197,2,199,2],[197,3,199,3],[182,3,182,13],[203,2,207,2],[203,3,207,3],[166,2,172,2],[243,3,244,3],[258,3,258,13],[127,2,130,2],[166,3,172,3],[131,2,135,2],[131,3,135,3],[195,4,195,13],[123,3,126,3],[127,3,130,3],[217,3,217,13],[408,3,408,13],[279,3,280,3],[390,4,390,13],[67,3,68,3],[5,4,5,13],[20,3,20,13],[7,2,8,2],[7,3,8,3],[52,3,52,13],[35,2,36,2],[35,3,36,3],[37,2,39,2],[65,4,65,13],[67,2,68,2],[528,3,528,13],[305,2,306,2],[344,4,344,13],[346,2,349,2],[376,3,376,13],[357,2,363,2],[327,3,327,13],[311,2,316,2],[452,4,452,13],[477,3,477,13],[454,2,457,2],[458,2,460,2],[461,2,462,2],[421,4,421,13],[423,2,424,2],[454,3,457,3]]}
[null,null,"=IF(INDIRECT(\"i_\"&SUBSTITUTE(D55,\" \",\"\")),0,\"No\") if a default value is required"]
[]
["Configuration Matrix"]
[]
[]
[null,null,"INPUT DEPENDENCIES","SELECTION OPTIONS","CONFIGURATIONS"]
[null,null,"Ref Position →",{"$f":"COUNTA(D8:D11)","v":1},{"$f":"SUM(COUNTIF(E8:E11,$C8:$C11))","v":0},{"$f":"SUM(COUNTIF(F8:F11,$C8:$C11))","v":0},{"$f":"SUM(COUNTIF(G8:G11,$C$198:$C$203))","v":0},{"$f":"SUM(COUNTIF(H8:H11,$C$198:$C$203))","v":0},{"$f":"SUM(COUNTIF(I8:I11,$C$198:$C$203))","v":0},{"$f":"SUM(COUNTIF(J8:J11,$C$198:$C$203))","v":0},{"$f":"SUM(COUNTIF(K8:K11,$C$198:$C$203))","v":0},{"$f":"SUM(COUNTIF(L8:L11,$C$198:$C$203))","v":0},{"$f":"SUM(COUNTIF(M8:M11,$C$198:$C$203))","v":0},{"$f":"SUM(COUNTIF(N8:N11,$C$198:$C$203))","v":0}]
[null,"Input Selection 2->",{"$f":"INDIRECT(\"i_\"&SUBSTITUTE(D8,\" \",\"\"))","v":0},"Location","AU","US"]
[null,"Input Selection 3->",null,null,"EU"]
[]
{"$rows_left_out":527}
{"sheet":"Ctrl_Lists","index":4,"n_rows":57,"n_cols":27,"rows_kept":57,"cut":false,"hidden":true,"merged":[[20,25,20,26],[1,0,1,1],[5,9,5,10],[6,9,6,10],[19,13,19,15],[19,8,19,11],[20,8,20,11],[5,19,5,21],[6,19,6,21]]}
[]
["List Summary",null,null,null,null,null,null,null,null,null,null,null,null,null,null,null,null,null,null,"L_SelectUnitsSingle"]
[null,null,null,"i_Currency",null,null,null,null,null,null,null,null,null,null,"o_nScreens",null,null,null,null,{"$f":"IF(i_Units=\"Metric\",\"Imperial\",\"Metric\")","v":"Metric"}]
[null,null,null,{"$f":"INDEX(T_Currency[Currency],MATCH(i_Location,T_Location[Location],0))","v":{"$error":"#N/A"}},null,null,null,null,null,null,null,null,null,null,{"$f":"IF(OR(i_LinkedScreens=\"No\",i_LinkedScreens=\"\"),1,i_nScreens)","v":1},null,null,null,null,{"$f":"IF(i_Units=\"\",\"Imperial\",0)","v":"Imperial"}]
[null,"Activate List ->"]
[null,"Table/List Name (MUST MATCH) ->",{"$f":"\"T_\"&SUBSTITUTE((OFFSET(C6,2,0)),\" \",\"\")","v":"T_Installation"},{"$f":"\"T_\"&SUBSTITUTE((OFFSET(D6,2,0)),\" \",\"\")","v":"T_Currency"},{"$f":"\"T_\"&SUBSTITUTE((OFFSET(E6,2,0)),\" \",\"\")","v":"T_Location"},{"$f":"\"T_\"&SUBSTITUTE((OFFSET(F6,2,0)),\" \",\"\")","v":"T_BlindType"},"T_SystemType","T_InstallationType","T_ControlType","T_FixingOptions",null,"T_ControlSide","T_YesNo","T_BoxShape","T_nScreens",{"$f":"\"T_\"&SUBSTITUTE((OFFSET(P6,2,0)),\" \",\"\")","v":"T_CassetteBrush"},{"$f":"\"T_\"&SUBSTITUTE((OFFSET(Q6,2,0)),\" \",\"\")","v":"T_wbBallast"},{"$f":"\"T_\"&SUBSTITUTE((OFFSET(R6,2,0)),\" \",\"\")","v":"T_DimOut"},"T_Linked",{"$f":"\"T_\"&SUBSTITUTE((OFFSET(T6,2,0)),\" \",\"\")","v":"T_UnitSelection"},null,null,"T_FabricWrap","T_SheetStatus","T_FabricOrientation"]
[null,"List Test ->"]
[null,"Header Name ->","Installation","Currency","Location","Blind Type","System Type","Installation Type","Control Type","Fixing Options","Outcome","Control Side","YesNo","Box Shape","nScreens","CassetteBrush","wbBallast","Dim Out","Linked","UnitSelection","Units","Fabric","FabricWrap","Status","FabricOrientation"]
[null,null,"Internal","AUD","AU","Single",null,"Cassette 100","Easy Spring Wand","Top/Face Fix","No Clip","Left Hand","Yes","Round",2,"Yes","Yes","Yes","No","Metric","mm","gsm","Yes","Development","Standard / Back / Under Roll"]
[null,null,"External","USD","US","Dual",null,"Cassette 120","Easy Spring Ultra (ESU)","Top Fix w/Mounting Bracket","Top Fix","Right Hand","No","Square",3,"No","No","No","Easy Link","Imperial","in","oz/yd²","No","Release","Reverse / Front / Over Roll"]
{"$rows_left_out":48}
{"sheet":"Ctrl_Deductions","index":5,"n_rows":89,"n_cols":50,"rows_kept":89,"cut":false,"hidden":true,"merged":[[2,20,2,49],[6,18,9,18],[10,18,12,18],[4,18,5,18],[6,19,9,19],[4,19,5,19],[10,19,12,19]]}
[]
[]
[null,null,null,null,null,null,null,null,null,null,null,null,null,null,null,null,null,null,"INPUT DEPENDENCIES","SELECTION OPTIONS","CONFIGURATIONS"]
[null,null,null,null,null,null,null,null,null,null,null,null,null,null,null,null,null,null,"Ref Position →",{"$f":"MAX(U4:AX4)","v":0},{"$f":"SUM(COUNTIF(U5:U15,$S$5:$S$15))","v":0},{"$f":"SUM(COUNTIF(V5:V15,$S$5:$S$15))","v":0},{"$f":"SUM(COUNTIF(W5:W15,$S$5:$S$15))","v":0},{"$f":"SUM(COUNTIF(X5:X15,$S$5:$S$15))","v":0},{"$f":"SUM(COUNTIF(Y5:Y15,$S$5:$S$15))","v":0},{"$f":"SUM(COUNTIF(Z5:Z15,$S$5:$S$15))","v":0},{"$f":"SUM(COUNTIF(AA5:AA15,$S$5:$S$15))","v":0},{"$f":"SUM(COUNTIF(AB5:AB15,$S$5:$S$15))","v":0},{"$f":"SUM(COUNTIF(AC5:AC15,$S$5:$S$15))","v":0},{"$f":"SUM(COUNTIF(AD5:AD15,$S$5:$S$15))","v":0},{"$f":"SUM(COUNTIF(AE5:AE15,$S$5:$S$15))","v":0},{"$f":"SUM(COUNTIF(AF5:AF15,$S$5:$S$15))","v":0},{"$f":"SUM(COUNTIF(AG5:AG15,$S$5:$S$15))","v":0},{"$f":"SUM(COUNTIF(AH5:AH15,$S$5:$S$15))","v":0},{"$f":"SUM(COUNTIF(AI5:AI15,$S$5:$S$15))","v":0},{"$f":"SUM(COUNTIF(AJ5:AJ15,$S$5:$S$15))","v":0},{"$f":"SUM(COUNTIF(AK5:AK15,$S$5:$S$15))","v":0},{"$f":"SUM(COUNTIF(AL5:AL15,$S$5:$S$15))","v":0},{"$f":"SUM(COUNTIF(AM5:AM15,$S$5:$S$15))","v":0},{"$f":"SUM(COUNTIF(AN5:AN15,$S$5:$S$15))","v":0},{"$f":"SUM(COUNTIF(AO5:AO15,$S$5:$S$15))","v":0},{"$f":"SUM(COUNTIF(AP5:AP15,$S$5:$S$15))","v":0},{"$f":"SUM(COUNTIF(AQ5:AQ15,$S$5:$S$15))","v":0},{"$f":"SUM(COUNTIF(AR5:AR15,$S$5:$S$15))","v":0},{"$f":"SUM(COUNTIF(AS5:AS15,$S$5:$S$15))","v":0},{"$f":"SUM(COUNTIF(AT5:AT15,$S$5:$S$15))","v":0},{"$f":"SUM(COUNTIF(AU5:AU15,$S$5:$S$15))","v":0},{"$f":"SUM(COUNTIF(AV5:AV15,$S$5:$S$15))","v":0},{"$f":"SUM(COUNTIF(AW5:AW15,$S$5:$S$15))","v":0},{"$f":"SUM(COUNTIF(AX5:AX15,$S$5:$S$15))","v":0}]
[null,null,null,null,null,null,null,null,null,null,null,null,null,null,null,null,null,null,{"$f":"i_ControlType","v":0},"Control Type","Easy Spring Wand","Easy Spring Wand","Easy Spring Wand","Easy Spring Wand","Easy Spring Wand","Easy Spring Wand","Easy Spring Ultra (ESU)","Easy Spring Ultra (ESU)","Easy Spring Ultra (ESU)","Easy Spring Ultra (ESU)","Easy Spring Ultra (ESU)","Easy Spring Ultra (ESU)","Easy Spring Ultra - Skyline","Easy Spring Ultra - Skyline","Easy Spring Ultra - Skyline","Easy Spring Ultra - Skyline","Easy Spring Ultra - Skyline","Easy Spring Ultra - Skyline","Easy Spring Ultra - Skyline","Easy Spring Ultra - Skyline"]
[]
[null,null,null,null,null,null,null,null,null,null,null,null,null,null,null,null,null,null,{"$f":"i_InstallationType","v":0},"Installation","Cassette 120","Cassette 110","CF90 Cassette","Open","Open","P95 Semi Cassette","Cassette 120","Cassette 110","CF90 Cassette","Open","Open","P95 Semi Cassette","Open","Open","Skyline Fascia","Skyline Fascia","Cassette 100","CF90 Cassette","P95 Semi Cassette","Cassette 110"]
[null,null,null,null,null,null,null,null,null,null,null,null,null,null,null,null,null,null,null,null,"Cassette 100",null,"CF90 Fascia","Mounting Rail",null,null,"Cassette 100",null,"CF90 Fascia","Mounting Rail",null,null,null,"Mounting Rail",null,null,"Cassette 120","CF90 Fascia"]
[]
[]
{"$rows_left_out":80}
{"sheet":"Ctrl_Recommendations","index":6,"n_rows":112,"n_cols":129,"rows_kept":112,"cut":false,"hidden":true,"merged":[[3,39,3,59],[5,40,5,59],[3,62,3,82],[40,40,40,59],[2,39,2,128],[3,85,3,105],[3,108,3,128],[5,18,5,37],[40,63,40,82],[40,86,40,105],[40,109,40,128],[5,63,5,82],[5,86,5,105],[35,39,35,128],[36,39,36,59],[36,62,36,82],[36,85,36,105],[36,108,36,128],[5,109,5,128],[1,7,2,7],[42,1,42,2],[50,1,50,3],[1,2,1,3],[27,4,27,6],[34,4,34,6],[1,4,1,5],[1,6,2,6],[14,1,14,3],[67,1,67,2],[60,1,60,2],[9,1,10,1],[15,2,15,3],[16,2,16,3]]}
[]
[null,null,"Absolute Min",null,"Absolute Max",null,{"$f":"\"Current Value (\"&i_Units&\")\"","v":"Current Value ()"},"Outside Specs\n(0 = No, 1 = Yes)",null,"Warning Trigger","Warning ID","Warning Text"]
[null,null,"mm",{"$f":"\"Min (\"&i_Units&\")\"","v":"Min ()"},"mm",{"$f":"\"Max (\"&i_Units&\")\"","v":"Max ()"},null,null,null,null,"Warning1","Warning! Nominated blind size is outside allowable specifications based on Selections.               Refer Product Specifications for more details.",null,null,null,null,null,null,null,null,null,null,null,null,null,null,null,null,null,null,null,null,null,null,null,null,null,null,null,"Easy Spring Ultra"]
[null,"Width",{"$f":"IFERROR(VLOOKUP(i_ControlType,T_MinWidth,2,FALSE),0)","v":0},{"$f":"IF(i_Units=\"Metric\",C4,CONVERT(C4,\"mm\",\"in\"))","v":0},4101,{"$f":"IF(i_Units=\"Metric\",E4,CONVERT(E4,\"mm\",\"in\"))","v":161.45669291338584},{"$f":"i_Width","v":0},{"$f":"IF(AND(AND(i_Width<>\"\",i_Width>=0),OR(i_Width<MinWidth,i_Width>MaxWidth)),1,0)","v":0},null,null,"Warning2",{"$f":"\"Warning! Nominated blind size is outside system specifications. \"&\"                                                               Width Range: \"&INDIRECT(\"o_WidthRange\"&i_Units)&\"; \"&\"Maximum Drop: \"&INDIRECT(\"o_DropRange\"&i_Units)","v":{"$error":"#REF!"}},null,null,null,null,null,null,null,null,null,null,null,null,null,null,null,null,null,null,null,null,null,null,null,null,null,null,null,"RTEA4",null,null,null,null,null,null,null,null,null,null,null,null,null,null,null,null,null,null,null,null,null,null,"S45 LT",null,null,null,null,null,null,null,null,null,null,null,null,null,null,null,null,null,null,null,null,null,null,"S45 STD",null,null,null,null,null,null,null,null,null,null,null,null,null,null,null,null,null,null,null,null,null,null,"S45 HD"]
[null,"Drop",0,{"$f":"IF(i_Units=\"Metric\",C5,CONVERT(C5,\"mm\",\"in\"))","v":0},2501,{"$f":"IF(i_Units=\"Metric\",E5,CONVERT(E5,\"mm\",\"in\"))","v":98.464566929133852},{"$f":"i_Drop","v":0},{"$f":"IF(AND(AND(i_Drop<>\"\",i_Drop>=0),OR(i_Drop<MinDrop,i_Drop>MaxDrop)),1,0)","v":0},null,null,"o_LinkWarning","Warning! Link system must be selected, or reduce blind size.",null,null,null,null,null,null,null,null,null,null,null,null,null,null,null,null,null,null,null,null,null,null,null,null,null,null,null,null,null,{"$f":"IF(AND(o_BlindWidth/1000>AP7,o_BlindWidth/1000<=AQ7),1,0)","v":0},0,0,0,0,0,0,0,0,0,0,0,0,0,0,0,0,0]
[null,null,null,null,null,null,null,null,null,{"$f":"IF(o_BlindWidth>=o_MinWidthReqd,0,1)","v":{"$error":"#N/A"}},"o_BoosterWarning","Warning! Blind width too small for selected Booster.",null,null,1,"1.5\"",null,null,"Width (m)",null,null,null,null,null,null,null,null,null,null,null,null,null,null,null,null,null,null,null,null,null,"Width (m)",null,null,null,null,null,null,null,null,null,null,null,null,null,null,null,null,null,null,null,null,null,null,"Width (m)",null,null,null,null,null,null,null,null,null,null,null,null,null,null,null,null,null,null,null,null,null,null,"Width (m)",null,null,null,null,null,null,null,null,null,null,null,null,null,null,null,null,null,null,null,null,null,null,"Width (m)"]
[null,"Width Range",{"$f":"C4&\" mm - 4000 mm\"","v":"0 mm - 4000 mm"},{"$f":"ROUND(CONVERT(C4,\"mm\",\"in\"),2)&\" in - 157.50 in\"","v":"0 in - 157.50 in"},null,null,null,null,null,{"$f":"IF(AND(H4=0,I23<=o_BlindWidth),0,1)","v":{"$error":"#N/A"}},"o_BoosterTextRec",{"$f":"IF(J7=1,\"Warning! Blind width too small.\",\"*Recommended Booster Size: \"&o_BoosterRec&\", Estimated Pre-turns: \"&o_BoosterPreturnRec)","v":{"$error":"#N/A"}},null,null,2,"S45 LT",null,"Drop (m)",0.2,0.4,0.6,0.8,1,1.2,1.4,1.6,1.8,2,2.2000000000000002,2.4,2.6,2.8,3,3.2,3.4,3.6,3.8,4,null,"Drop (m)",0.2,0.4,0.6,0.8,1,1.2,1.4,1.6,1.8,2,2.2000000000000002,2.4,2.6,2.8,3,3.2,3.4,3.6,3.8,4,null,null,"Drop (m)",0.2,0.4,0.6,0.8,1,1.2,1.4,1.6,1.8,2,2.2000000000000002,2.4,2.6,2.8,3,3.2,3.4,3.6,3.8,4,null,null,"Drop (m)",0.2,0.4,0.6,0.8,1,1.2,1.4,1.6,1.8,2,2.2000000000000002,2.4,2.6,2.8,3,3.2,3.4,3.6,3.8,4,null,null,"Drop (m)",0.2,0.4,0.6,0.8,1,1.2,1.4,1.6,1.8,2,2.2000000000000002,2.4,2.6,2.8,3,3.2,3.4,3.6,3.8,4]
[null,"Drop Range","2400 mm","94.50 in",null,null,null,null,null,null,"Warning3","Warning! Selected Booster does not match recommendation - shade performance may not be optimal.",null,null,3,"S45 STD",null,0.1,0,1,1,1,1,1,1,1,1,1,1,1,2,3,4,4,0,0,0,0,null,0.1,0,"G.9",{"$f":"IF(AND(i_ControlType=\"Easy Spring Ultra (ESU)\",i_Tube=TEXT(1.5&CHAR(34),0)),\"A.11\",\"G.9\")","v":"G.9"},"A.11","B.14","B.15","B.16","B.17","B.18","B.18","B.19","C.11","E.12","E.12","E.13","E.13","E.14","E.14","E.15",0,null,null,0.1,0,"G.9","G.9","A.11","B.15","B.11","B.12","B.13","C.10","C.11","C.11","C.12","C.8","E.13","E.9","F.8","F.8","F.4","F.9","F.9",null,null,0.1,0,"G.9","G.9","A.11","B.15","B.16","B.17","B.13","C.10","C.11","C.7","C.12","C.8","C.13","E.14","F.8","F.8","F.9","F.9","F.9",null,null,0.1,0,"G.9","G.9","A.12","B.15","B.16","C.10","C.10","C.11","C.11","C.12","C.12","D.7","D.8","D.8","D.8","F.9","F.9","F.9","F.10"]
[null,null,null,null,null,null,null,null,null,null,null,null,null,null,4,"S45 HD",null,0.2,0,1,1,1,1,1,1,1,1,1,1,1,2,3,4,4,0,0,0,0,null,0.2,0,"G.9","G.9","A.11","B.14","B.15","B.16","B.17","B.18","B.18","B.19","C.11","E.12","E.12","E.13","E.13","E.14","E.14","E.15",0,null,null,0.2,0,"G.9","G.9","A.11","B.15","B.12","B.13","B.14","C.10","C.11","C.11","C.12","C.9","E.13","E.10","F.8","F.8","F.5","F.9","F.9",null,null,0.2,0,"G.9","G.9","A.11","B.15","B.16","B.17","B.14","C.10","C.11","C.8","C.12","C.9","C.13","E.14","F.8","F.8","F.9","F.9","F.9",null,null,0.2,0,"G.9","G.9","A.12","B.15","B.16","C.10","C.10","C.11","C.11","C.12","C.12","D.7","D.8","D.8","D.8","F.9","F.9","F.9","F.10"]
[null,"Blind Width","mm","in",null,null,null,null,null,null,null,null,null,null,null,null,null,0.3,0,1,1,1,1,1,1,1,1,1,1,1,2,3,4,4,0,0,0,0,null,0.3,0,"G.9","G.9","A.11","B.14","B.15","B.16","B.17","B.18","B.18","B.19","C.11","E.12","E.12","E.13","E.13","E.14","E.14","E.15",0,null,null,0.3,0,"G.9","G.9","A.11","B.15","B.12","B.13","B.14","C.10","C.11","C.11","C.12","C.9","E.13","E.10","F.8","F.8","F.5","F.9","F.9",null,null,0.3,0,"G.9","G.9","A.11","B.15","B.16","B.17","B.14","C.10","C.11","C.8","C.12","C.9","C.13","E.14","F.8","F.8","F.9","F.9","F.9",null,null,0.3,0,"G.9","G.9","A.12","B.15","B.16","C.10","C.10","C.11","C.11","C.12","C.12","D.7","D.8","D.8","D.8","F.9","F.9","F.9","F.10"]
{"$rows_left_out":103}
{"sheet":"Item List","index":7,"n_rows":159,"n_cols":8,"rows_kept":159,"cut":false,"hidden":true,"merged":[]}
["No.","Description","Colour Code","Colour Description","Base Unit of Measure","AU"]
["AW91-1501-050000","Fabric Brush T Slot Fit - 7 x 4.8mm ∙ 350 Lm roll","050","Black, Satin","METRE",1.59,null,"=INDEX('eBOM_ESUltra_ESWand-PriceList-02AUG22.xlsx'!Table1[Unit Price],MATCH(A2,'eBOM_ESUltra_ESWand-PriceList-02AUG22.xlsx'!Table1[No.],0))"]
["CREC100W","End Cap Cassette 100 White","075","White - US","PIECE",0]
["CRUSLB660",{"$error":"#N/A"},{"$error":"#N/A"},{"$error":"#N/A"},{"$error":"#N/A"},{"$error":"#N/A"},null,"CTRL+SHIFT+DOWN"]
["CRV100A",{"$error":"#N/A"},{"$error":"#N/A"},{"$error":"#N/A"},{"$error":"#N/A"},{"$error":"#N/A"}]
["CRV100W","Cassette 100 16' (4.87m) White","000","Mill Finish","LENGTH",0,null,"CTRL+D"]
["HB16A",{"$error":"#N/A"},{"$error":"#N/A"},{"$error":"#N/A"},{"$error":"#N/A"},{"$error":"#N/A"}]
["HB16U",{"$error":"#N/A"},{"$error":"#N/A"},{"$error":"#N/A"},{"$error":"#N/A"},{"$error":"#N/A"},null,"Remove formulas"]
["HB16W",{"$error":"#N/A"},{"$error":"#N/A"},{"$error":"#N/A"},{"$error":"#N/A"},{"$error":"#N/A"}]
["HBECW",{"$error":"#N/A"},{"$error":"#N/A"},{"$error":"#N/A"},{"$error":"#N/A"},{"$error":"#N/A"}]
{"$rows_left_out":150}
{"sheet":"Sheet1","index":8,"n_rows":150,"n_cols":9,"rows_kept":150,"cut":false,"hidden":true,"merged":[]}
["No.","Description",null,null,"LEFT,4",null,null,"TEXTJOIN",{"$f":"_xlfn.TEXTJOIN(\"*|\",TRUE,F2:F41)","v":"AW91*|CREC*|CRUS*|CRV1*|HB16*|HBEC*|HBIS*|HD82*|LSAD*|RB08*|RB09*|RB12*|RB41*|RB88*|RB91*|RB92*|RB93*|RC01*|RC02*|RC03*|RC91*|RCBI*|RTEA*|SB06*|SB20*|SB91*|SL01*|SLB6*|SLBC*|SLFB*|SLFC*|SLNB*|SLPE*|SLSE*|SLSF*|SS31*|SS91*|TAPE*|V2BK*|VB05"}]
["AW91-1501-050000","Fabric Brush T Slot Fit - 7 x 4.8mm ∙ 350 Lm roll",null,null,{"$f":"LEFT(A2,4)","v":"AW91"},"AW91",null,"NAV","AW91*|CREC*|CRUS*|CRV1*|HB16*|HBEC*|HBIS*|HD82*|LSAD*|RB08*|RB09*|RB12*|RB41*|RB88*|RB91*|RB92*|RB93*|RC01*|RC02*|RC03*|RC91*|RCBI*|RTEA*|SB06*|SB20*|SB91*|SL01*|SLB6*|SLBC*|SLFB*|SLFC*|SLNB*|SLPE*|SLSE*|SLSF*|SS31*|SS91*|TAPE*|V2BK*|VB05*"]
["CREC100W","End Cap Cassette 100 White",null,null,"CREC","CREC"]
["CRUSLB660",{"$error":"#N/A"},null,null,"CRUS","CRUS"]
["CRV100A",{"$error":"#N/A"},null,null,{"$f":"LEFT(A5,4)","v":"CRV1"},"CRV1"]
["CRV100W","Cassette 100 16' (4.87m) White",null,null,"CRV1","HB16"]
["HB16A",{"$error":"#N/A"},null,null,"HB16","HBEC"]
["HB16U",{"$error":"#N/A"},null,null,"HB16","HBIS"]
["HB16W",{"$error":"#N/A"},null,null,"HB16","HD82"]
["HBECW",{"$error":"#N/A"},null,null,"HBEC","LSAD"]
{"$rows_left_out":140}